{"text_format":"1","workbook":"xlsx","n_sheets":15,"sheets":["Software wijzigingen","Toelichting","Invoerblad","Ruimte 1","Ruimte 2","Ruimte 3","Ruimte 4","Ruimte 5","Ruimte 6","Ruimte 7","Ruimte 8","Ruimte 9","Ruimte 10","Tabellen","Tabel AA"],"not_rendered":{"charts":0,"images":3,"macros":1,"external_links":0,"defined_names":40,"comments":11,"pivot_tables":0},"unopened":[],"bounds":{"document_bytes":16777216,"sheet_cells":100000,"rows_first":2000,"rows_last":500,"rows_between":2000,"halvings":0,"cell_chars":16384,"cell_head_chars":4096},"cells_cut":0,"cells_raw":0,"read":"whole","date_system":"1900"}

{"sheet":"Software wijzigingen","index":0,"n_rows":33,"n_cols":2,"rows_kept":33,"cut":false,"hidden":false,"merged":[[0,0,0,1],[2,0,2,1]]}
["SOFTWARE WIJZIGINGEN REKENTOOL"]
[]
["Versie 1.6 d.d. 11-09-2024"]
[]
[1,"Foutmelding kringverwijzing opgelost "]
[null,"De berekening van de buitentemperatuur is een itteratieve berekening, de kringverwijzing waardoor een foutmelding ontstaat bij het openen van het rekenblad is opgelost."]
[]
[2,"Toelichtingstekst aangepast"]
[null,"In versie 1.3 zijn 10 verblijfsruimten invoerbaar met de keuze van type verblijfsruimte. Met deze aanpassing is de tekst onder toelichting “2x zo hoog is aangenomen als in de overige verblijfsruimten (VR1 t/m 5).” Blijven staan. Dit is aangepast naar “2x zo hoog is aangenomen als in de andere verblijfsruimten.” "]
[]
[3,"Toelichting toegevoegd oppervlak type raamvlak"]
[null,"In de rekenbladen van de ruimten kunnen 2 typen ramen worden ingevoerd, het is niet noodzakelijk elk raam apart in te voeren. Doorgaans zijn alle typen ramen in een woning gelijk en kan het raamoppervlak  (glas + kozijn) met dezelfde U- en GGL-waarden per gevel, per ruimte bij elkaar worden opgeteld.\n\nTevens bij het invoerveld in de rekenbladen de toelichting gegeven: \n“Voer hier de som van het raamoppervlak (glas+kozijn) in per type raam (gelijke U- en GGL-waarde).\n Per gevel kunnen 2 type ramen worden ingevoerd.”"]
[]
[4,"Bepaling buitenluchttemperatuur maatgevende ruimte tijdstip max koellast Θe aangepast "]
[null,"Voor de bepaling van de maatgevende buitentemperatuur werd gebruikt gemaakt van x.zoeken. Dit wordt niet ondersteunt door Excel 2019 of oudere versies. De formule is aangepast."]
[]
[5,"Beschaduwing bij glasvlak type 2 wordt niet goed berekend."]
[null,"De verwijzing naar de Oriëntatie van glasvlak 2 was niet correct ingevoerd. Dit is opgelost"]
[]
[6,"De beschaduwingsreductiefactor de waarde vanuit de NTA8800 niet altijd goed wordt overgenomen. Bijvoorbeeld;\n  - Oriëntatie: Zuid\n  - Relatieve breedte (Bb) = 0,50\n  - Beschaduwingsreductiefactor volgens de rekentool 1,00\n  - Beschaduwingsreductiefactor volgens de NTA8800 = 0,90"]
[null,"Fout in de procedure dit is aangepast."]
[]
[7,"Ruimtenaam ruimte 6 wordt niet goed weergegeven"]
[null,"Formule aangepast "]
[]
[8,"Bij meerdere glasoppervlakken wordt het maatgevende tijdstip niet goed bepaald zodra noord het grootste glasoppervlak heeft."]
[null,"Het glas oppervlak op noord telt niet meer mee in het bepalen van het maatgevende tijdstip"]
[]
[9,"Bij de zontoetredingsfactor werdt de Ggl;wi;k;C;juli gevraagd i.p.v. Ggl;n;wi;k;C;juli zoals deze in de BENG berekening wordt ingevoerd."]
[null,"Aangepast in rekentool waarbij de factor 0,9 direct verwerkt wordt in het resultaat inclusief de afronding naar beneden op veelvoud van 0,05 conform de bepalingsmethode 7.6.6.1.2  van NTA8800:2024. Het productkenmerk wordt dus ingevoerd bij de GGL waarde."]
[]
[10,"Forfaitaire waarden voor de reductiefactor voor de totale zontoetredingsfactor, voor uitvalschermen en knikarmschermen is toegevoegd"]
[null,"De gewogen fractie van de tijd dat de zonwering in gebruik is voor handbediende zonwering (tabel 7.7) is niet meegenomen in de berekening omdat het uitgangspunt van Bijlage AA berekening is dat de zonwering altijd wordt gebruikt."]

{"sheet":"Toelichting","index":1,"n_rows":22,"n_cols":4,"rows_kept":22,"cut":false,"hidden":false,"merged":[[13,1,13,3],[0,0,0,4],[4,1,4,3],[19,1,19,3],[2,1,2,3],[3,1,3,3],[5,1,5,3],[7,1,7,3],[8,1,8,3],[11,1,11,3],[10,1,10,3]]}
["TOELICHTING REKENTOOL VEREENVOUDIGDE BEPALINGSMETHODE KOELBEHOEFTE (BIJLAGE AA NTA 8800:20xx)"]
[]
[null,"Achtergrond"]
[null,"De berekeningen in deze tool volgen bijlage AA van NTA 8800:20xx. Een beschrijving van de berekening, en een nadere toelichting op de invoervelden is beschreven in NTA 8800:20xx.\nUitgangspunt in dit rekenblad is dat een woning niet opgesplitst is in meerdere rekenzones en dus uit één rekenzone bestaat.\nMocht een woning toch uit meerdere (gekoelde) rekenzones bestaan dan kan de volgende pragmatische aanpak worden gevolgd: voer alle (verblijfs)ruimten van de (gekoelde) rekenzones van de woning in. De luchtstromen van de verschillende gekoelde rekenzones worden bij elkaar opgeteld en ingevuld bij ‘1.2 Luchtstromen verwarming’ in het tabblad ‘Invoerblad’. \nOnder ‘1.3 Bezetting’ wordt de gebruiksoppervlakte van de gezamenlijke gekoelde rekenzones ingevuld."]
[null,"Invoer raamoppervlakken"]
[null,"In de rekenbladen van de ruimten kunnen 2 typen ramen worden ingevoerd, het is niet noodzakelijk elk raam apart in te voeren.\nDoorgaans zijn alle typen ramen in een woning gelijk en kan het raamoppervlak  (glas + kozijn) met dezelfde U- en GGL-waarden per gevel, per ruimte bij elkaar worden opgeteld. "]
[]
[null,"Woonvertrek"]
[null,"Een woonvertrek is een verblijfsruimte die bedoeld zijn of in gebruik zijn als woonkamer, keuken en/of eetkamer. In bijlage AA wordt hier onderscheid in gemaakt omdat het aannemelijk is dat de bewoners samen komen in deze ruimten en daardoor de interne warmtelast 2x zo hoog is aangenomen als in de andere verblijfsruimten."]
[]
[null,"Andere verblijfsruimten"]
[null,"Een andere verblijfsruimten is een verblijfsruimte anders dan de woonkamer, keuken en/of eetkamer."]
[]
[null,"Verklaring gebruike kleuren"]
[null,"Invoerveld"]
[null,"Titel veld"]
[null,"Resultaat veld"]
[null,"(sub) Totaal veld"]
[]
[null,"Versie rekentool"]
[null,{"$f":"'Software wijzigingen'!A3","v":"Versie 1.6 d.d. 11-09-2024"}]
[null,"Versie 2.2 d.d. 16-12-2024",null,"TEST VERSIE waarbij de volgende wijzigingen zijn aangebracht:\nHerijken van de opvallende zonnestraling, Updaten van de routine om het tijdstip te bepalen waarop de maximale koellast wordt verwacht, Herijken van de ‘vaste aftrek’ van 35 W/m2."]

{"sheet":"Invoerblad","index":2,"n_rows":103,"n_cols":22,"rows_kept":103,"cut":false,"hidden":false,"merged":[[69,5,69,13],[70,5,70,13],[63,5,63,13],[79,0,80,20],[74,5,74,13],[66,5,66,13],[67,5,67,13],[65,5,65,13],[72,0,72,20],[26,4,26,15],[34,4,34,15],[35,4,39,15],[64,5,64,13],[68,5,68,13],[62,5,62,13],[61,5,61,13],[59,0,59,20],[41,0,41,20],[27,4,32,15],[10,0,10,20],[2,0,2,20],[0,0,0,20],[1,0,1,20],[4,1,4,5],[6,1,6,5],[5,1,5,2],[7,1,7,2],[8,1,8,5]]}
["REKENTOOL VEREENVOUDIGDE BEPALINGSMETHODE KOELBEHOEFTE (BIJLAGE AA NTA 8800:20xx)"]
["DISCLAIMER: De rekentool is gebaseerd op Bijlage AA van NTA8800:20xx - Energieprestatie van gebouwen - Bepalingsmethode.\nResultaten kunnen worden gebruikt in de aanvraag omgevingsvergunning om aan te tonen dat het risico op oververhitting voldoende is beperkt.\n\n  De bepalingsmethode in bijlage AAis afgeleid van een reguliere koellastberekening. Deze methode is uitsluitend bedoeld om te toetsen of een woning of bouwplan volgens \nde eisen van de bouwregelgeving het risico op oververhitting in woningen en appartementen in voldoende mate beperkt. \nDeze methode is niet bedoeld en niet geschikt als vervanging voor een dimensioneringsmethode voor de daadwerkelijk te installeren koelcapaciteit.\n\nDe rekentool is ontwikkeld door Nieman Raadgevende Ingenieurs in opdracht van de Rijksdienst voor Ondernemend Nederland (RVO).\nAan de rekentool kunnen geen rechten worden ontleend. Hoewel dit instrument met de grootst mogelijke zorg is samengesteld kan RVO\n geen enkele aansprakelijkheid aanvaarden voor schade als gevolg van eventuele onjuistheden en/of uitvoering of gebruik van het instrument."]
["PROJECTGEGEVENS"]
[]
["Project"]
["Projectnummer"]
["Opdrachtgever"]
["Datum"]
["Omschrijving"]
[]
["BENG GEGEVENS"]
[]
["1.0 Algemeen"]
["Bouwjaar","vanaf 2015"]
["Is meer dan 50% van de gebouwschil aantoonbaar nageisoleerd?","Nee"]
["Factor thermische isolatie ondoorzichtige delen f;iso",{"$f":"o_F_Iso(B14,B15)","v":2.2000000000000002}]
["Orientatie voorzijde woning ","Noord"]
["Orientatiehoek voorzijde woning Ƴ",{"$f":"o_OrientatiehOEK(B17)","v":0}]
[]
[]
[]
[]
[]
[]
[]
[]
["1.2 Luchtstromen verwarming",null,null,null,"Toelichting"]
["Infiltratie in maand juli q;v;eff;lea;in",32.326270960000002,"m³/h",null,"Haal de luchtstromen uit de NTA8800 software. Deze waarden zijn terug te vinden in de CSV-exportfiles die vanuit de software beschikbaar zijn. \n\nBij een BENG-berekening op woongebouw-niveau worden de luchtvolumestromen niet per appartement gegeven. In dat geval moet, naar inzicht van de adviseur, het debiet worden bepaald. Dat kan bijvoorbeeld door het totale debiet uit de BENG-berekening van het woongebouw naar rato van de gebruiksoppervlakte over de individuele appartementen te verdelen of door een aparte BENG-berekening op te stellen van het appartement waarvoor de bijlage AA berekening wordt gemaakt."]
["Natuurlijke toevoer in maand juli q;v;eff;vent;in",0,"m³/h"]
["Mechanische toevoer in maand juli q;v;mech;in",220.18357889999999,"m³/h"]
[]
[]
[]
[]
["1.3 Bezetting",null,null,null,"Toelichting"]
["Gebruiksoppervlak rekenzone A;g",145,"m²",null,"Haal het gebruiksoppervlak A;g uit de NTA8800 software. Uitgangspunt in deze rekentool is dat er één rekenzone per woning is."]
["Aantal woonfuncties in de rekenzone",1,"stuks"]
["Gemiddelde bezetting per woonfunctie Np;woon;zi",{"$f":"IF(B36/B37<=30,1,IF(B36/B37<=100,2.28-1.28/70*(100-B36/B37),1.28+0.01*(B36/B37)))","v":2.73},"personen"]
["Interne warmtelast Pint;zi",{"$f":"180*B38*B37","v":491.4},"W"]
["Rekenwaarde internewarmtelast qint;calc;zi",{"$f":"IFERROR(B39/(SUMIF(B46:T46,\"Woonvertrek\",B47:T47)*2+SUMIF(B46:T46,\"Andere verblijfsruimte\",B47:T47)),0)","v":3.2672872340425534},"W/m²"]
[]
["RESULTATEN OP RUIMTENIVEAU"]
[]
[null,"Ruimte 1",null,"Ruimte 2",null,"Ruimte 3",null,"Ruimte 4",null,"Ruimte 5",null,"Ruimte 6",null,"Ruimte 7",null,"Ruimte 8",null,"Ruimte 9",null,"Ruimte 10"]
["Ruimtenaam",{"$f":"IF('Ruimte 1'!$B$3=0,\"\",'Ruimte 1'!$B$3)","v":"Woonkamer"},null,{"$f":"IF('Ruimte 2'!$B$3=0,\"\",'Ruimte 2'!$B$3)","v":"Slaap 1"},null,{"$f":"IF('Ruimte 3'!$B$3=0,\"\",'Ruimte 3'!$B$3)","v":"slaap 2"},null,{"$f":"IF('Ruimte 4'!$B$3=0,\"\",'Ruimte 4'!$B$3)","v":"slaap 3"},null,{"$f":"IF('Ruimte 5'!$B$3=0,\"\",'Ruimte 5'!$B$3)","v":"slaap 4"},null,null,null,{"$f":"IF('Ruimte 7'!$B$3=0,\"\",'Ruimte 7'!$B$3)","v":""},null,{"$f":"IF('Ruimte 8'!$B$3=0,\"\",'Ruimte 8'!$B$3)","v":""},null,{"$f":"IF('Ruimte 9'!$B$3=0,\"\",'Ruimte 9'!$B$3)","v":""},null,{"$f":"IF('Ruimte 10'!$B$3=0,\"\",'Ruimte 10'!$B$3)","v":""}]
["Type verblijfsruimte",{"$f":"'Ruimte 1'!$B$4","v":"Woonvertrek"},null,{"$f":"'Ruimte 2'!$B$4","v":"Andere verblijfsruimte"},null,{"$f":"'Ruimte 3'!$B$4","v":"Andere verblijfsruimte"},null,{"$f":"'Ruimte 4'!$B$4","v":"Andere verblijfsruimte"},null,{"$f":"'Ruimte 5'!$B$4","v":"Andere verblijfsruimte"},null,{"$f":"'Ruimte 6'!$B$4","v":"Andere verblijfsruimte"},null,{"$f":"'Ruimte 7'!$B$4","v":"Andere verblijfsruimte"},null,{"$f":"'Ruimte 8'!$B$4","v":"Andere verblijfsruimte"},null,{"$f":"'Ruimte 9'!$B$4","v":"Andere verblijfsruimte"},null,{"$f":"'Ruimte 10'!$B$4","v":"Andere verblijfsruimte"}]
["Vloeroppervlak (gebruiksoppervlak)",{"$f":"'Ruimte 1'!$B$5","v":38.6},"m²",{"$f":"'Ruimte 2'!$B$5","v":11.8},"m²",{"$f":"'Ruimte 3'!$B$5","v":15.6},"m²",{"$f":"'Ruimte 4'!$B$5","v":7.3},"m²",{"$f":"'Ruimte 5'!$B$5","v":20.399999999999999},"m²",{"$f":"'Ruimte 6'!$B$5","v":18.100000000000001},"m²",{"$f":"'Ruimte 7'!$B$5","v":0},"m²",{"$f":"'Ruimte 8'!$B$5","v":0},"m²",{"$f":"'Ruimte 9'!$B$5","v":0},"m²",{"$f":"'Ruimte 10'!$B$5","v":0},"m²"]
[]
["Buitenluchttemperatuur bij tijdstip max koellast  tmax,zi",{"$f":"'Ruimte 1'!$B$53","v":29.9},"°C",{"$f":"'Ruimte 2'!$B$53","v":29.800000000000015},"°C",{"$f":"'Ruimte 3'!$B$53","v":29.9},"°C",{"$f":"'Ruimte 4'!$B$53","v":29.9},"°C",{"$f":"'Ruimte 5'!$B$53","v":29.800000000000015},"°C",{"$f":"'Ruimte 6'!$B$53","v":29.9},"°C",{"$f":"'Ruimte 7'!$B$53","v":""},"°C",{"$f":"'Ruimte 8'!$B$53","v":""},"°C",{"$f":"'Ruimte 9'!$B$53","v":""},"°C",{"$f":"'Ruimte 10'!$B$53","v":""},"°C"]
["Koellast door interne warmtelast Pint;calc;woon/overig;zi",{"$f":"'Ruimte 1'!$B$60","v":252.23457446808513},"W",{"$f":"'Ruimte 2'!$B$60","v":38.553989361702129},"W",{"$f":"'Ruimte 3'!$B$60","v":50.969680851063835},"W",{"$f":"'Ruimte 4'!$B$60","v":23.85119680851064},"W",{"$f":"'Ruimte 5'!$B$60","v":66.652659574468089},"W",{"$f":"'Ruimte 6'!$B$60","v":59.137898936170224},"W",{"$f":"'Ruimte 7'!$B$60","v":0},"W",{"$f":"'Ruimte 8'!$B$60","v":0},"W",{"$f":"'Ruimte 9'!$B$60","v":0},"W",{"$f":"'Ruimte 10'!$B$60","v":0},"W"]
["Koellast door buitenluchttoetreding Pv;calc;vr;zi",{"$f":"'Ruimte 1'!$B$61","v":173.03200665535709},"W",{"$f":"'Ruimte 2'!$B$61","v":51.99925588606601},"W",{"$f":"'Ruimte 3'!$B$61","v":69.93003377781271},"W",{"$f":"'Ruimte 4'!$B$61","v":32.723669652437998},"W",{"$f":"'Ruimte 5'!$B$61","v":89.897018650486984},"W",{"$f":"'Ruimte 6'!$B$61","v":81.136769960154496},"W",{"$f":"'Ruimte 7'!$B$61","v":0},"W",{"$f":"'Ruimte 8'!$B$61","v":0},"W",{"$f":"'Ruimte 9'!$B$61","v":0},"W",{"$f":"'Ruimte 10'!$B$61","v":0},"W"]
["Koellast door transmissie ondoorzichtige delen Ptr;ntr;vr;zi",{"$f":"SUM('Ruimte 1'!$B$55:$T$55)","v":32.010000000000005},"W",{"$f":"SUM('Ruimte 2'!$B$55:$T$55)","v":15.84},"W",{"$f":"SUM('Ruimte 3'!$B$55:$T$55)","v":16.059999999999999},"W",{"$f":"SUM('Ruimte 4'!$B$55:$T$55)","v":10.494},"W",{"$f":"SUM('Ruimte 5'!$B$55:$T$55)","v":70.994},"W",{"$f":"SUM('Ruimte 6'!$B$55:$T$55)","v":69.01400000000001},"W",{"$f":"SUM('Ruimte 7'!$B$55:$T$55)","v":0},"W",{"$f":"SUM('Ruimte 8'!$B$55:$T$55)","v":0},"W",{"$f":"SUM('Ruimte 9'!$B$55:$T$55)","v":0},"W",{"$f":"SUM('Ruimte 10'!$B$55:$T$55)","v":0},"W"]
["Koellastbijdrage zoninstraling transparante delen Psol;vr;zi",{"$f":"SUM('Ruimte 1'!$B$56:$T$56)","v":670.06642371117198},"W",{"$f":"SUM('Ruimte 2'!$B$56:$T$56)","v":116.42930349808567},"W",{"$f":"SUM('Ruimte 3'!$B$56:$T$56)","v":142.36872749500935},"W",{"$f":"SUM('Ruimte 4'!$B$56:$T$56)","v":142.36872749500935},"W",{"$f":"SUM('Ruimte 5'!$B$56:$T$56)","v":337.64498014444843},"W",{"$f":"SUM('Ruimte 6'!$B$56:$T$56)","v":284.7374549900187},"W",{"$f":"SUM('Ruimte 7'!$B$56:$T$56)","v":0},"W",{"$f":"SUM('Ruimte 8'!$B$56:$T$56)","v":0},"W",{"$f":"SUM('Ruimte 9'!$B$56:$T$56)","v":0},"W",{"$f":"SUM('Ruimte 10'!$B$56:$T$56)","v":0},"W"]
["Koellastbijdrage transmissie transparante delen Ptr;gl;vr;zi",{"$f":"SUM('Ruimte 1'!$B$57:$T$57)","v":83.19},"W",{"$f":"SUM('Ruimte 2'!$B$57:$T$57)","v":17.400000000000045},"W",{"$f":"SUM('Ruimte 3'!$B$57:$T$57)","v":16.814999999999994},"W",{"$f":"SUM('Ruimte 4'!$B$57:$T$57)","v":16.814999999999994},"W",{"$f":"SUM('Ruimte 5'!$B$57:$T$57)","v":50.460000000000129},"W",{"$f":"SUM('Ruimte 6'!$B$57:$T$57)","v":33.629999999999988},"W",{"$f":"SUM('Ruimte 7'!$B$57:$T$57)","v":0},"W",{"$f":"SUM('Ruimte 8'!$B$57:$T$57)","v":0},"W",{"$f":"SUM('Ruimte 9'!$B$57:$T$57)","v":0},"W",{"$f":"SUM('Ruimte 10'!$B$57:$T$57)","v":0},"W"]
[]
["Koelbehoefte verblijfsruimte",{"$f":"IFERROR(SUM(B50:B54)/B47,0)","v":31.36095867447187},"W/m²",{"$f":"IFERROR(SUM(D50:D54)/D47,0)","v":20.357843114055409},"W/m²",{"$f":"IFERROR(SUM(F50:F54)/F47,0)","v":18.983553982300378},"W/m²",{"$f":"IFERROR(SUM(H50:H54)/H47,0)","v":30.993506021364109},"W/m²",{"$f":"IFERROR(SUM(J50:J54)/J47,0)","v":30.178855802421747},"W/m²",{"$f":"IFERROR(SUM(L50:L54)/L47,0)","v":29.15227203791952},"W/m²",{"$f":"IFERROR(SUM(N50:N54)/N47,0)","v":0},"W/m²",{"$f":"IFERROR(SUM(P50:P54)/P47,0)","v":0},"W/m²",{"$f":"IFERROR(SUM(R50:R54)/R47,0)","v":0},"W/m²",{"$f":"IFERROR(SUM(T50:T54)/T47,0)","v":0},"W/m²"]
["Vaste aftrek van 35W/m² ",35,"W/m²",35,"W/m²",35,"W/m²",35,"W/m²",35,"W/m²",35,"W/m²",35,"W/m²",35,"W/m²",35,"W/m²",35,"W/m²"]
["Minimaal te installeren koelcapaciteit",{"$f":"MAX(0,B56-B57)","v":0},"W/m²",{"$f":"MAX(0,D56-D57)","v":0},"W/m²",{"$f":"MAX(0,F56-F57)","v":0},"W/m²",{"$f":"MAX(0,H56-H57)","v":0},"W/m²",{"$f":"MAX(0,J56-J57)","v":0},"W/m²",{"$f":"MAX(0,L56-L57)","v":0},"W/m²",{"$f":"MAX(0,N56-N57)","v":0},"W/m²",{"$f":"MAX(0,P56-P57)","v":0},"W/m²",{"$f":"MAX(0,R56-R57)","v":0},"W/m²",{"$f":"MAX(0,T56-T57)","v":0},"W/m²"]
[]
["BENODIGDE KOELCAPACITEITVERBLIJFSRUIMTE AFGIFTE"]
[]
[{"$f":"\"Benodigde koelcapaciteit \" &B44&IF(B45=\"\",\"\",\" - \" &B45)","v":"Benodigde koelcapaciteit Ruimte 1 - Woonkamer"},{"$f":"B47*B58","v":0},"W",{"$f":"B58","v":0},"W/m²",{"$f":"IF(D62<=0,\"De ruimte moet actief gekoeld worden, aan de minimaal benodigde koelcapaciteit in de ruimte wordt geen eis gesteld.\", \"De berekende koelcapaciteit moet minimaal gerealiseerd worden om het risico op oververhitting voldoende te beperken\")","v":"De ruimte moet actief gekoeld worden, aan de minimaal benodigde koelcapaciteit in de ruimte wordt geen eis gesteld."}]
[{"$f":"\"Benodigde koelcapaciteit \" &D44&IF(D45=\"\",\"\",\" - \" &D45)","v":"Benodigde koelcapaciteit Ruimte 2 - Slaap 1"},{"$f":"D47*D58","v":0},"W",{"$f":"D58","v":0},"W/m²",{"$f":"IF(D63<=0,\"De ruimte moet actief gekoeld worden, aan de minimaal benodigde koelcapaciteit in de ruimte wordt geen eis gesteld.\", \"De berekende koelcapaciteit moet minimaal gerealiseerd worden om het risico op oververhitting voldoende te beperken\")","v":"De ruimte moet actief gekoeld worden, aan de minimaal benodigde koelcapaciteit in de ruimte wordt geen eis gesteld."}]
[{"$f":"\"Benodigde koelcapaciteit \" &F44&IF(F45=\"\",\"\",\" - \" &F45)","v":"Benodigde koelcapaciteit Ruimte 3 - slaap 2"},{"$f":"F47*F58","v":0},"W",{"$f":"F58","v":0},"W/m²","De ruimte moet actief gekoeld worden, aan de minimaal benodigde koelcapaciteit in de ruimte wordt geen eis gesteld."]
[{"$f":"\"Benodigde koelcapaciteit \" &H44&IF(H45=\"\",\"\",\" - \" &H45)","v":"Benodigde koelcapaciteit Ruimte 4 - slaap 3"},{"$f":"H47*H58","v":0},"W",{"$f":"H58","v":0},"W/m²","De ruimte moet actief gekoeld worden, aan de minimaal benodigde koelcapaciteit in de ruimte wordt geen eis gesteld."]
[{"$f":"\"Benodigde koelcapaciteit \" &J44&IF(J45=\"\",\"\",\" - \" &J45)","v":"Benodigde koelcapaciteit Ruimte 5 - slaap 4"},{"$f":"J47*J58","v":0},"W",{"$f":"J58","v":0},"W/m²","De ruimte moet actief gekoeld worden, aan de minimaal benodigde koelcapaciteit in de ruimte wordt geen eis gesteld."]
[{"$f":"\"Benodigde koelcapaciteit \" &L44&IF(L45=\"\",\"\",\" - \" &L45)","v":"Benodigde koelcapaciteit Ruimte 6"},{"$f":"L47*L58","v":0},"W",{"$f":"L58","v":0},"W/m²","De ruimte moet actief gekoeld worden, aan de minimaal benodigde koelcapaciteit in de ruimte wordt geen eis gesteld."]
[{"$f":"\"Benodigde koelcapaciteit \" &N44&IF(N45=\"\",\"\",\" - \" &N45)","v":"Benodigde koelcapaciteit Ruimte 7"},{"$f":"N47*N58","v":0},"W",{"$f":"N58","v":0},"W/m²","De ruimte moet actief gekoeld worden, aan de minimaal benodigde koelcapaciteit in de ruimte wordt geen eis gesteld."]
[{"$f":"\"Benodigde koelcapaciteit \" &P44&IF(P45=\"\",\"\",\" - \" &P45)","v":"Benodigde koelcapaciteit Ruimte 8"},{"$f":"P47*P58","v":0},"W",{"$f":"P58","v":0},"W/m²","De ruimte moet actief gekoeld worden, aan de minimaal benodigde koelcapaciteit in de ruimte wordt geen eis gesteld."]
[{"$f":"\"Benodigde koelcapaciteit \" &R44&IF(R45=\"\",\"\",\" - \" &R45)","v":"Benodigde koelcapaciteit Ruimte 9"},{"$f":"R47*R58","v":0},"W",{"$f":"R58","v":0},"W/m²","De ruimte moet actief gekoeld worden, aan de minimaal benodigde koelcapaciteit in de ruimte wordt geen eis gesteld."]
[{"$f":"\"Benodigde koelcapaciteit \" &T44&IF(T45=\"\",\"\",\" - \" &T45)","v":"Benodigde koelcapaciteit Ruimte 10"},{"$f":"T47*T58","v":0},"W",{"$f":"T58","v":0},"W/m²","De ruimte moet actief gekoeld worden, aan de minimaal benodigde koelcapaciteit in de ruimte wordt geen eis gesteld."]
[]
["BENODIGDE KOELCAPACITEIT OPWEKKER"]
[]
["Minimaal op te stellen koelvermogen opwekker",{"$f":"MAX(0,SUM(B50:T54)-(35*SUM(B47:T47)))","v":0},"W",null,null,{"$f":"IF(D75<=0,\"De woning moet actief gekoeld worden, aan de minimaal benodigde koelcapaciteit van de opwekker wordt geen eis gesteld.\", \"De minimaal berekende koelcapaciteit van de opwekker moet gerealiseerd worden om het risico op oververhitting voldoende te beperken\")","v":"De woning moet actief gekoeld worden, aan de minimaal benodigde koelcapaciteit van de opwekker wordt geen eis gesteld."}]
[]
[]
[]
[]
["Onderstaande tabellen worden verwijderd in de uiteindelijke versie. De tabellen dienen om vast te stellen welk tijdstip tot de hoogste belasting van de opwekker leidt"]
[]
[null,"Ruimte 1",null,"Ruimte 2",null,"Ruimte 3",null,"Ruimte 4",null,"Ruimte 5",null,"Ruimte 6",null,"Ruimte 7",null,"Ruimte 8",null,"Ruimte 9",null,"Ruimte 10"]
[]
["09:00:00",{"$f":"'Ruimte 1'!$T73","v":266.72790367589181},"W",{"$f":"'Ruimte 2'!$T73","v":1063.0307507486659},"W",{"$f":"'Ruimte 3'!$T73","v":43.348084450371083},"W",{"$f":"'Ruimte 4'!$T73","v":43.348084450371083},"W",{"$f":"'Ruimte 5'!$T73","v":283.90571418378943},"W",{"$f":"'Ruimte 6'!$T73","v":86.696168900742165},"W",{"$f":"'Ruimte 7'!$T73","v":0},"W",{"$f":"'Ruimte 8'!$T73","v":0},"W",{"$f":"'Ruimte 9'!$T73","v":0},"W",{"$f":"'Ruimte 10'!$T73","v":0},"W",{"$f":"SUM(B84:T84)","v":1787.0567064098313}]
["10:00:00",{"$f":"'Ruimte 1'!$T74","v":416.86169869296674},"W",{"$f":"'Ruimte 2'!$T74","v":1207.522038801188},"W",{"$f":"'Ruimte 3'!$T74","v":78.932312139291795},"W",{"$f":"'Ruimte 4'!$T74","v":78.932312139291795},"W",{"$f":"'Ruimte 5'!$T74","v":317.37923225739166},"W",{"$f":"'Ruimte 6'!$T74","v":157.86462427858359},"W",{"$f":"'Ruimte 7'!$T74","v":0},"W",{"$f":"'Ruimte 8'!$T74","v":0},"W",{"$f":"'Ruimte 9'!$T74","v":0},"W",{"$f":"'Ruimte 10'!$T74","v":0},"W",2257.4922183087133]
["11:00:00",{"$f":"'Ruimte 1'!$T75","v":507.63579781325768},"W",{"$f":"'Ruimte 2'!$T75","v":1155.5876397806787},"W",{"$f":"'Ruimte 3'!$T75","v":102.00582533956066},"W",{"$f":"'Ruimte 4'!$T75","v":102.00582533956066},"W",{"$f":"'Ruimte 5'!$T75","v":320.01486008635646},"W",{"$f":"'Ruimte 6'!$T75","v":204.01165067912132},"W",{"$f":"'Ruimte 7'!$T75","v":0},"W",{"$f":"'Ruimte 8'!$T75","v":0},"W",{"$f":"'Ruimte 9'!$T75","v":0},"W",{"$f":"'Ruimte 10'!$T75","v":0},"W",2391.2615990385357]
["12:00:00",{"$f":"'Ruimte 1'!$T76","v":580.04137076507425},"W",{"$f":"'Ruimte 2'!$T76","v":1066.552017314315},"W",{"$f":"'Ruimte 3'!$T76","v":119.55622506297408},"W",{"$f":"'Ruimte 4'!$T76","v":119.55622506297408},"W",{"$f":"'Ruimte 5'!$T76","v":331.76387529691272},"W",{"$f":"'Ruimte 6'!$T76","v":239.11245012594816},"W",{"$f":"'Ruimte 7'!$T76","v":0},"W",{"$f":"'Ruimte 8'!$T76","v":0},"W",{"$f":"'Ruimte 9'!$T76","v":0},"W",{"$f":"'Ruimte 10'!$T76","v":0},"W",2456.5821636281985]
["13:00:00",{"$f":"'Ruimte 1'!$T77","v":603.73640558761952},"W",{"$f":"'Ruimte 2'!$T77","v":895.4418329068709},"W",{"$f":"'Ruimte 3'!$T77","v":125.68230962010684},"W",{"$f":"'Ruimte 4'!$T77","v":125.68230962010684},"W",{"$f":"'Ruimte 5'!$T77","v":331.28696333699457},"W",{"$f":"'Ruimte 6'!$T77","v":251.36461924021367},"W",{"$f":"'Ruimte 7'!$T77","v":0},"W",{"$f":"'Ruimte 8'!$T77","v":0},"W",{"$f":"'Ruimte 9'!$T77","v":0},"W",{"$f":"'Ruimte 10'!$T77","v":0},"W",2333.1944403119128]
["14:00:00",{"$f":"'Ruimte 1'!$T78","v":670.06642371117198},"W",{"$f":"'Ruimte 2'!$T78","v":1136.6570319687021},"W",{"$f":"'Ruimte 3'!$T78","v":142.36872749500935},"W",{"$f":"'Ruimte 4'!$T78","v":142.36872749500935},"W",{"$f":"'Ruimte 5'!$T78","v":335.17531716087143},"W",{"$f":"'Ruimte 6'!$T78","v":284.7374549900187},"W",{"$f":"'Ruimte 7'!$T78","v":0},"W",{"$f":"'Ruimte 8'!$T78","v":0},"W",{"$f":"'Ruimte 9'!$T78","v":0},"W",{"$f":"'Ruimte 10'!$T78","v":0},"W",2711.373682820783]
["15:00:00",{"$f":"'Ruimte 1'!$T79","v":563.18150120652228},"W",{"$f":"'Ruimte 2'!$T79","v":1216.0993937680819},"W",{"$f":"'Ruimte 3'!$T79","v":114.70664535757152},"W",{"$f":"'Ruimte 4'!$T79","v":114.70664535757152},"W",{"$f":"'Ruimte 5'!$T79","v":337.64498014444843},"W",{"$f":"'Ruimte 6'!$T79","v":229.41329071514303},"W",{"$f":"'Ruimte 7'!$T79","v":0},"W",{"$f":"'Ruimte 8'!$T79","v":0},"W",{"$f":"'Ruimte 9'!$T79","v":0},"W",{"$f":"'Ruimte 10'!$T79","v":0},"W",2575.7524565493381]
["16:00:00",{"$f":"'Ruimte 1'!$T80","v":379.52258057931169},"W",{"$f":"'Ruimte 2'!$T80","v":1041.8938345782753},"W",{"$f":"'Ruimte 3'!$T80","v":72.906286071279368},"W",{"$f":"'Ruimte 4'!$T80","v":72.906286071279368},"W",{"$f":"'Ruimte 5'!$T80","v":277.15816836965854},"W",{"$f":"'Ruimte 6'!$T80","v":145.81257214255874},"W",{"$f":"'Ruimte 7'!$T80","v":0},"W",{"$f":"'Ruimte 8'!$T80","v":0},"W",{"$f":"'Ruimte 9'!$T80","v":0},"W",{"$f":"'Ruimte 10'!$T80","v":0},"W",1990.1997278123629]
["17:00:00",{"$f":"'Ruimte 1'!$T81","v":256.39207217234195},"W",{"$f":"'Ruimte 2'!$T81","v":929.38704988196776},"W",{"$f":"'Ruimte 3'!$T81","v":44.139002199995801},"W",{"$f":"'Ruimte 4'!$T81","v":44.139002199995801},"W",{"$f":"'Ruimte 5'!$T81","v":244.99859497773366},"W",{"$f":"'Ruimte 6'!$T81","v":88.278004399991602},"W",{"$f":"'Ruimte 7'!$T81","v":0},"W",{"$f":"'Ruimte 8'!$T81","v":0},"W",{"$f":"'Ruimte 9'!$T81","v":0},"W",{"$f":"'Ruimte 10'!$T81","v":0},"W",1607.3337258320264]
["18:00:00",{"$f":"'Ruimte 1'!$T82","v":145.75653044509369},"W",{"$f":"'Ruimte 2'!$T82","v":819.77780723080139},"W",{"$f":"'Ruimte 3'!$T82","v":16.171479168871954},"W",{"$f":"'Ruimte 4'!$T82","v":16.171479168871954},"W",{"$f":"'Ruimte 5'!$T82","v":240.04133673077581},"W",{"$f":"'Ruimte 6'!$T82","v":32.342958337743909},"W",{"$f":"'Ruimte 7'!$T82","v":0},"W",{"$f":"'Ruimte 8'!$T82","v":0},"W",{"$f":"'Ruimte 9'!$T82","v":0},"W",{"$f":"'Ruimte 10'!$T82","v":0},"W",1270.2615910821589]
[]
[]
["Maatgevende tijdstip",{"$f":"IF(MAX(V84:V93)=0,\"Geen glas aanwezig\",_xlfn.XLOOKUP(MAX(V84:V93),V84:V93,A84:A93,\"nvt\"))","v":"14:00:00"}]
["Minimaal op te stellen koelvermogen opwekker",{"$f":"MAX(V84:V93)","v":2711.373682820783},"W",null,null,"Aftrek 35W/m²",null,"Totaal met afrek"]
["som VAN ALLE RUIMTEN (INCLUSIES AFTREK 35W/m²",{"$f":"SUM(B50:T54)","v":3116.4563719160587},null,"AFTREK",null,{"$f":"35*SUM(B47:T47)","v":3912.9999999999995},null,{"$f":"B98-F98","v":-796.5436280839408}]
[]
["infiltratie per ruimte"]
["SWM weg"]
["max koellast gewoon optellen"]
["Nieuwe uurlijksewaarden"]

{"sheet":"Ruimte 1","index":3,"n_rows":84,"n_cols":21,"rows_kept":84,"cut":false,"hidden":false,"merged":[[66,0,67,20],[6,1,6,3],[6,5,6,7],[6,9,6,11],[40,9,40,11],[40,13,40,15],[41,13,41,15],[40,1,40,3],[41,1,41,3],[59,1,59,3],[60,1,60,3],[62,1,62,3],[63,1,63,3],[54,9,54,11],[55,9,55,11],[56,9,56,11],[57,9,57,11],[57,5,57,7],[54,1,54,3],[55,1,55,3],[55,5,55,7],[56,1,56,3],[54,5,54,7],[56,5,56,7],[57,1,57,3],[55,17,55,19],[56,17,56,19],[57,17,57,19],[6,17,6,20],[0,0,0,20],[40,17,40,19],[41,17,41,19],[54,17,54,19],[54,13,54,15],[55,13,55,15],[56,13,56,15],[57,13,57,15],[6,13,6,15],[41,5,41,7],[40,5,40,7],[41,9,41,11]]}
["RUIMTE 1"]
[]
["Ruimtenaam","Woonkamer"]
["Type verblijfsruimte","Woonvertrek"]
["Vloeroppervlak verblijfsruimte Avr  (gebruiksoppervlak)",38.6,"m²"]
[]
[null,"Voorzijde woning",null,null,null,"Linker zijde woning",null,null,null,"Achterzijde woning",null,null,null,"Rechter zijde woning",null,null,null,"Platdak"]
["Orientatie gevel / dakvlak (Helling > 15°C)",{"$f":"Invoerblad!$B$17","v":"Noord"},null,null,null,{"$f":"o_Orientatie(F9)","v":"Oost"},null,null,null,{"$f":"o_Orientatie(J9)","v":"Zuid"},null,null,null,{"$f":"o_Orientatie(N9)","v":"West"},null,null,null,"Horizontaal"]
["Orientatiehoek gevel Ƴ",{"$f":"o_OrientatiehOEK(B8)","v":0},null,null,null,{"$f":"IF(B9+90>360,B9+90-360,B9+90)","v":90},null,null,null,{"$f":"IF(F9+90>360,F9+90-360,F9+90)","v":180},null,null,null,{"$f":"IF(J9+90>360,J9+90-360,J9+90)","v":270}]
["Grenst aan buitenlucht ja of nee","Ja",null,null,null,"Nee",null,null,null,"Ja",null,null,null,"Nee",null,null,null,"Nee"]
["Hellingshoek constructie ≥ 15° = hellenddak 90° = gevel",90,"°",null,null,90,"°",null,null,90,"°",null,null,90,"°",null,null,10,"°"]
["Type constructie",{"$f":"o_TypeConstructie(B10,B11)","v":"Buitengevel"},null,null,null,{"$f":"o_TypeConstructie(F10,F11)","v":"Woningscheidend"},null,null,null,{"$f":"o_TypeConstructie(J10,J11)","v":"Buitengevel"},null,null,null,{"$f":"o_TypeConstructie(N10,N11)","v":"Woningscheidend"},null,null,null,{"$f":"o_TypeConstructie(R10,R11)","v":"Woningscheidend"}]
["Gevel lengte (binnenwerks)",5,"m",null,null,0,"m",null,null,0,"m",null,null,0,"m",null,null,0,"m"]
["Gevel hoogte / Dak breedte (binnenwerks)",2,"m",null,null,0,"m",null,null,0,"m",null,null,0,"m",null,null,0,"m"]
["Constructie oppervlak (binnenwerks)",8.08,"m²",null,null,{"$f":"F13*F14","v":0},"m²",null,null,15.87,"m²",null,null,{"$f":"N13*N14","v":0},"m²",null,null,{"$f":"R13*R14","v":0},"m²"]
["Gesloten constructie oppervlak",{"$f":"MAX(0,B15-B18-D18)","v":6.08},"m²",null,null,{"$f":"MAX(0,F15-F18-H18)","v":0},"m²",null,null,{"$f":"MAX(0,J15-J18-L18)","v":8.4699999999999989},"m²",null,null,{"$f":"MAX(0,N15-N18-P18)","v":0},"m²",null,null,{"$f":"MAX(0,R15-R18-T18)","v":0},"m²"]
[null,"Glasvlak type 1",null,"Glasvlak type 2",null,"Glasvlak type 1",null,"Glasvlak type 2",null,"Glasvlak type 1",null,"Glasvlak type 2",null,"Glasvlak type 1",null,"Glasvlak type 2",null,"Glasvlak type 1",null,"Glasvlak type 2"]
["Totaal oppervlak van raamtype Aw,k (inclusief kozijn)",2,"m²",null,"m²",null,"m²",null,"m²",7.4,"m²",null,"m²",null,"m²",null,"m²",null,"m²",null,"m²"]
["Warmtedoorgangscoefficient (U-waarde) van het raam Uw;wi;k",1.5,"W/m².K",null,"W/m².K",null,"W/m².K",null,"W/m².K",1.5,"W/m².K",null,"W/m².K",null,"W/m².K",null,"W/m².K",null,"W/m².K",null,"W/m².K"]
["Zontoetredingsfactor (g_waarde) van het glas Ggl;n;wi;k;C;juli",0.6,null,null,null,null,null,null,null,0.6]
["Beschaduwing situatie bij het raamtype","Minimale belemmering",null,"Minimale belemmering",null,"Minimale belemmering",null,"Minimale belemmering",null,"Minimale belemmering",null,"Minimale belemmering",null,"Minimale belemmering",null,"Minimale belemmering",null,"Minimale belemmering",null,"Minimale belemmering"]
[]
[null,"Overstek",null,"Overstek",null,"Overstek",null,"Overstek",null,"Overstek",null,"Overstek",null,"Overstek",null,"Overstek"]
["Hoogte verschil midden raam onderzijde overstek",0,"m",0,"m",0,"m",0,"m",0,"m",0,"m",0,"m",0,"m",0,null,null,"m"]
["Horizontale afstand glas tot eindpunt overstek",0,"m",0,"m",0,"m",0,"m",0,"m",0,"m",0,"m",0,"m",0,null,null,"m"]
["Overstekhoek",{"$f":"IFERROR(180/PI()*ATAN(B24/B25),0)","v":0},"°",{"$f":"IFERROR(180/PI()*ATAN(D24/D25),0)","v":0},"°",{"$f":"IFERROR(180/PI()*ATAN(F24/F25),0)","v":0},"°",{"$f":"IFERROR(180/PI()*ATAN(H24/H25),0)","v":0},"°",{"$f":"IFERROR(180/PI()*ATAN(J24/J25),0)","v":0},"°",{"$f":"IFERROR(180/PI()*ATAN(L24/L25),0)","v":0},"°",{"$f":"IFERROR(180/PI()*ATAN(N24/N25),0)","v":0},"°",{"$f":"IFERROR(180/PI()*ATAN(P24/P25),0)","v":0},"°",null,null,null,"°"]
["Relatieve hoogte van overstek",{"$f":"IFERROR(B24/B25,1)","v":1},null,{"$f":"IFERROR(D24/D25,1)","v":1},null,{"$f":"IFERROR(F24/F25,1)","v":1},null,{"$f":"IFERROR(H24/H25,1)","v":1},null,{"$f":"IFERROR(J24/J25,1)","v":1},null,{"$f":"IFERROR(L24/L25,1)","v":1},null,{"$f":"IFERROR(N24/N25,1)","v":1},null,{"$f":"IFERROR(P24/P25,1)","v":1}]
[]
[null,"Zijbelemmering",null,"Zijbelemmering",null,"Zijbelemmering",null,"Zijbelemmering",null,"Zijbelemmering",null,"Zijbelemmering",null,"Zijbelemmering",null,"Zijbelemmering"]
["Positie zijbelemmering irt zichtveld (naar buitengericht)","Links",null,"Links",null,"Links",null,"Links",null,"Links",null,"Links",null,"Links",null,"Links"]
["Horizontale afstand midden raam verste punt belemmering",0,"m",0,"m",null,"m",null,"m",null,"m",1,"m",null,"m",null,"m",null,null,null,"m"]
["Horizontale breedte glas tot eindpunt belemmering",0,"m",0,"m",null,"m",null,"m",null,"m",null,"m",null,"m",null,"m",null,null,null,"m"]
["Relatieve breedte van de zijbelemmering bb",{"$f":"IFERROR(B31/B32,999)","v":999},null,{"$f":"IFERROR(D31/D32,999)","v":999},null,{"$f":"IFERROR(F31/F32,999)","v":999},null,{"$f":"IFERROR(H31/H32,999)","v":999},null,{"$f":"IFERROR(J31/J32,999)","v":999},null,{"$f":"IFERROR(L31/L32,999)","v":999},null,{"$f":"IFERROR(N31/N32,999)","v":999},null,{"$f":"IFERROR(P31/P32,999)","v":999}]
[]
["De beschaduwingsreductiefactor Fsh;obst;wi;k;juli",{"$f":"IFERROR(o_Beschaduwingreductie(B21,B8,B27,B30,B33,B11),1)","v":1},null,{"$f":"IFERROR(o_Beschaduwingreductie(D21,B8,D27,D30,D33,B11),1)","v":1},null,{"$f":"IFERROR(o_Beschaduwingreductie(F21,F8,F27,F30,F33,F11),1)","v":1},null,{"$f":"IFERROR(o_Beschaduwingreductie(H21,F8,H27,H30,H33,F11),1)","v":1},null,{"$f":"IFERROR(o_Beschaduwingreductie(J21,J8,J27,J30,J33,J11),1)","v":1},null,{"$f":"IFERROR(o_Beschaduwingreductie(L21,J8,L27,L30,L33,J11),1)","v":1},null,{"$f":"IFERROR(o_Beschaduwingreductie(N21,N8,N27,N30,N33,N11),1)","v":1},null,{"$f":"IFERROR(o_Beschaduwingreductie(P21,N8,P27,P30,P33,N11),1)","v":1},null,{"$f":"o_Beschaduwingreductie(R21,R8,R27,R30,R33,R11)","v":1},null,{"$f":"o_Beschaduwingreductie(T21,R8,T27,T30,T33,R11)","v":1}]
[]
["Type zonwering","Geen zonwering",null,"Geen zonwering",null,"Geen zonwering",null,"Geen zonwering",null,"Screen (wit)",null,"Geen zonwering",null,"Geen zonwering",null,"Geen zonwering",null,"Geen zonwering",null,"Geen zonwering"]
["De reductiefactor voor zonwering Fc;wi;k",{"$f":"o_Zonweringreductie(B37,B8)","v":1},null,{"$f":"o_Zonweringreductie(D37,B8)","v":1},null,{"$f":"o_Zonweringreductie(F37,F8)","v":1},null,{"$f":"o_Zonweringreductie(H37,F8)","v":1},null,{"$f":"o_Zonweringreductie(J37,J8)","v":0.25},null,{"$f":"o_Zonweringreductie(L37,J8)","v":1},null,{"$f":"o_Zonweringreductie(N37,N8)","v":1},null,{"$f":"o_Zonweringreductie(P37,N8)","v":1},null,{"$f":"o_Zonweringreductie(R37,R8)","v":1},null,{"$f":"o_Zonweringreductie(T37,R8)","v":1}]
["Totaal opvallende zonnestraling van het raam Isol;wi;k;juli",{"$f":"IF(B10=\"Nee\",0,o_Isol_Bij_Tijdstip($B$52,B8,B11))","v":142.68851305273367},"W/m²",{"$f":"IF(B10=\"Nee\",0,o_Isol_Bij_Tijdstip($B$52,B8,B11))","v":142.68851305273367},"W/m²",{"$f":"IF(F10=\"Nee\",0,o_Isol_Bij_Tijdstip($B$52,F8,F11))","v":0},"W/m²",{"$f":"IF(F10=\"Nee\",0,o_Isol_Bij_Tijdstip($B$52,F8,F11))","v":0},"W/m²",{"$f":"IF(J10=\"Nee\",0,o_Isol_Bij_Tijdstip($B$52,J8,J11))","v":740.05836254715712},"W/m²",{"$f":"IF(J10=\"Nee\",0,o_Isol_Bij_Tijdstip($B$52,J8,J11))","v":740.05836254715712},"W/m²",{"$f":"IF(N10=\"Nee\",0,o_Isol_Bij_Tijdstip($B$52,N8,N11))","v":0},"W/m²",{"$f":"IF(N10=\"Nee\",0,o_Isol_Bij_Tijdstip($B$52,N8,N11))","v":0},"W/m²",{"$f":"IF(R10=\"Nee\",0,o_Isol_Bij_Tijdstip($B$52,R8,R11))","v":0},"W/m²",{"$f":"IF(R10=\"Nee\",0,o_Isol_Bij_Tijdstip($B$52,R8,R11))","v":0},"W/m²"]
[]
["Tijdstip maximale koellastbijdrage tmax;zi",{"$f":"VALUE(o_Tijdstip_Isol_Max_Orientatie(B8,B11))","v":"15:00:00"},null,null,null,{"$f":"VALUE(o_Tijdstip_Isol_Max_Orientatie(F8,F11))","v":"09:00:00"},null,null,null,{"$f":"VALUE(o_Tijdstip_Isol_Max_Orientatie(J8,J11))","v":"14:00:00"},null,null,null,{"$f":"VALUE(o_Tijdstip_Isol_Max_Orientatie(N8,N11))","v":"18:00:00"},null,null,null,{"$f":"o_Tijdstip_Isol_Max_Orientatie(R8,R11)","v":"16:00:00"}]
["Buitenluchttemperatuur op tijdstip max koellast Θe",{"$f":"o_maxTemp(VALUE(B41))","v":29.8},null,null,"°C",{"$f":"o_maxTemp(VALUE(F41))","v":24.7},null,null,"°C",{"$f":"o_maxTemp(VALUE(J41))","v":29.9},null,null,"°C",{"$f":"o_maxTemp(VALUE(N41))","v":30.1},null,null,"°C",{"$f":"o_maxTemp(VALUE(R41))","v":30.4}]
[]
["Glasopppervlak",{"$f":"IF(B10=\"Ja\",B18+D18,0)","v":2},"m²",null,null,{"$f":"IF(F10=\"Ja\",F18+H18,0)","v":0},"m²",null,null,{"$f":"IF(J10=\"Ja\",J18+L18,0)","v":7.4},"m²",null,null,{"$f":"IF(N10=\"Ja\",N18+P18,0)","v":0},"m²",null,null,{"$f":"IF(R10=\"Ja\",R18+T18,0)","v":0},"m²"]
["Uitwendigescheidingsconstructie niet op Noord?",{"$f":"IF(B10=\"Ja\",IF(B8=\"Noord\",FALSE,TRUE),FALSE)","v":false},null,null,null,{"$f":"IF(F10=\"Ja\",IF(F8=\"Noord\",FALSE,TRUE),FALSE)","v":false},null,null,null,{"$f":"IF(J10=\"Ja\",IF(J8=\"Noord\",FALSE,TRUE),FALSE)","v":true},null,null,null,{"$f":"IF(N10=\"Ja\",IF(N8=\"Noord\",FALSE,TRUE),FALSE)","v":false},null,null,null,{"$f":"IF(R10=\"Ja\",IF(R8=\"Noord\",FALSE,TRUE),FALSE)","v":false}]
["De enige uitwendigescheidingscontructie?",{"$f":"IF(AND(B45=TRUE,COUNTIF($B$45:$R$45,TRUE)=1),TRUE,FALSE)","v":false},null,null,null,{"$f":"IF(AND(F45=TRUE,COUNTIF($B$45:$R$45,TRUE)=1),TRUE,FALSE)","v":false},null,null,null,{"$f":"IF(AND(J45=TRUE,COUNTIF($B$45:$R$45,TRUE)=1),TRUE,FALSE)","v":true},null,null,null,{"$f":"IF(AND(N45=TRUE,COUNTIF($B$45:$R$45,TRUE)=1),TRUE,FALSE)","v":false},null,null,null,{"$f":"IF(AND(R45=TRUE,COUNTIF($B$45:$R$45,TRUE)=1),TRUE,FALSE)","v":false}]
["Totaal glasoppervlak",{"$f":"IF(B8<>\"Noord\",B44,0)","v":0},"m²",null,null,{"$f":"IF(F8<>\"Noord\",F44,0)","v":0},"m²",null,null,{"$f":"IF(J8<>\"Noord\",J44,0)","v":7.4},"m²",null,null,{"$f":"IF(N8<>\"Noord\",N44,0)","v":0},"m²",null,null,{"$f":"R44","v":0},"m²"]
["Grootste glasoppervlak ",{"$f":"IF(AND(B45,B47=MAX($B$47:$R$47)),TRUE,FALSE)","v":false},null,null,null,{"$f":"IF(AND(F45,F47=MAX($B$47:$R$47)),TRUE,FALSE)","v":false},null,null,null,{"$f":"IF(AND(J45,J47=MAX($B$47:$R$47)),TRUE,FALSE)","v":true},null,null,null,{"$f":"IF(AND(N45,N47=MAX($B$47:$R$47)),TRUE,FALSE)","v":false},null,null,null,{"$f":"IF(AND(R45,R47=MAX($B$47:$R$47)),TRUE,FALSE)","v":false}]
["Dakvlak maatgevend?",{"$f":"IF(AND(B11<90,B15>3*(B18+D18),Invoerblad!$B$25<65),TRUE,FALSE)","v":false},null,null,null,{"$f":"IF(AND(F11<90,F15>3*(F18+H18),Invoerblad!$B$25<65),TRUE,FALSE)","v":false},null,null,null,{"$f":"IF(AND(J11<90,J15>3*(J18+L18),Invoerblad!$B$25<65),TRUE,FALSE)","v":false},null,null,null,{"$f":"IF(AND(N11<90,N15>3*(N18+P18),Invoerblad!$B$25<65),TRUE,FALSE)","v":false},null,null,null,{"$f":"IF(AND(R11<90,R15>3*(R18+T18),Invoerblad!$B$25<65),TRUE,FALSE)","v":false}]
["is er een maatgevend dakoppervlak",{"$f":"IF(COUNTIF($B$49:$R$49,TRUE)>0,TRUE,FALSE)","v":false},null,null,null,{"$f":"IF(COUNTIF($B$49:$R$49,TRUE)>0,TRUE,FALSE)","v":false},null,null,null,{"$f":"IF(COUNTIF($B$49:$R$49,TRUE)>0,TRUE,FALSE)","v":false},null,null,null,{"$f":"IF(COUNTIF($B$49:$R$49,TRUE)>0,TRUE,FALSE)","v":false},null,null,null,{"$f":"IF(COUNTIF($B$49:$R$49,TRUE)>0,TRUE,FALSE)","v":false}]
["Maatgevende tijdstip",{"$f":"IF(OR(B46,AND(B45,B50,B49),AND(B45,B48,NOT(B50))),B41)","v":false},null,null,null,{"$f":"IF(OR(F46,AND(F45,F50,F49),AND(F45,F48,NOT(F50))),F41)","v":false},null,null,null,{"$f":"IF(OR(J46,AND(J45,J50,J49),AND(J45,J48,NOT(J50))),J41)","v":"14:00:00"},null,null,null,{"$f":"IF(OR(N46,AND(N45,N50,N49),AND(N45,N48,NOT(N50))),N41)","v":false},null,null,null,{"$f":"IF(OR(R46,AND(R45,R50,R49),AND(R45,R48,NOT(R50))),R41)","v":false}]
["Maatgevende tijdstip tmax;zi",{"$f":"IFERROR(B84,\"geen glas ingevoerd\")","v":"14:00:00"}]
["Buitenluchttemperatuur op tijdstip max koellast Θe",{"$f":"o_maxTemp(VALUE(B52))","v":29.9},"°C"]
[]
["Koellast door transmissie ondoorzichtige delen Ptr;ntr;vr;zi",{"$f":"IF(B10=\"Nee\",0,B16*Invoerblad!$B$16)","v":13.376000000000001},null,null,"W",{"$f":"IF(F10=\"Nee\",0,F16*Invoerblad!$B$16)","v":0},null,null,"W",{"$f":"IF(J10=\"Nee\",0,J16*Invoerblad!$B$16)","v":18.634},null,null,"W",{"$f":"IF(N10=\"Nee\",0,N16*Invoerblad!$B$16)","v":0},null,null,"W",{"$f":"IF(R10=\"Nee\",0,R16*Invoerblad!$B$16)","v":0},null,null,"W"]
["Koellastbijdrage zoninstraling transparante delen Psol;vr;zi",{"$f":"(0.75*B18*FLOOR(B20,0.05)*0.9*B35*B38*B39)+(0.75*D18*FLOOR(D20,0.05)*0.9*D35*D38*D39)","v":115.57769557271429},null,null,"W",{"$f":"(0.75*F18*FLOOR(F20,0.05)*0.9*F35*F38*F39)+(0.75*H18*FLOOR(H20,0.05)*0.9*H35*H38*H39)","v":0},null,null,"W",{"$f":"(0.75*J18*FLOOR(J20,0.05)*0.9*J35*J38*J39)+(0.75*L18*FLOOR(L20,0.05)*0.9*L35*L38*L39)","v":554.48872813845765},null,null,"W",{"$f":"(0.75*N18*FLOOR(N20,0.05)*0.9*N35*N38*N39)+(0.75*P18*FLOOR(P20,0.05)*0.9*P35*P38*P39)","v":0},null,null,"W",{"$f":"(0.75*R18*FLOOR(R20,0.05)*0.9*R35*R38*R39)+(0.75*T18*FLOOR(T20,0.05)*0.9*T35*T38*T39)","v":0},null,null,"W"]
["Koellastbijdrage transmissie transparante delen Ptr;gl;vr;zi",{"$f":"IF(B10=\"Nee\",0,IFERROR(B18*B19*($B$53-24),0)+IFERROR(D18*D19*($B$53-24),0))","v":17.699999999999996},null,null,"W",{"$f":"IF(F10=\"Nee\",0,IFERROR(F18*F19*($B$53-24),0)+IFERROR(H18*H19*($B$53-24),0))","v":0},null,null,"W",{"$f":"IF(J10=\"Nee\",0,IFERROR(J18*J19*($B$53-24),0)+IFERROR(L18*L19*($B$53-24),0))","v":65.489999999999995},null,null,"W",{"$f":"IF(N10=\"Nee\",0,IFERROR(N18*N19*($B$53-24),0)+IFERROR(P18*P19*($B$53-24),0))","v":0},null,null,"W",{"$f":"IF(R10=\"Nee\",0,IFERROR(R18*R19*($B$53-24),0)+IFERROR(T18*T19*($B$53-24),0))","v":0},null,null,"W"]
["Totaal koellastbijdrage per gevel",{"$f":"SUM(B55:D57)","v":146.65369557271427},null,null,"W",{"$f":"SUM(F55:H57)","v":0},null,null,"W",{"$f":"SUM(J55:L57)","v":638.61272813845767},null,null,"W",{"$f":"SUM(N55:P57)","v":0},null,null,"W",{"$f":"SUM(R55:R57)","v":0},null,null,"W"]
[]
["Koellast door interne warmtelast Pint;calc;woon/overig;zi",{"$f":"IF(B5=0,0,IF(B4=\"Woonvertrek\",2*Invoerblad!$B$40*B5,Invoerblad!$B$40*B5))","v":252.23457446808513},null,null,"W"]
["Koellast door buitenluchttoetreding Pv;calc;vr;zi",{"$f":"IFERROR(MAX((SUM(Invoerblad!$B$28:$B$30)/3600*1.205*1005*(B53-24))/SUM(Invoerblad!$B$47:$T$47)*B5,0),0)","v":173.03200665535709},{"$f":"IFERROR(MAX(SUM(C57:C59)/3600*1.205*1005*(C60-24),0),0)","v":0},{"$f":"IFERROR(MAX(SUM(D57:D59)/3600*1.205*1005*(D60-24),0),0)","v":0},"W"]
[]
["Totaal koellastbijdrage",{"$f":"IFERROR(SUM(B58:T58)+B60+B61,0)","v":1210.5330048346141},null,null,"W"]
["Koelbehoefte verblijfsruimte",{"$f":"IFERROR(B63/B5,0)","v":31.360958674471867},null,null,"W/m²"]
[]
[]
["Onderstaande tabellen worden verborgen in de uiteindelijke versie. De tabellen dienen om vast te stellen welk tijdstip tot de hoogste zonbelasting leidt"]
[]
["Isol max voor de orientatie",{"$f":"o_Isol_Max_Orientatie(B8,B11)","v":143.73988086183414},"W/m²",null,null,{"$f":"o_Isol_Max_Orientatie(F8,F11)","v":845.32772366250799},"W/m²",null,null,{"$f":"o_Isol_Max_Orientatie(J8,J11)","v":740.05836254715712},"W/m²",null,null,{"$f":"o_Isol_Max_Orientatie(N8,N11)","v":741.75809294382429},"W/m²",null,null,{"$f":"o_Isol_Max_Orientatie(R8,R11)","v":914.16092603772574},"W/m²"]
["Tijdstip bij Isol max bij orientatie",{"$f":"VALUE(o_Tijdstip_Isol_Max_Orientatie(B8,B11))","v":"15:00:00"},null,null,null,{"$f":"VALUE(o_Tijdstip_Isol_Max_Orientatie(F8,F11))","v":"09:00:00"},null,null,null,{"$f":"VALUE(o_Tijdstip_Isol_Max_Orientatie(J8,J11))","v":"14:00:00"},null,null,null,{"$f":"VALUE(o_Tijdstip_Isol_Max_Orientatie(N8,N11))","v":"18:00:00"},null,null,null,{"$f":"VALUE(o_Tijdstip_Isol_Max_Orientatie(R8,R11))","v":"16:00:00"}]
[]
["Koellastbijdrage zoninstraling transparante delen Psol;vr;zi"]
["09:00:00",{"$f":"(0.75*B$18*FLOOR(B$20,0.05)*0.9*B$35*B$38*o_Isol_Bij_Tijdstip($A73,B$8,B$11))+(0.75*D$18*FLOOR(D$20,0.05)*0.9*D$35*D$38*o_Isol_Bij_Tijdstip($A73,B$8,B$11))","v":97.898522132341199},"W",null,null,{"$f":"(0.75*F$18*FLOOR(F$20,0.05)*0.9*F$35*F$38*o_Isol_Bij_Tijdstip($A73,F$8,F$11))+(0.75*H$18*FLOOR(H$20,0.05)*0.9*H$35*H$38*o_Isol_Bij_Tijdstip($A73,F$8,F$11))","v":0},"W",null,null,{"$f":"(0.75*J$18*FLOOR(J$20,0.05)*0.9*J$35*J$38*o_Isol_Bij_Tijdstip($A73,J$8,J$11))+(0.75*L$18*FLOOR(L$20,0.05)*0.9*L$35*L$38*o_Isol_Bij_Tijdstip($A73,J$8,J$11))","v":168.8293815435506},"W",null,null,{"$f":"(0.75*N$18*FLOOR(N$20,0.05)*0.9*N$35*N$38*o_Isol_Bij_Tijdstip($A73,N$8,N$11))+(0.75*P$18*FLOOR(P$20,0.05)*0.9*P$35*P$38*o_Isol_Bij_Tijdstip($A73,N$8,N$11))","v":0},"W",null,null,{"$f":"(0.75*R$18*FLOOR(R$20,0.05)*0.9*R$35*R$38*o_Isol_Bij_Tijdstip($A73,R$8,R$11))+(0.75*T$18*FLOOR(T$20,0.05)*0.9*T$35*T$38*o_Isol_Bij_Tijdstip($A73,R$8,R$11))","v":0},"W",{"$f":"B73+F73+J73+N73+R73","v":266.72790367589181},"W"]
["10:00:00",{"$f":"(0.75*B$18*FLOOR(B$20,0.05)*0.9*B$35*B$38*o_Isol_Bij_Tijdstip($A74,B$8,B$11))+(0.75*D$18*FLOOR(D$20,0.05)*0.9*D$35*D$38*o_Isol_Bij_Tijdstip($A74,B$8,B$11))","v":109.44111457151438},"W",null,null,{"$f":"(0.75*F$18*FLOOR(F$20,0.05)*0.9*F$35*F$38*o_Isol_Bij_Tijdstip($A74,F$8,F$11))+(0.75*H$18*FLOOR(H$20,0.05)*0.9*H$35*H$38*o_Isol_Bij_Tijdstip($A74,F$8,F$11))","v":0},"W",null,null,{"$f":"(0.75*J$18*FLOOR(J$20,0.05)*0.9*J$35*J$38*o_Isol_Bij_Tijdstip($A74,J$8,J$11))+(0.75*L$18*FLOOR(L$20,0.05)*0.9*L$35*L$38*o_Isol_Bij_Tijdstip($A74,J$8,J$11))","v":307.42058412145235},"W",null,null,{"$f":"(0.75*N$18*FLOOR(N$20,0.05)*0.9*N$35*N$38*o_Isol_Bij_Tijdstip($A74,N$8,N$11))+(0.75*P$18*FLOOR(P$20,0.05)*0.9*P$35*P$38*o_Isol_Bij_Tijdstip($A74,N$8,N$11))","v":0},"W",null,null,{"$f":"(0.75*R$18*FLOOR(R$20,0.05)*0.9*R$35*R$38*o_Isol_Bij_Tijdstip($A74,R$8,R$11))+(0.75*T$18*FLOOR(T$20,0.05)*0.9*T$35*T$38*o_Isol_Bij_Tijdstip($A74,R$8,R$11))","v":0},"W",416.86169869296674,"W"]
["11:00:00",{"$f":"(0.75*B$18*FLOOR(B$20,0.05)*0.9*B$35*B$38*o_Isol_Bij_Tijdstip($A75,B$8,B$11))+(0.75*D$18*FLOOR(D$20,0.05)*0.9*D$35*D$38*o_Isol_Bij_Tijdstip($A75,B$8,B$11))","v":110.34995175391605},"W",null,null,{"$f":"(0.75*F$18*FLOOR(F$20,0.05)*0.9*F$35*F$38*o_Isol_Bij_Tijdstip($A75,F$8,F$11))+(0.75*H$18*FLOOR(H$20,0.05)*0.9*H$35*H$38*o_Isol_Bij_Tijdstip($A75,F$8,F$11))","v":0},"W",null,null,{"$f":"(0.75*J$18*FLOOR(J$20,0.05)*0.9*J$35*J$38*o_Isol_Bij_Tijdstip($A75,J$8,J$11))+(0.75*L$18*FLOOR(L$20,0.05)*0.9*L$35*L$38*o_Isol_Bij_Tijdstip($A75,J$8,J$11))","v":397.28584605934162},"W",null,null,{"$f":"(0.75*N$18*FLOOR(N$20,0.05)*0.9*N$35*N$38*o_Isol_Bij_Tijdstip($A75,N$8,N$11))+(0.75*P$18*FLOOR(P$20,0.05)*0.9*P$35*P$38*o_Isol_Bij_Tijdstip($A75,N$8,N$11))","v":0},"W",null,null,{"$f":"(0.75*R$18*FLOOR(R$20,0.05)*0.9*R$35*R$38*o_Isol_Bij_Tijdstip($A75,R$8,R$11))+(0.75*T$18*FLOOR(T$20,0.05)*0.9*T$35*T$38*o_Isol_Bij_Tijdstip($A75,R$8,R$11))","v":0},"W",507.63579781325768,"W"]
["12:00:00",{"$f":"(0.75*B$18*FLOOR(B$20,0.05)*0.9*B$35*B$38*o_Isol_Bij_Tijdstip($A76,B$8,B$11))+(0.75*D$18*FLOOR(D$20,0.05)*0.9*D$35*D$38*o_Isol_Bij_Tijdstip($A76,B$8,B$11))","v":114.40133630928025},"W",null,null,{"$f":"(0.75*F$18*FLOOR(F$20,0.05)*0.9*F$35*F$38*o_Isol_Bij_Tijdstip($A76,F$8,F$11))+(0.75*H$18*FLOOR(H$20,0.05)*0.9*H$35*H$38*o_Isol_Bij_Tijdstip($A76,F$8,F$11))","v":0},"W",null,null,{"$f":"(0.75*J$18*FLOOR(J$20,0.05)*0.9*J$35*J$38*o_Isol_Bij_Tijdstip($A76,J$8,J$11))+(0.75*L$18*FLOOR(L$20,0.05)*0.9*L$35*L$38*o_Isol_Bij_Tijdstip($A76,J$8,J$11))","v":465.64003445579397},"W",null,null,{"$f":"(0.75*N$18*FLOOR(N$20,0.05)*0.9*N$35*N$38*o_Isol_Bij_Tijdstip($A76,N$8,N$11))+(0.75*P$18*FLOOR(P$20,0.05)*0.9*P$35*P$38*o_Isol_Bij_Tijdstip($A76,N$8,N$11))","v":0},"W",null,null,{"$f":"(0.75*R$18*FLOOR(R$20,0.05)*0.9*R$35*R$38*o_Isol_Bij_Tijdstip($A76,R$8,R$11))+(0.75*T$18*FLOOR(T$20,0.05)*0.9*T$35*T$38*o_Isol_Bij_Tijdstip($A76,R$8,R$11))","v":0},"W",580.04137076507425,"W"]
["13:00:00",{"$f":"(0.75*B$18*FLOOR(B$20,0.05)*0.9*B$35*B$38*o_Isol_Bij_Tijdstip($A77,B$8,B$11))+(0.75*D$18*FLOOR(D$20,0.05)*0.9*D$35*D$38*o_Isol_Bij_Tijdstip($A77,B$8,B$11))","v":114.23688390930849},"W",null,null,{"$f":"(0.75*F$18*FLOOR(F$20,0.05)*0.9*F$35*F$38*o_Isol_Bij_Tijdstip($A77,F$8,F$11))+(0.75*H$18*FLOOR(H$20,0.05)*0.9*H$35*H$38*o_Isol_Bij_Tijdstip($A77,F$8,F$11))","v":0},"W",null,null,{"$f":"(0.75*J$18*FLOOR(J$20,0.05)*0.9*J$35*J$38*o_Isol_Bij_Tijdstip($A77,J$8,J$11))+(0.75*L$18*FLOOR(L$20,0.05)*0.9*L$35*L$38*o_Isol_Bij_Tijdstip($A77,J$8,J$11))","v":489.499521678311},"W",null,null,{"$f":"(0.75*N$18*FLOOR(N$20,0.05)*0.9*N$35*N$38*o_Isol_Bij_Tijdstip($A77,N$8,N$11))+(0.75*P$18*FLOOR(P$20,0.05)*0.9*P$35*P$38*o_Isol_Bij_Tijdstip($A77,N$8,N$11))","v":0},"W",null,null,{"$f":"(0.75*R$18*FLOOR(R$20,0.05)*0.9*R$35*R$38*o_Isol_Bij_Tijdstip($A77,R$8,R$11))+(0.75*T$18*FLOOR(T$20,0.05)*0.9*T$35*T$38*o_Isol_Bij_Tijdstip($A77,R$8,R$11))","v":0},"W",603.73640558761952,"W"]
["14:00:00",{"$f":"(0.75*B$18*FLOOR(B$20,0.05)*0.9*B$35*B$38*o_Isol_Bij_Tijdstip($A78,B$8,B$11))+(0.75*D$18*FLOOR(D$20,0.05)*0.9*D$35*D$38*o_Isol_Bij_Tijdstip($A78,B$8,B$11))","v":115.57769557271429},"W",null,null,{"$f":"(0.75*F$18*FLOOR(F$20,0.05)*0.9*F$35*F$38*o_Isol_Bij_Tijdstip($A78,F$8,F$11))+(0.75*H$18*FLOOR(H$20,0.05)*0.9*H$35*H$38*o_Isol_Bij_Tijdstip($A78,F$8,F$11))","v":0},"W",null,null,{"$f":"(0.75*J$18*FLOOR(J$20,0.05)*0.9*J$35*J$38*o_Isol_Bij_Tijdstip($A78,J$8,J$11))+(0.75*L$18*FLOOR(L$20,0.05)*0.9*L$35*L$38*o_Isol_Bij_Tijdstip($A78,J$8,J$11))","v":554.48872813845765},"W",null,null,{"$f":"(0.75*N$18*FLOOR(N$20,0.05)*0.9*N$35*N$38*o_Isol_Bij_Tijdstip($A78,N$8,N$11))+(0.75*P$18*FLOOR(P$20,0.05)*0.9*P$35*P$38*o_Isol_Bij_Tijdstip($A78,N$8,N$11))","v":0},"W",null,null,{"$f":"(0.75*R$18*FLOOR(R$20,0.05)*0.9*R$35*R$38*o_Isol_Bij_Tijdstip($A78,R$8,R$11))+(0.75*T$18*FLOOR(T$20,0.05)*0.9*T$35*T$38*o_Isol_Bij_Tijdstip($A78,R$8,R$11))","v":0},"W",670.06642371117198,"W"]
["15:00:00",{"$f":"(0.75*B$18*FLOOR(B$20,0.05)*0.9*B$35*B$38*o_Isol_Bij_Tijdstip($A79,B$8,B$11))+(0.75*D$18*FLOOR(D$20,0.05)*0.9*D$35*D$38*o_Isol_Bij_Tijdstip($A79,B$8,B$11))","v":116.42930349808567},"W",null,null,{"$f":"(0.75*F$18*FLOOR(F$20,0.05)*0.9*F$35*F$38*o_Isol_Bij_Tijdstip($A79,F$8,F$11))+(0.75*H$18*FLOOR(H$20,0.05)*0.9*H$35*H$38*o_Isol_Bij_Tijdstip($A79,F$8,F$11))","v":0},"W",null,null,{"$f":"(0.75*J$18*FLOOR(J$20,0.05)*0.9*J$35*J$38*o_Isol_Bij_Tijdstip($A79,J$8,J$11))+(0.75*L$18*FLOOR(L$20,0.05)*0.9*L$35*L$38*o_Isol_Bij_Tijdstip($A79,J$8,J$11))","v":446.7521977084366},"W",null,null,{"$f":"(0.75*N$18*FLOOR(N$20,0.05)*0.9*N$35*N$38*o_Isol_Bij_Tijdstip($A79,N$8,N$11))+(0.75*P$18*FLOOR(P$20,0.05)*0.9*P$35*P$38*o_Isol_Bij_Tijdstip($A79,N$8,N$11))","v":0},"W",null,null,{"$f":"(0.75*R$18*FLOOR(R$20,0.05)*0.9*R$35*R$38*o_Isol_Bij_Tijdstip($A79,R$8,R$11))+(0.75*T$18*FLOOR(T$20,0.05)*0.9*T$35*T$38*o_Isol_Bij_Tijdstip($A79,R$8,R$11))","v":0},"W",563.18150120652228,"W"]
["16:00:00",{"$f":"(0.75*B$18*FLOOR(B$20,0.05)*0.9*B$35*B$38*o_Isol_Bij_Tijdstip($A80,B$8,B$11))+(0.75*D$18*FLOOR(D$20,0.05)*0.9*D$35*D$38*o_Isol_Bij_Tijdstip($A80,B$8,B$11))","v":95.571782196434},"W",null,null,{"$f":"(0.75*F$18*FLOOR(F$20,0.05)*0.9*F$35*F$38*o_Isol_Bij_Tijdstip($A80,F$8,F$11))+(0.75*H$18*FLOOR(H$20,0.05)*0.9*H$35*H$38*o_Isol_Bij_Tijdstip($A80,F$8,F$11))","v":0},"W",null,null,{"$f":"(0.75*J$18*FLOOR(J$20,0.05)*0.9*J$35*J$38*o_Isol_Bij_Tijdstip($A80,J$8,J$11))+(0.75*L$18*FLOOR(L$20,0.05)*0.9*L$35*L$38*o_Isol_Bij_Tijdstip($A80,J$8,J$11))","v":283.95079838287768},"W",null,null,{"$f":"(0.75*N$18*FLOOR(N$20,0.05)*0.9*N$35*N$38*o_Isol_Bij_Tijdstip($A80,N$8,N$11))+(0.75*P$18*FLOOR(P$20,0.05)*0.9*P$35*P$38*o_Isol_Bij_Tijdstip($A80,N$8,N$11))","v":0},"W",null,null,{"$f":"(0.75*R$18*FLOOR(R$20,0.05)*0.9*R$35*R$38*o_Isol_Bij_Tijdstip($A80,R$8,R$11))+(0.75*T$18*FLOOR(T$20,0.05)*0.9*T$35*T$38*o_Isol_Bij_Tijdstip($A80,R$8,R$11))","v":0},"W",379.52258057931169,"W"]
["17:00:00",{"$f":"(0.75*B$18*FLOOR(B$20,0.05)*0.9*B$35*B$38*o_Isol_Bij_Tijdstip($A81,B$8,B$11))+(0.75*D$18*FLOOR(D$20,0.05)*0.9*D$35*D$38*o_Isol_Bij_Tijdstip($A81,B$8,B$11))","v":84.482274130252989},"W",null,null,{"$f":"(0.75*F$18*FLOOR(F$20,0.05)*0.9*F$35*F$38*o_Isol_Bij_Tijdstip($A81,F$8,F$11))+(0.75*H$18*FLOOR(H$20,0.05)*0.9*H$35*H$38*o_Isol_Bij_Tijdstip($A81,F$8,F$11))","v":0},"W",null,null,{"$f":"(0.75*J$18*FLOOR(J$20,0.05)*0.9*J$35*J$38*o_Isol_Bij_Tijdstip($A81,J$8,J$11))+(0.75*L$18*FLOOR(L$20,0.05)*0.9*L$35*L$38*o_Isol_Bij_Tijdstip($A81,J$8,J$11))","v":171.90979804208897},"W",null,null,{"$f":"(0.75*N$18*FLOOR(N$20,0.05)*0.9*N$35*N$38*o_Isol_Bij_Tijdstip($A81,N$8,N$11))+(0.75*P$18*FLOOR(P$20,0.05)*0.9*P$35*P$38*o_Isol_Bij_Tijdstip($A81,N$8,N$11))","v":0},"W",null,null,{"$f":"(0.75*R$18*FLOOR(R$20,0.05)*0.9*R$35*R$38*o_Isol_Bij_Tijdstip($A81,R$8,R$11))+(0.75*T$18*FLOOR(T$20,0.05)*0.9*T$35*T$38*o_Isol_Bij_Tijdstip($A81,R$8,R$11))","v":0},"W",256.39207217234195,"W"]
["18:00:00",{"$f":"(0.75*B$18*FLOOR(B$20,0.05)*0.9*B$35*B$38*o_Isol_Bij_Tijdstip($A82,B$8,B$11))+(0.75*D$18*FLOOR(D$20,0.05)*0.9*D$35*D$38*o_Isol_Bij_Tijdstip($A82,B$8,B$11))","v":82.772874734750289},"W",null,null,{"$f":"(0.75*F$18*FLOOR(F$20,0.05)*0.9*F$35*F$38*o_Isol_Bij_Tijdstip($A82,F$8,F$11))+(0.75*H$18*FLOOR(H$20,0.05)*0.9*H$35*H$38*o_Isol_Bij_Tijdstip($A82,F$8,F$11))","v":0},"W",null,null,{"$f":"(0.75*J$18*FLOOR(J$20,0.05)*0.9*J$35*J$38*o_Isol_Bij_Tijdstip($A82,J$8,J$11))+(0.75*L$18*FLOOR(L$20,0.05)*0.9*L$35*L$38*o_Isol_Bij_Tijdstip($A82,J$8,J$11))","v":62.983655710343413},"W",null,null,{"$f":"(0.75*N$18*FLOOR(N$20,0.05)*0.9*N$35*N$38*o_Isol_Bij_Tijdstip($A82,N$8,N$11))+(0.75*P$18*FLOOR(P$20,0.05)*0.9*P$35*P$38*o_Isol_Bij_Tijdstip($A82,N$8,N$11))","v":0},"W",null,null,{"$f":"(0.75*R$18*FLOOR(R$20,0.05)*0.9*R$35*R$38*o_Isol_Bij_Tijdstip($A82,R$8,R$11))+(0.75*T$18*FLOOR(T$20,0.05)*0.9*T$35*T$38*o_Isol_Bij_Tijdstip($A82,R$8,R$11))","v":0},"W",145.75653044509369,"W"]
[]
["Maatgevende tijdstip",{"$f":"IF(MAX(T73:T82)=0,\"Geen glas aanwezig\",_xlfn.XLOOKUP(MAX(T73:T82),T73:T82,A73:A82,\"nvt\"))","v":"14:00:00"}]

{"sheet":"Ruimte 2","index":4,"n_rows":84,"n_cols":21,"rows_kept":84,"cut":false,"hidden":false,"merged":[[66,0,67,20],[0,0,0,20],[6,1,6,3],[6,5,6,7],[6,9,6,11],[6,13,6,15],[6,17,6,20],[41,1,41,3],[41,5,41,7],[41,9,41,11],[41,13,41,15],[41,17,41,19],[40,1,40,3],[40,5,40,7],[40,9,40,11],[40,13,40,15],[40,17,40,19],[55,1,55,3],[55,5,55,7],[55,9,55,11],[55,13,55,15],[55,17,55,19],[54,1,54,3],[54,5,54,7],[54,9,54,11],[54,13,54,15],[54,17,54,19],[56,5,56,7],[56,9,56,11],[56,13,56,15],[56,17,56,19],[57,1,57,3],[57,5,57,7],[57,9,57,11],[57,13,57,15],[57,17,57,19],[59,1,59,3],[60,1,60,3],[62,1,62,3],[63,1,63,3],[56,1,56,3]]}
["RUIMTE 2"]
[]
["Ruimtenaam","Slaap 1"]
["Type verblijfsruimte","Andere verblijfsruimte"]
["Vloeroppervlak verblijfsruimte Avr  (gebruiksoppervlak)",11.8,"m²"]
[]
[null,"Voorzijde woning",null,null,null,"Linker zijde woning",null,null,null,"Achterzijde woning",null,null,null,"Rechter zijde woning",null,null,null,"Platdak"]
["Orientatie gevel / dakvlak (Helling > 15°C)",{"$f":"Invoerblad!$B$17","v":"Noord"},null,null,null,{"$f":"o_Orientatie(F9)","v":"Oost"},null,null,null,{"$f":"o_Orientatie(J9)","v":"Zuid"},null,null,null,{"$f":"o_Orientatie(N9)","v":"West"},null,null,null,"Horizontaal"]
["Orientatiehoek gevel Ƴ",{"$f":"o_OrientatiehOEK(B8)","v":0},null,null,null,{"$f":"IF(B9+90>360,B9+90-360,B9+90)","v":90},null,null,null,{"$f":"IF(F9+90>360,F9+90-360,F9+90)","v":180},null,null,null,{"$f":"IF(J9+90>360,J9+90-360,J9+90)","v":270}]
["Grenst aan buitenlucht ja of nee","Ja",null,null,null,"Nee",null,null,null,"Nee",null,null,null,"Nee",null,null,null,"Nee"]
["Hellingshoek constructie ≥ 15° = hellenddak 90° = gevel",90,"°",null,null,90,"°",null,null,90,"°",null,null,90,"°",null,null,10,"°"]
["Type constructie",{"$f":"o_TypeConstructie(B10,B11)","v":"Buitengevel"},null,null,null,{"$f":"o_TypeConstructie(F10,F11)","v":"Woningscheidend"},null,null,null,{"$f":"o_TypeConstructie(J10,J11)","v":"Woningscheidend"},null,null,null,{"$f":"o_TypeConstructie(N10,N11)","v":"Woningscheidend"},null,null,null,{"$f":"o_TypeConstructie(R10,R11)","v":"Woningscheidend"}]
["Gevel lengte (binnenwerks)",5,"m",null,null,5,"m",null,null,5,"m",null,null,5,"m",null,null,0,"m"]
["Gevel hoogte / Dak breedte (binnenwerks)",3,"m",null,null,3,"m",null,null,3,"m",null,null,3,"m",null,null,0,"m"]
["Constructie oppervlak (binnenwerks)",9.1999999999999993,"m²",null,null,{"$f":"F13*F14","v":15},"m²",null,null,{"$f":"J13*J14","v":15},"m²",null,null,{"$f":"N13*N14","v":15},"m²",null,null,{"$f":"R13*R14","v":0},"m²"]
["Gesloten constructie oppervlak",{"$f":"MAX(0,B15-B18-D18)","v":7.1999999999999993},"m²",null,null,{"$f":"MAX(0,F15-F18-H18)","v":13},"m²",null,null,{"$f":"MAX(0,J15-J18-L18)","v":13},"m²",null,null,{"$f":"MAX(0,N15-N18-P18)","v":13},"m²",null,null,{"$f":"MAX(0,R15-R18-T18)","v":0},"m²"]
[null,"Glasvlak type 1",null,"Glasvlak type 2",null,"Glasvlak type 1",null,"Glasvlak type 2",null,"Glasvlak type 1",null,"Glasvlak type 2",null,"Glasvlak type 1",null,"Glasvlak type 2",null,"Glasvlak type 1",null,"Glasvlak type 2"]
["Totaal oppervlak van raamtype Aw,k (inclusief kozijn)",2,"m²",null,"m²",2,"m²",null,"m²",2,"m²",null,"m²",2,"m²",null,"m²",null,"m²",null,"m²"]
["Warmtedoorgangscoefficient (U-waarde) van het raam Uw;wi;k",1.5,"W/m².K",null,"W/m².K",1.5,"W/m².K",null,"W/m².K",1.5,"W/m².K",null,"W/m².K",1.5,"W/m².K",null,"W/m².K",null,"W/m².K",null,"W/m².K"]
["Zontoetredingsfactor (g_waarde) van het glas Ggl;n;wi;k;C;juli",0.6,null,null,null,0.6,null,null,null,0.6,null,null,null,0.6]
["Beschaduwing situatie bij het raamtype","Minimale belemmering",null,"Minimale belemmering",null,"Minimale belemmering",null,"Minimale belemmering",null,"Minimale belemmering",null,"Minimale belemmering",null,"Minimale belemmering",null,"Minimale belemmering",null,"Minimale belemmering",null,"Minimale belemmering"]
[]
[null,"Overstek",null,"Overstek",null,"Overstek",null,"Overstek",null,"Overstek",null,"Overstek",null,"Overstek",null,"Overstek"]
["Hoogte verschil midden raam onderzijde overstek",0,"m",0,"m",0,"m",0,"m",0,"m",0,"m",0,"m",0,"m",0,null,null,"m"]
["Horizontale afstand glas tot eindpunt overstek",0,"m",0,"m",0,"m",0,"m",0,"m",0,"m",0,"m",0,"m",0,null,null,"m"]
["Overstekhoek",{"$f":"IFERROR(180/PI()*ATAN(B24/B25),0)","v":0},"°",{"$f":"IFERROR(180/PI()*ATAN(D24/D25),0)","v":0},"°",{"$f":"IFERROR(180/PI()*ATAN(F24/F25),0)","v":0},"°",{"$f":"IFERROR(180/PI()*ATAN(H24/H25),0)","v":0},"°",{"$f":"IFERROR(180/PI()*ATAN(J24/J25),0)","v":0},"°",{"$f":"IFERROR(180/PI()*ATAN(L24/L25),0)","v":0},"°",{"$f":"IFERROR(180/PI()*ATAN(N24/N25),0)","v":0},"°",{"$f":"IFERROR(180/PI()*ATAN(P24/P25),0)","v":0},"°",null,null,null,"°"]
["Relatieve hoogte van overstek",{"$f":"IFERROR(B24/B25,1)","v":1},null,{"$f":"IFERROR(D24/D25,1)","v":1},null,{"$f":"IFERROR(F24/F25,1)","v":1},null,{"$f":"IFERROR(H24/H25,1)","v":1},null,{"$f":"IFERROR(J24/J25,1)","v":1},null,{"$f":"IFERROR(L24/L25,1)","v":1},null,{"$f":"IFERROR(N24/N25,1)","v":1},null,{"$f":"IFERROR(P24/P25,1)","v":1}]
[]
[null,"Zijbelemmering",null,"Zijbelemmering",null,"Zijbelemmering",null,"Zijbelemmering",null,"Zijbelemmering",null,"Zijbelemmering",null,"Zijbelemmering",null,"Zijbelemmering"]
["Positie zijbelemmering irt zichtveld (naar buitengericht)","Links",null,"Links",null,"Links",null,"Links",null,"Links",null,"Links",null,"Links",null,"Links"]
["Horizontale afstand midden raam verste punt belemmering",0,"m",0,"m",null,"m",null,"m",null,"m",1,"m",null,"m",null,"m",null,null,null,"m"]
["Horizontale breedte glas tot eindpunt belemmering",0,"m",0,"m",null,"m",null,"m",null,"m",null,"m",null,"m",null,"m",null,null,null,"m"]
["Relatieve breedte van de zijbelemmering bb",{"$f":"IFERROR(B31/B32,999)","v":999},null,{"$f":"IFERROR(D31/D32,999)","v":999},null,{"$f":"IFERROR(F31/F32,999)","v":999},null,{"$f":"IFERROR(H31/H32,999)","v":999},null,{"$f":"IFERROR(J31/J32,999)","v":999},null,{"$f":"IFERROR(L31/L32,999)","v":999},null,{"$f":"IFERROR(N31/N32,999)","v":999},null,{"$f":"IFERROR(P31/P32,999)","v":999}]
[]
["De beschaduwingsreductiefactor Fsh;obst;wi;k;juli",{"$f":"IFERROR(o_Beschaduwingreductie(B21,B8,B27,B30,B33,B11),1)","v":1},null,{"$f":"IFERROR(o_Beschaduwingreductie(D21,B8,D27,D30,D33,B11),1)","v":1},null,{"$f":"IFERROR(o_Beschaduwingreductie(F21,F8,F27,F30,F33,F11),1)","v":1},null,{"$f":"IFERROR(o_Beschaduwingreductie(H21,F8,H27,H30,H33,F11),1)","v":1},null,{"$f":"IFERROR(o_Beschaduwingreductie(J21,J8,J27,J30,J33,J11),1)","v":1},null,{"$f":"IFERROR(o_Beschaduwingreductie(L21,J8,L27,L30,L33,J11),1)","v":1},null,{"$f":"IFERROR(o_Beschaduwingreductie(N21,N8,N27,N30,N33,N11),1)","v":1},null,{"$f":"IFERROR(o_Beschaduwingreductie(P21,N8,P27,P30,P33,N11),1)","v":1},null,{"$f":"o_Beschaduwingreductie(R21,R8,R27,R30,R33,R11)","v":1},null,{"$f":"o_Beschaduwingreductie(T21,R8,T27,T30,T33,R11)","v":1}]
[]
["Type zonwering","Geen zonwering",null,"Geen zonwering",null,"Geen zonwering",null,"Geen zonwering",null,"Geen zonwering",null,"Geen zonwering",null,"Geen zonwering",null,"Geen zonwering",null,"Geen zonwering",null,"Geen zonwering"]
["De reductiefactor voor zonwering Fc;wi;k",{"$f":"o_Zonweringreductie(B37,B8)","v":1},null,{"$f":"o_Zonweringreductie(D37,B8)","v":1},null,{"$f":"o_Zonweringreductie(F37,F8)","v":1},null,{"$f":"o_Zonweringreductie(H37,F8)","v":1},null,{"$f":"o_Zonweringreductie(J37,J8)","v":1},null,{"$f":"o_Zonweringreductie(L37,J8)","v":1},null,{"$f":"o_Zonweringreductie(N37,N8)","v":1},null,{"$f":"o_Zonweringreductie(P37,N8)","v":1},null,{"$f":"o_Zonweringreductie(R37,R8)","v":1},null,{"$f":"o_Zonweringreductie(T37,R8)","v":1}]
["Totaal opvallende zonnestraling van het raam Isol;wi;k;juli",{"$f":"IF(B10=\"Nee\",0,o_Isol_Bij_Tijdstip($B$52,B8,B11))","v":143.73988086183414},"W/m²",{"$f":"IF(B10=\"Nee\",0,o_Isol_Bij_Tijdstip($B$52,B8,B11))","v":143.73988086183414},"W/m²",{"$f":"IF(F10=\"Nee\",0,o_Isol_Bij_Tijdstip($B$52,F8,F11))","v":0},"W/m²",{"$f":"IF(F10=\"Nee\",0,o_Isol_Bij_Tijdstip($B$52,F8,F11))","v":0},"W/m²",{"$f":"IF(J10=\"Nee\",0,o_Isol_Bij_Tijdstip($B$52,J8,J11))","v":0},"W/m²",{"$f":"IF(J10=\"Nee\",0,o_Isol_Bij_Tijdstip($B$52,J8,J11))","v":0},"W/m²",{"$f":"IF(N10=\"Nee\",0,o_Isol_Bij_Tijdstip($B$52,N8,N11))","v":0},"W/m²",{"$f":"IF(N10=\"Nee\",0,o_Isol_Bij_Tijdstip($B$52,N8,N11))","v":0},"W/m²",{"$f":"IF(R10=\"Nee\",0,o_Isol_Bij_Tijdstip($B$52,R8,R11))","v":0},"W/m²",{"$f":"IF(R10=\"Nee\",0,o_Isol_Bij_Tijdstip($B$52,R8,R11))","v":0},"W/m²"]
[]
["Tijdstip maximale koellastbijdrage tmax;zi",{"$f":"VALUE(o_Tijdstip_Isol_Max_Orientatie(B8,B11))","v":"15:00:00"},null,null,null,{"$f":"VALUE(o_Tijdstip_Isol_Max_Orientatie(F8,F11))","v":"09:00:00"},null,null,null,{"$f":"VALUE(o_Tijdstip_Isol_Max_Orientatie(J8,J11))","v":"14:00:00"},null,null,null,{"$f":"VALUE(o_Tijdstip_Isol_Max_Orientatie(N8,N11))","v":"18:00:00"},null,null,null,{"$f":"o_Tijdstip_Isol_Max_Orientatie(R8,R11)","v":"16:00:00"}]
["Buitenluchttemperatuur op tijdstip max koellast Θe",{"$f":"o_maxTemp(VALUE(B41))","v":29.8},null,null,"°C",{"$f":"o_maxTemp(VALUE(F41))","v":24.7},null,null,"°C",{"$f":"o_maxTemp(VALUE(J41))","v":29.9},null,null,"°C",{"$f":"o_maxTemp(VALUE(N41))","v":30.1},null,null,"°C",{"$f":"o_maxTemp(VALUE(R41))","v":30.4}]
[]
["Glasopppervlak",{"$f":"IF(B10=\"Ja\",B18+D18,0)","v":2},"m²",null,null,{"$f":"IF(F10=\"Ja\",F18+H18,0)","v":0},"m²",null,null,{"$f":"IF(J10=\"Ja\",J18+L18,0)","v":0},"m²",null,null,{"$f":"IF(N10=\"Ja\",N18+P18,0)","v":0},"m²",null,null,{"$f":"IF(R10=\"Ja\",R18+T18,0)","v":0},"m²"]
["Uitwendigescheidingsconstructie niet op Noord?",{"$f":"IF(B10=\"Ja\",IF(B8=\"Noord\",FALSE,TRUE),FALSE)","v":false},null,null,null,{"$f":"IF(F10=\"Ja\",IF(F8=\"Noord\",FALSE,TRUE),FALSE)","v":false},null,null,null,{"$f":"IF(J10=\"Ja\",IF(J8=\"Noord\",FALSE,TRUE),FALSE)","v":false},null,null,null,{"$f":"IF(N10=\"Ja\",IF(N8=\"Noord\",FALSE,TRUE),FALSE)","v":false},null,null,null,{"$f":"IF(R10=\"Ja\",IF(R8=\"Noord\",FALSE,TRUE),FALSE)","v":false}]
["De enige uitwendigescheidingscontructie?",{"$f":"IF(AND(B45=TRUE,COUNTIF($B$45:$R$45,TRUE)=1),TRUE,FALSE)","v":false},null,null,null,{"$f":"IF(AND(F45=TRUE,COUNTIF($B$45:$R$45,TRUE)=1),TRUE,FALSE)","v":false},null,null,null,{"$f":"IF(AND(J45=TRUE,COUNTIF($B$45:$R$45,TRUE)=1),TRUE,FALSE)","v":false},null,null,null,{"$f":"IF(AND(N45=TRUE,COUNTIF($B$45:$R$45,TRUE)=1),TRUE,FALSE)","v":false},null,null,null,{"$f":"IF(AND(R45=TRUE,COUNTIF($B$45:$R$45,TRUE)=1),TRUE,FALSE)","v":false}]
["Totaal glasoppervlak",{"$f":"IF(B8<>\"Noord\",B44,0)","v":0},"m²",null,null,{"$f":"IF(F8<>\"Noord\",F44,0)","v":0},"m²",null,null,{"$f":"IF(J8<>\"Noord\",J44,0)","v":0},"m²",null,null,{"$f":"IF(N8<>\"Noord\",N44,0)","v":0},"m²",null,null,{"$f":"R44","v":0},"m²"]
["Grootste glasoppervlak ",{"$f":"IF(AND(B45,B47=MAX($B$47:$R$47)),TRUE,FALSE)","v":false},null,null,null,{"$f":"IF(AND(F45,F47=MAX($B$47:$R$47)),TRUE,FALSE)","v":false},null,null,null,{"$f":"IF(AND(J45,J47=MAX($B$47:$R$47)),TRUE,FALSE)","v":false},null,null,null,{"$f":"IF(AND(N45,N47=MAX($B$47:$R$47)),TRUE,FALSE)","v":false},null,null,null,{"$f":"IF(AND(R45,R47=MAX($B$47:$R$47)),TRUE,FALSE)","v":false}]
["Dakvlak maatgevend?",{"$f":"IF(AND(B11<90,B15>3*(B18+D18),Invoerblad!$B$25<65),TRUE,FALSE)","v":false},null,null,null,{"$f":"IF(AND(F11<90,F15>3*(F18+H18),Invoerblad!$B$25<65),TRUE,FALSE)","v":false},null,null,null,{"$f":"IF(AND(J11<90,J15>3*(J18+L18),Invoerblad!$B$25<65),TRUE,FALSE)","v":false},null,null,null,{"$f":"IF(AND(N11<90,N15>3*(N18+P18),Invoerblad!$B$25<65),TRUE,FALSE)","v":false},null,null,null,{"$f":"IF(AND(R11<90,R15>3*(R18+T18),Invoerblad!$B$25<65),TRUE,FALSE)","v":false}]
["is er een maatgevend dakoppervlak",{"$f":"IF(COUNTIF($B$49:$R$49,TRUE)>0,TRUE,FALSE)","v":false},null,null,null,{"$f":"IF(COUNTIF($B$49:$R$49,TRUE)>0,TRUE,FALSE)","v":false},null,null,null,{"$f":"IF(COUNTIF($B$49:$R$49,TRUE)>0,TRUE,FALSE)","v":false},null,null,null,{"$f":"IF(COUNTIF($B$49:$R$49,TRUE)>0,TRUE,FALSE)","v":false},null,null,null,{"$f":"IF(COUNTIF($B$49:$R$49,TRUE)>0,TRUE,FALSE)","v":false}]
["Maatgevende tijdstip",{"$f":"IF(OR(B46,AND(B45,B50,B49),AND(B45,B48,NOT(B50))),B41)","v":false},null,null,null,{"$f":"IF(OR(F46,AND(F45,F50,F49),AND(F45,F48,NOT(F50))),F41)","v":false},null,null,null,{"$f":"IF(OR(J46,AND(J45,J50,J49),AND(J45,J48,NOT(J50))),J41)","v":false},null,null,null,{"$f":"IF(OR(N46,AND(N45,N50,N49),AND(N45,N48,NOT(N50))),N41)","v":false},null,null,null,{"$f":"IF(OR(R46,AND(R45,R50,R49),AND(R45,R48,NOT(R50))),R41)","v":false}]
["Maatgevende tijdstip tmax;zi",{"$f":"IFERROR(B84,\"geen glas ingevoerd\")","v":"15:00:00"}]
["Buitenluchttemperatuur op tijdstip max koellast Θe",{"$f":"o_maxTemp(VALUE(B52))","v":29.800000000000015},"°C"]
[]
["Koellastbijdrage transmissie transparante delen Ptr;gl;vr;zi",{"$f":"IF(B10=\"Nee\",0,B16*Invoerblad!$B$16)","v":15.84},null,null,"W",{"$f":"IF(F10=\"Nee\",0,F16*Invoerblad!$B$16)","v":0},null,null,"W",{"$f":"IF(J10=\"Nee\",0,J16*Invoerblad!$B$16)","v":0},null,null,"W",{"$f":"IF(N10=\"Nee\",0,N16*Invoerblad!$B$16)","v":0},null,null,"W",{"$f":"IF(R10=\"Nee\",0,R16*Invoerblad!$B$16)","v":0},null,null,"W"]
["Koellastbijdrage zoninstraling transparante delen Psol;vr;zi",{"$f":"(0.75*B18*FLOOR(B20,0.05)*0.9*B35*B38*B39)+(0.75*D18*FLOOR(D20,0.05)*0.9*D35*D38*D39)","v":116.42930349808567},null,null,"W",{"$f":"(0.75*F18*FLOOR(F20,0.05)*0.9*F35*F38*F39)+(0.75*H18*FLOOR(H20,0.05)*0.9*H35*H38*H39)","v":0},null,null,"W",{"$f":"(0.75*J18*FLOOR(J20,0.05)*0.9*J35*J38*J39)+(0.75*L18*FLOOR(L20,0.05)*0.9*L35*L38*L39)","v":0},null,null,"W",{"$f":"(0.75*N18*FLOOR(N20,0.05)*0.9*N35*N38*N39)+(0.75*P18*FLOOR(P20,0.05)*0.9*P35*P38*P39)","v":0},null,null,"W",{"$f":"(0.75*R18*FLOOR(R20,0.05)*0.9*R35*R38*R39)+(0.75*T18*FLOOR(T20,0.05)*0.9*T35*T38*T39)","v":0},null,null,"W"]
["Koellastbijdrage transmissie transparante delen Ptr;gl;vr;zi",{"$f":"IF(B10=\"Nee\",0,IFERROR(B18*B19*($B$53-24),0)+IFERROR(D18*D19*($B$53-24),0))","v":17.400000000000045},null,null,"W",{"$f":"IF(F10=\"Nee\",0,IFERROR(F18*F19*($B$53-24),0)+IFERROR(H18*H19*($B$53-24),0))","v":0},null,null,"W",{"$f":"IF(J10=\"Nee\",0,IFERROR(J18*J19*($B$53-24),0)+IFERROR(L18*L19*($B$53-24),0))","v":0},null,null,"W",{"$f":"IF(N10=\"Nee\",0,IFERROR(N18*N19*($B$53-24),0)+IFERROR(P18*P19*($B$53-24),0))","v":0},null,null,"W",{"$f":"IF(R10=\"Nee\",0,IFERROR(R18*R19*($B$53-24),0)+IFERROR(T18*T19*($B$53-24),0))","v":0},null,null,"W"]
["Totaal koellastbijdrage per gevel",{"$f":"SUM(B55:D57)","v":149.6693034980857},null,null,"W",{"$f":"SUM(F55:H57)","v":0},null,null,"W",{"$f":"SUM(J55:L57)","v":0},null,null,"W",{"$f":"SUM(N55:P57)","v":0},null,null,"W",{"$f":"SUM(R55:R57)","v":0},null,null,"W"]
[]
["Koellast door interne warmtelast Pint;calc;woon/overig;zi",{"$f":"IF(B5=0,0,IF(B4=\"Woonvertrek\",2*Invoerblad!$B$40*B5,Invoerblad!$B$40*B5))","v":38.553989361702129},null,null,"W"]
["Koellast door buitenluchttoetreding Pv;calc;vr;zi",{"$f":"IFERROR(MAX((SUM(Invoerblad!$B$28:$B$30)/3600*1.205*1005*(B53-24))/SUM(Invoerblad!$B$47:$T$47)*B5,0),0)","v":51.99925588606601},{"$f":"IFERROR(MAX(SUM(C57:C59)/3600*1.205*1005*(C60-24),0),0)","v":0},{"$f":"IFERROR(MAX(SUM(D57:D59)/3600*1.205*1005*(D60-24),0),0)","v":0},"W"]
[]
["Totaal koellastbijdrage",{"$f":"IFERROR(SUM(B58:T58)+B60+B61,0)","v":240.22254874585383},null,null,"W"]
["Koelbehoefte verblijfsruimte",{"$f":"IFERROR(B63/B5,0)","v":20.357843114055409},null,null,"W/m²"]
[]
[]
["Onderstaande tabellen worden verborgen in de uiteindelijke versie. De tabellen dienen om vast te stellen welk tijdstip tot de hoogste zonbelasting leidt"]
[]
["Isol max voor de orientatie",{"$f":"o_Isol_Max_Orientatie(B8,B11)","v":143.73988086183414},"W/m²",null,null,{"$f":"o_Isol_Max_Orientatie(F8,F11)","v":845.32772366250799},"W/m²",null,null,{"$f":"o_Isol_Max_Orientatie(J8,J11)","v":740.05836254715712},"W/m²",null,null,{"$f":"o_Isol_Max_Orientatie(N8,N11)","v":741.75809294382429},"W/m²",null,null,{"$f":"o_Isol_Max_Orientatie(R8,R11)","v":914.16092603772574},"W/m²"]
["Tijdstip bij Isol max bij orientatie",{"$f":"VALUE(o_Tijdstip_Isol_Max_Orientatie(B8,B11))","v":"15:00:00"},null,null,null,{"$f":"VALUE(o_Tijdstip_Isol_Max_Orientatie(F8,F11))","v":"09:00:00"},null,null,null,{"$f":"VALUE(o_Tijdstip_Isol_Max_Orientatie(J8,J11))","v":"14:00:00"},null,null,null,{"$f":"VALUE(o_Tijdstip_Isol_Max_Orientatie(N8,N11))","v":"18:00:00"},null,null,null,{"$f":"VALUE(o_Tijdstip_Isol_Max_Orientatie(R8,R11))","v":"16:00:00"}]
[]
["Koellastbijdrage zoninstraling transparante delen Psol;vr;zi"]
["09:00:00",{"$f":"(0.75*B$18*FLOOR(B$20,0.05)*0.9*B$35*B$38*o_Isol_Bij_Tijdstip($A73,B$8,B$11))+(0.75*D$18*FLOOR(D$20,0.05)*0.9*D$35*D$38*o_Isol_Bij_Tijdstip($A73,B$8,B$11))","v":97.898522132341199},"W",null,null,{"$f":"(0.75*F$18*FLOOR(F$20,0.05)*0.9*F$35*F$38*o_Isol_Bij_Tijdstip($A73,F$8,F$11))+(0.75*H$18*FLOOR(H$20,0.05)*0.9*H$35*H$38*o_Isol_Bij_Tijdstip($A73,F$8,F$11))","v":684.71545616663161},"W",null,null,{"$f":"(0.75*J$18*FLOOR(J$20,0.05)*0.9*J$35*J$38*o_Isol_Bij_Tijdstip($A73,J$8,J$11))+(0.75*L$18*FLOOR(L$20,0.05)*0.9*L$35*L$38*o_Isol_Bij_Tijdstip($A73,J$8,J$11))","v":182.51825031735197},"W",null,null,{"$f":"(0.75*N$18*FLOOR(N$20,0.05)*0.9*N$35*N$38*o_Isol_Bij_Tijdstip($A73,N$8,N$11))+(0.75*P$18*FLOOR(P$20,0.05)*0.9*P$35*P$38*o_Isol_Bij_Tijdstip($A73,N$8,N$11))","v":97.898522132341199},"W",null,null,{"$f":"(0.75*R$18*FLOOR(R$20,0.05)*0.9*R$35*R$38*o_Isol_Bij_Tijdstip($A73,R$8,R$11))+(0.75*T$18*FLOOR(T$20,0.05)*0.9*T$35*T$38*o_Isol_Bij_Tijdstip($A73,R$8,R$11))","v":0},"W",{"$f":"B73+F73+J73+N73+R73","v":1063.0307507486659},"W"]
["10:00:00",{"$f":"(0.75*B$18*FLOOR(B$20,0.05)*0.9*B$35*B$38*o_Isol_Bij_Tijdstip($A74,B$8,B$11))+(0.75*D$18*FLOOR(D$20,0.05)*0.9*D$35*D$38*o_Isol_Bij_Tijdstip($A74,B$8,B$11))","v":109.44111457151438},"W",null,null,{"$f":"(0.75*F$18*FLOOR(F$20,0.05)*0.9*F$35*F$38*o_Isol_Bij_Tijdstip($A74,F$8,F$11))+(0.75*H$18*FLOOR(H$20,0.05)*0.9*H$35*H$38*o_Isol_Bij_Tijdstip($A74,F$8,F$11))","v":656.29323222956225},"W",null,null,{"$f":"(0.75*J$18*FLOOR(J$20,0.05)*0.9*J$35*J$38*o_Isol_Bij_Tijdstip($A74,J$8,J$11))+(0.75*L$18*FLOOR(L$20,0.05)*0.9*L$35*L$38*o_Isol_Bij_Tijdstip($A74,J$8,J$11))","v":332.34657742859713},"W",null,null,{"$f":"(0.75*N$18*FLOOR(N$20,0.05)*0.9*N$35*N$38*o_Isol_Bij_Tijdstip($A74,N$8,N$11))+(0.75*P$18*FLOOR(P$20,0.05)*0.9*P$35*P$38*o_Isol_Bij_Tijdstip($A74,N$8,N$11))","v":109.44111457151438},"W",null,null,{"$f":"(0.75*R$18*FLOOR(R$20,0.05)*0.9*R$35*R$38*o_Isol_Bij_Tijdstip($A74,R$8,R$11))+(0.75*T$18*FLOOR(T$20,0.05)*0.9*T$35*T$38*o_Isol_Bij_Tijdstip($A74,R$8,R$11))","v":0},"W",1207.522038801188,"W"]
["11:00:00",{"$f":"(0.75*B$18*FLOOR(B$20,0.05)*0.9*B$35*B$38*o_Isol_Bij_Tijdstip($A75,B$8,B$11))+(0.75*D$18*FLOOR(D$20,0.05)*0.9*D$35*D$38*o_Isol_Bij_Tijdstip($A75,B$8,B$11))","v":110.34995175391605},"W",null,null,{"$f":"(0.75*F$18*FLOOR(F$20,0.05)*0.9*F$35*F$38*o_Isol_Bij_Tijdstip($A75,F$8,F$11))+(0.75*H$18*FLOOR(H$20,0.05)*0.9*H$35*H$38*o_Isol_Bij_Tijdstip($A75,F$8,F$11))","v":505.38952431680167},"W",null,null,{"$f":"(0.75*J$18*FLOOR(J$20,0.05)*0.9*J$35*J$38*o_Isol_Bij_Tijdstip($A75,J$8,J$11))+(0.75*L$18*FLOOR(L$20,0.05)*0.9*L$35*L$38*o_Isol_Bij_Tijdstip($A75,J$8,J$11))","v":429.498211956045},"W",null,null,{"$f":"(0.75*N$18*FLOOR(N$20,0.05)*0.9*N$35*N$38*o_Isol_Bij_Tijdstip($A75,N$8,N$11))+(0.75*P$18*FLOOR(P$20,0.05)*0.9*P$35*P$38*o_Isol_Bij_Tijdstip($A75,N$8,N$11))","v":110.34995175391605},"W",null,null,{"$f":"(0.75*R$18*FLOOR(R$20,0.05)*0.9*R$35*R$38*o_Isol_Bij_Tijdstip($A75,R$8,R$11))+(0.75*T$18*FLOOR(T$20,0.05)*0.9*T$35*T$38*o_Isol_Bij_Tijdstip($A75,R$8,R$11))","v":0},"W",1155.5876397806787,"W"]
["12:00:00",{"$f":"(0.75*B$18*FLOOR(B$20,0.05)*0.9*B$35*B$38*o_Isol_Bij_Tijdstip($A76,B$8,B$11))+(0.75*D$18*FLOOR(D$20,0.05)*0.9*D$35*D$38*o_Isol_Bij_Tijdstip($A76,B$8,B$11))","v":114.40133630928025},"W",null,null,{"$f":"(0.75*F$18*FLOOR(F$20,0.05)*0.9*F$35*F$38*o_Isol_Bij_Tijdstip($A76,F$8,F$11))+(0.75*H$18*FLOOR(H$20,0.05)*0.9*H$35*H$38*o_Isol_Bij_Tijdstip($A76,F$8,F$11))","v":334.35471285165312},"W",null,null,{"$f":"(0.75*J$18*FLOOR(J$20,0.05)*0.9*J$35*J$38*o_Isol_Bij_Tijdstip($A76,J$8,J$11))+(0.75*L$18*FLOOR(L$20,0.05)*0.9*L$35*L$38*o_Isol_Bij_Tijdstip($A76,J$8,J$11))","v":503.39463184410153},"W",null,null,{"$f":"(0.75*N$18*FLOOR(N$20,0.05)*0.9*N$35*N$38*o_Isol_Bij_Tijdstip($A76,N$8,N$11))+(0.75*P$18*FLOOR(P$20,0.05)*0.9*P$35*P$38*o_Isol_Bij_Tijdstip($A76,N$8,N$11))","v":114.40133630928025},"W",null,null,{"$f":"(0.75*R$18*FLOOR(R$20,0.05)*0.9*R$35*R$38*o_Isol_Bij_Tijdstip($A76,R$8,R$11))+(0.75*T$18*FLOOR(T$20,0.05)*0.9*T$35*T$38*o_Isol_Bij_Tijdstip($A76,R$8,R$11))","v":0},"W",1066.552017314315,"W"]
["13:00:00",{"$f":"(0.75*B$18*FLOOR(B$20,0.05)*0.9*B$35*B$38*o_Isol_Bij_Tijdstip($A77,B$8,B$11))+(0.75*D$18*FLOOR(D$20,0.05)*0.9*D$35*D$38*o_Isol_Bij_Tijdstip($A77,B$8,B$11))","v":114.23688390930849},"W",null,null,{"$f":"(0.75*F$18*FLOOR(F$20,0.05)*0.9*F$35*F$38*o_Isol_Bij_Tijdstip($A77,F$8,F$11))+(0.75*H$18*FLOOR(H$20,0.05)*0.9*H$35*H$38*o_Isol_Bij_Tijdstip($A77,F$8,F$11))","v":137.77939300359336},"W",null,null,{"$f":"(0.75*J$18*FLOOR(J$20,0.05)*0.9*J$35*J$38*o_Isol_Bij_Tijdstip($A77,J$8,J$11))+(0.75*L$18*FLOOR(L$20,0.05)*0.9*L$35*L$38*o_Isol_Bij_Tijdstip($A77,J$8,J$11))","v":529.18867208466054},"W",null,null,{"$f":"(0.75*N$18*FLOOR(N$20,0.05)*0.9*N$35*N$38*o_Isol_Bij_Tijdstip($A77,N$8,N$11))+(0.75*P$18*FLOOR(P$20,0.05)*0.9*P$35*P$38*o_Isol_Bij_Tijdstip($A77,N$8,N$11))","v":114.23688390930849},"W",null,null,{"$f":"(0.75*R$18*FLOOR(R$20,0.05)*0.9*R$35*R$38*o_Isol_Bij_Tijdstip($A77,R$8,R$11))+(0.75*T$18*FLOOR(T$20,0.05)*0.9*T$35*T$38*o_Isol_Bij_Tijdstip($A77,R$8,R$11))","v":0},"W",895.4418329068709,"W"]
["14:00:00",{"$f":"(0.75*B$18*FLOOR(B$20,0.05)*0.9*B$35*B$38*o_Isol_Bij_Tijdstip($A78,B$8,B$11))+(0.75*D$18*FLOOR(D$20,0.05)*0.9*D$35*D$38*o_Isol_Bij_Tijdstip($A78,B$8,B$11))","v":115.57769557271429},"W",null,null,{"$f":"(0.75*F$18*FLOOR(F$20,0.05)*0.9*F$35*F$38*o_Isol_Bij_Tijdstip($A78,F$8,F$11))+(0.75*H$18*FLOOR(H$20,0.05)*0.9*H$35*H$38*o_Isol_Bij_Tijdstip($A78,F$8,F$11))","v":115.57769557271429},"W",null,null,{"$f":"(0.75*J$18*FLOOR(J$20,0.05)*0.9*J$35*J$38*o_Isol_Bij_Tijdstip($A78,J$8,J$11))+(0.75*L$18*FLOOR(L$20,0.05)*0.9*L$35*L$38*o_Isol_Bij_Tijdstip($A78,J$8,J$11))","v":599.44727366319739},"W",null,null,{"$f":"(0.75*N$18*FLOOR(N$20,0.05)*0.9*N$35*N$38*o_Isol_Bij_Tijdstip($A78,N$8,N$11))+(0.75*P$18*FLOOR(P$20,0.05)*0.9*P$35*P$38*o_Isol_Bij_Tijdstip($A78,N$8,N$11))","v":306.05436716007608},"W",null,null,{"$f":"(0.75*R$18*FLOOR(R$20,0.05)*0.9*R$35*R$38*o_Isol_Bij_Tijdstip($A78,R$8,R$11))+(0.75*T$18*FLOOR(T$20,0.05)*0.9*T$35*T$38*o_Isol_Bij_Tijdstip($A78,R$8,R$11))","v":0},"W",1136.6570319687021,"W"]
["15:00:00",{"$f":"(0.75*B$18*FLOOR(B$20,0.05)*0.9*B$35*B$38*o_Isol_Bij_Tijdstip($A79,B$8,B$11))+(0.75*D$18*FLOOR(D$20,0.05)*0.9*D$35*D$38*o_Isol_Bij_Tijdstip($A79,B$8,B$11))","v":116.42930349808567},"W",null,null,{"$f":"(0.75*F$18*FLOOR(F$20,0.05)*0.9*F$35*F$38*o_Isol_Bij_Tijdstip($A79,F$8,F$11))+(0.75*H$18*FLOOR(H$20,0.05)*0.9*H$35*H$38*o_Isol_Bij_Tijdstip($A79,F$8,F$11))","v":116.42930349808567},"W",null,null,{"$f":"(0.75*J$18*FLOOR(J$20,0.05)*0.9*J$35*J$38*o_Isol_Bij_Tijdstip($A79,J$8,J$11))+(0.75*L$18*FLOOR(L$20,0.05)*0.9*L$35*L$38*o_Isol_Bij_Tijdstip($A79,J$8,J$11))","v":482.97534887398547},"W",null,null,{"$f":"(0.75*N$18*FLOOR(N$20,0.05)*0.9*N$35*N$38*o_Isol_Bij_Tijdstip($A79,N$8,N$11))+(0.75*P$18*FLOOR(P$20,0.05)*0.9*P$35*P$38*o_Isol_Bij_Tijdstip($A79,N$8,N$11))","v":500.26543789792493},"W",null,null,{"$f":"(0.75*R$18*FLOOR(R$20,0.05)*0.9*R$35*R$38*o_Isol_Bij_Tijdstip($A79,R$8,R$11))+(0.75*T$18*FLOOR(T$20,0.05)*0.9*T$35*T$38*o_Isol_Bij_Tijdstip($A79,R$8,R$11))","v":0},"W",1216.0993937680819,"W"]
["16:00:00",{"$f":"(0.75*B$18*FLOOR(B$20,0.05)*0.9*B$35*B$38*o_Isol_Bij_Tijdstip($A80,B$8,B$11))+(0.75*D$18*FLOOR(D$20,0.05)*0.9*D$35*D$38*o_Isol_Bij_Tijdstip($A80,B$8,B$11))","v":95.571782196434},"W",null,null,{"$f":"(0.75*F$18*FLOOR(F$20,0.05)*0.9*F$35*F$38*o_Isol_Bij_Tijdstip($A80,F$8,F$11))+(0.75*H$18*FLOOR(H$20,0.05)*0.9*H$35*H$38*o_Isol_Bij_Tijdstip($A80,F$8,F$11))","v":95.571782196434},"W",null,null,{"$f":"(0.75*J$18*FLOOR(J$20,0.05)*0.9*J$35*J$38*o_Isol_Bij_Tijdstip($A80,J$8,J$11))+(0.75*L$18*FLOOR(L$20,0.05)*0.9*L$35*L$38*o_Isol_Bij_Tijdstip($A80,J$8,J$11))","v":306.97383608959746},"W",null,null,{"$f":"(0.75*N$18*FLOOR(N$20,0.05)*0.9*N$35*N$38*o_Isol_Bij_Tijdstip($A80,N$8,N$11))+(0.75*P$18*FLOOR(P$20,0.05)*0.9*P$35*P$38*o_Isol_Bij_Tijdstip($A80,N$8,N$11))","v":543.7764340958098},"W",null,null,{"$f":"(0.75*R$18*FLOOR(R$20,0.05)*0.9*R$35*R$38*o_Isol_Bij_Tijdstip($A80,R$8,R$11))+(0.75*T$18*FLOOR(T$20,0.05)*0.9*T$35*T$38*o_Isol_Bij_Tijdstip($A80,R$8,R$11))","v":0},"W",1041.8938345782753,"W"]
["17:00:00",{"$f":"(0.75*B$18*FLOOR(B$20,0.05)*0.9*B$35*B$38*o_Isol_Bij_Tijdstip($A81,B$8,B$11))+(0.75*D$18*FLOOR(D$20,0.05)*0.9*D$35*D$38*o_Isol_Bij_Tijdstip($A81,B$8,B$11))","v":84.482274130252989},"W",null,null,{"$f":"(0.75*F$18*FLOOR(F$20,0.05)*0.9*F$35*F$38*o_Isol_Bij_Tijdstip($A81,F$8,F$11))+(0.75*H$18*FLOOR(H$20,0.05)*0.9*H$35*H$38*o_Isol_Bij_Tijdstip($A81,F$8,F$11))","v":84.482274130252989},"W",null,null,{"$f":"(0.75*J$18*FLOOR(J$20,0.05)*0.9*J$35*J$38*o_Isol_Bij_Tijdstip($A81,J$8,J$11))+(0.75*L$18*FLOOR(L$20,0.05)*0.9*L$35*L$38*o_Isol_Bij_Tijdstip($A81,J$8,J$11))","v":185.84843031577185},"W",null,null,{"$f":"(0.75*N$18*FLOOR(N$20,0.05)*0.9*N$35*N$38*o_Isol_Bij_Tijdstip($A81,N$8,N$11))+(0.75*P$18*FLOOR(P$20,0.05)*0.9*P$35*P$38*o_Isol_Bij_Tijdstip($A81,N$8,N$11))","v":574.57407130568993},"W",null,null,{"$f":"(0.75*R$18*FLOOR(R$20,0.05)*0.9*R$35*R$38*o_Isol_Bij_Tijdstip($A81,R$8,R$11))+(0.75*T$18*FLOOR(T$20,0.05)*0.9*T$35*T$38*o_Isol_Bij_Tijdstip($A81,R$8,R$11))","v":0},"W",929.38704988196776,"W"]
["18:00:00",{"$f":"(0.75*B$18*FLOOR(B$20,0.05)*0.9*B$35*B$38*o_Isol_Bij_Tijdstip($A82,B$8,B$11))+(0.75*D$18*FLOOR(D$20,0.05)*0.9*D$35*D$38*o_Isol_Bij_Tijdstip($A82,B$8,B$11))","v":82.772874734750289},"W",null,null,{"$f":"(0.75*F$18*FLOOR(F$20,0.05)*0.9*F$35*F$38*o_Isol_Bij_Tijdstip($A82,F$8,F$11))+(0.75*H$18*FLOOR(H$20,0.05)*0.9*H$35*H$38*o_Isol_Bij_Tijdstip($A82,F$8,F$11))","v":68.090438605776654},"W",null,null,{"$f":"(0.75*J$18*FLOOR(J$20,0.05)*0.9*J$35*J$38*o_Isol_Bij_Tijdstip($A82,J$8,J$11))+(0.75*L$18*FLOOR(L$20,0.05)*0.9*L$35*L$38*o_Isol_Bij_Tijdstip($A82,J$8,J$11))","v":68.090438605776654},"W",null,null,{"$f":"(0.75*N$18*FLOOR(N$20,0.05)*0.9*N$35*N$38*o_Isol_Bij_Tijdstip($A82,N$8,N$11))+(0.75*P$18*FLOOR(P$20,0.05)*0.9*P$35*P$38*o_Isol_Bij_Tijdstip($A82,N$8,N$11))","v":600.82405528449783},"W",null,null,{"$f":"(0.75*R$18*FLOOR(R$20,0.05)*0.9*R$35*R$38*o_Isol_Bij_Tijdstip($A82,R$8,R$11))+(0.75*T$18*FLOOR(T$20,0.05)*0.9*T$35*T$38*o_Isol_Bij_Tijdstip($A82,R$8,R$11))","v":0},"W",819.77780723080139,"W"]
[]
["Maatgevende tijdstip",{"$f":"IF(MAX(T73:T82)=0,\"Geen glas aanwezig\",_xlfn.XLOOKUP(MAX(T73:T82),T73:T82,A73:A82,\"nvt\"))","v":"15:00:00"}]

{"sheet":"Ruimte 3","index":5,"n_rows":84,"n_cols":21,"rows_kept":84,"cut":false,"hidden":false,"merged":[[66,0,67,20],[0,0,0,20],[6,1,6,3],[6,5,6,7],[6,9,6,11],[6,13,6,15],[6,17,6,20],[41,1,41,3],[41,5,41,7],[41,9,41,11],[41,13,41,15],[41,17,41,19],[40,1,40,3],[40,5,40,7],[40,9,40,11],[40,13,40,15],[40,17,40,19],[55,1,55,3],[55,5,55,7],[55,9,55,11],[55,13,55,15],[55,17,55,19],[54,1,54,3],[54,5,54,7],[54,9,54,11],[54,13,54,15],[54,17,54,19],[56,5,56,7],[56,9,56,11],[56,13,56,15],[56,17,56,19],[57,1,57,3],[57,5,57,7],[57,9,57,11],[57,13,57,15],[57,17,57,19],[59,1,59,3],[60,1,60,3],[62,1,62,3],[63,1,63,3],[56,1,56,3]]}
["RUIMTE 3"]
[]
["Ruimtenaam","slaap 2"]
["Type verblijfsruimte","Andere verblijfsruimte"]
["Vloeroppervlak verblijfsruimte Avr  (gebruiksoppervlak)",15.6,"m²"]
[]
[null,"Voorzijde woning",null,null,null,"Linker zijde woning",null,null,null,"Achterzijde woning",null,null,null,"Rechter zijde woning",null,null,null,"Platdak"]
["Orientatie gevel / dakvlak (Helling > 15°C)",{"$f":"Invoerblad!$B$17","v":"Noord"},null,null,null,{"$f":"o_Orientatie(F9)","v":"Oost"},null,null,null,{"$f":"o_Orientatie(J9)","v":"Zuid"},null,null,null,{"$f":"o_Orientatie(N9)","v":"West"},null,null,null,"Horizontaal"]
["Orientatiehoek gevel Ƴ",{"$f":"o_OrientatiehOEK(B8)","v":0},null,null,null,{"$f":"IF(B9+90>360,B9+90-360,B9+90)","v":90},null,null,null,{"$f":"IF(F9+90>360,F9+90-360,F9+90)","v":180},null,null,null,{"$f":"IF(J9+90>360,J9+90-360,J9+90)","v":270}]
["Grenst aan buitenlucht ja of nee","Nee",null,null,null,"Nee",null,null,null,"Ja",null,null,null,"Nee",null,null,null,"Nee"]
["Hellingshoek constructie ≥ 15° = hellenddak 90° = gevel",90,"°",null,null,90,"°",null,null,90,"°",null,null,90,"°",null,null,10,"°"]
["Type constructie",{"$f":"o_TypeConstructie(B10,B11)","v":"Woningscheidend"},null,null,null,{"$f":"o_TypeConstructie(F10,F11)","v":"Woningscheidend"},null,null,null,{"$f":"o_TypeConstructie(J10,J11)","v":"Buitengevel"},null,null,null,{"$f":"o_TypeConstructie(N10,N11)","v":"Woningscheidend"},null,null,null,{"$f":"o_TypeConstructie(R10,R11)","v":"Woningscheidend"}]
["Gevel lengte (binnenwerks)",0,"m",null,null,0,"m",null,null,0,"m",null,null,0,"m",null,null,0,"m"]
["Gevel hoogte / Dak breedte (binnenwerks)",0,"m",null,null,0,"m",null,null,0,"m",null,null,0,"m",null,null,0,"m"]
["Constructie oppervlak (binnenwerks)",{"$f":"B13*B14","v":0},"m²",null,null,{"$f":"F13*F14","v":0},"m²",null,null,9.1999999999999993,"m²",null,null,{"$f":"N13*N14","v":0},"m²",null,null,{"$f":"R13*R14","v":0},"m²"]
["Gesloten constructie oppervlak",{"$f":"MAX(0,B15-B18-D18)","v":0},"m²",null,null,{"$f":"MAX(0,F15-F18-H18)","v":0},"m²",null,null,{"$f":"MAX(0,J15-J18-L18)","v":7.2999999999999989},"m²",null,null,{"$f":"MAX(0,N15-N18-P18)","v":0},"m²",null,null,{"$f":"MAX(0,R15-R18-T18)","v":0},"m²"]
[null,"Glasvlak type 1",null,"Glasvlak type 2",null,"Glasvlak type 1",null,"Glasvlak type 2",null,"Glasvlak type 1",null,"Glasvlak type 2",null,"Glasvlak type 1",null,"Glasvlak type 2",null,"Glasvlak type 1",null,"Glasvlak type 2"]
["Totaal oppervlak van raamtype Aw,k (inclusief kozijn)",null,"m²",null,"m²",null,"m²",null,"m²",1.9,"m²",null,"m²",null,"m²",null,"m²",null,"m²",null,"m²"]
["Warmtedoorgangscoefficient (U-waarde) van het raam Uw;wi;k",null,"W/m².K",null,"W/m².K",null,"W/m².K",null,"W/m².K",1.5,"W/m².K",null,"W/m².K",null,"W/m².K",null,"W/m².K",null,"W/m².K",null,"W/m².K"]
["Zontoetredingsfactor (g_waarde) van het glas Ggl;n;wi;k;C;juli",null,null,null,null,null,null,null,null,0.6]
["Beschaduwing situatie bij het raamtype","Minimale belemmering",null,"Minimale belemmering",null,"Minimale belemmering",null,"Minimale belemmering",null,"Minimale belemmering",null,"Minimale belemmering",null,"Minimale belemmering",null,"Minimale belemmering",null,"Minimale belemmering",null,"Minimale belemmering"]
[]
[null,"Overstek",null,"Overstek",null,"Overstek",null,"Overstek",null,"Overstek",null,"Overstek",null,"Overstek",null,"Overstek"]
["Hoogte verschil midden raam onderzijde overstek",0,"m",0,"m",0,"m",0,"m",0,"m",0,"m",0,"m",0,"m",0,null,null,"m"]
["Horizontale afstand glas tot eindpunt overstek",0,"m",0,"m",0,"m",0,"m",0,"m",0,"m",0,"m",0,"m",0,null,null,"m"]
["Overstekhoek",{"$f":"IFERROR(180/PI()*ATAN(B24/B25),0)","v":0},"°",{"$f":"IFERROR(180/PI()*ATAN(D24/D25),0)","v":0},"°",{"$f":"IFERROR(180/PI()*ATAN(F24/F25),0)","v":0},"°",{"$f":"IFERROR(180/PI()*ATAN(H24/H25),0)","v":0},"°",{"$f":"IFERROR(180/PI()*ATAN(J24/J25),0)","v":0},"°",{"$f":"IFERROR(180/PI()*ATAN(L24/L25),0)","v":0},"°",{"$f":"IFERROR(180/PI()*ATAN(N24/N25),0)","v":0},"°",{"$f":"IFERROR(180/PI()*ATAN(P24/P25),0)","v":0},"°",null,null,null,"°"]
["Relatieve hoogte van overstek",{"$f":"IFERROR(B24/B25,1)","v":1},null,{"$f":"IFERROR(D24/D25,1)","v":1},null,{"$f":"IFERROR(F24/F25,1)","v":1},null,{"$f":"IFERROR(H24/H25,1)","v":1},null,{"$f":"IFERROR(J24/J25,1)","v":1},null,{"$f":"IFERROR(L24/L25,1)","v":1},null,{"$f":"IFERROR(N24/N25,1)","v":1},null,{"$f":"IFERROR(P24/P25,1)","v":1}]
[]
[null,"Zijbelemmering",null,"Zijbelemmering",null,"Zijbelemmering",null,"Zijbelemmering",null,"Zijbelemmering",null,"Zijbelemmering",null,"Zijbelemmering",null,"Zijbelemmering"]
["Positie zijbelemmering irt zichtveld (naar buitengericht)","Links",null,"Links",null,"Links",null,"Links",null,"Links",null,"Links",null,"Links",null,"Links"]
["Horizontale afstand midden raam verste punt belemmering",0,"m",0,"m",null,"m",null,"m",null,"m",1,"m",null,"m",null,"m",null,null,null,"m"]
["Horizontale breedte glas tot eindpunt belemmering",0,"m",0,"m",null,"m",null,"m",null,"m",null,"m",null,"m",null,"m",null,null,null,"m"]
["Relatieve breedte van de zijbelemmering bb",{"$f":"IFERROR(B31/B32,999)","v":999},null,{"$f":"IFERROR(D31/D32,999)","v":999},null,{"$f":"IFERROR(F31/F32,999)","v":999},null,{"$f":"IFERROR(H31/H32,999)","v":999},null,{"$f":"IFERROR(J31/J32,999)","v":999},null,{"$f":"IFERROR(L31/L32,999)","v":999},null,{"$f":"IFERROR(N31/N32,999)","v":999},null,{"$f":"IFERROR(P31/P32,999)","v":999}]
[]
["De beschaduwingsreductiefactor Fsh;obst;wi;k;juli",{"$f":"IFERROR(o_Beschaduwingreductie(B21,B8,B27,B30,B33,B11),1)","v":1},null,{"$f":"IFERROR(o_Beschaduwingreductie(D21,B8,D27,D30,D33,B11),1)","v":1},null,{"$f":"IFERROR(o_Beschaduwingreductie(F21,F8,F27,F30,F33,F11),1)","v":1},null,{"$f":"IFERROR(o_Beschaduwingreductie(H21,F8,H27,H30,H33,F11),1)","v":1},null,{"$f":"IFERROR(o_Beschaduwingreductie(J21,J8,J27,J30,J33,J11),1)","v":1},null,{"$f":"IFERROR(o_Beschaduwingreductie(L21,J8,L27,L30,L33,J11),1)","v":1},null,{"$f":"IFERROR(o_Beschaduwingreductie(N21,N8,N27,N30,N33,N11),1)","v":1},null,{"$f":"IFERROR(o_Beschaduwingreductie(P21,N8,P27,P30,P33,N11),1)","v":1},null,{"$f":"o_Beschaduwingreductie(R21,R8,R27,R30,R33,R11)","v":1},null,{"$f":"o_Beschaduwingreductie(T21,R8,T27,T30,T33,R11)","v":1}]
[]
["Type zonwering","Geen zonwering",null,"Geen zonwering",null,"Geen zonwering",null,"Geen zonwering",null,"Screen (wit)",null,"Geen zonwering",null,"Geen zonwering",null,"Geen zonwering",null,"Geen zonwering",null,"Geen zonwering"]
["De reductiefactor voor zonwering Fc;wi;k",{"$f":"o_Zonweringreductie(B37,B8)","v":1},null,{"$f":"o_Zonweringreductie(D37,B8)","v":1},null,{"$f":"o_Zonweringreductie(F37,F8)","v":1},null,{"$f":"o_Zonweringreductie(H37,F8)","v":1},null,{"$f":"o_Zonweringreductie(J37,J8)","v":0.25},null,{"$f":"o_Zonweringreductie(L37,J8)","v":1},null,{"$f":"o_Zonweringreductie(N37,N8)","v":1},null,{"$f":"o_Zonweringreductie(P37,N8)","v":1},null,{"$f":"o_Zonweringreductie(R37,R8)","v":1},null,{"$f":"o_Zonweringreductie(T37,R8)","v":1}]
["Totaal opvallende zonnestraling van het raam Isol;wi;k;juli",{"$f":"IF(B10=\"Nee\",0,o_Isol_Bij_Tijdstip($B$52,B8,B11))","v":0},"W/m²",{"$f":"IF(B10=\"Nee\",0,o_Isol_Bij_Tijdstip($B$52,B8,B11))","v":0},"W/m²",{"$f":"IF(F10=\"Nee\",0,o_Isol_Bij_Tijdstip($B$52,F8,F11))","v":0},"W/m²",{"$f":"IF(F10=\"Nee\",0,o_Isol_Bij_Tijdstip($B$52,F8,F11))","v":0},"W/m²",{"$f":"IF(J10=\"Nee\",0,o_Isol_Bij_Tijdstip($B$52,J8,J11))","v":740.05836254715712},"W/m²",{"$f":"IF(J10=\"Nee\",0,o_Isol_Bij_Tijdstip($B$52,J8,J11))","v":740.05836254715712},"W/m²",{"$f":"IF(N10=\"Nee\",0,o_Isol_Bij_Tijdstip($B$52,N8,N11))","v":0},"W/m²",{"$f":"IF(N10=\"Nee\",0,o_Isol_Bij_Tijdstip($B$52,N8,N11))","v":0},"W/m²",{"$f":"IF(R10=\"Nee\",0,o_Isol_Bij_Tijdstip($B$52,R8,R11))","v":0},"W/m²",{"$f":"IF(R10=\"Nee\",0,o_Isol_Bij_Tijdstip($B$52,R8,R11))","v":0},"W/m²"]
[]
["Tijdstip maximale koellastbijdrage tmax;zi",{"$f":"VALUE(o_Tijdstip_Isol_Max_Orientatie(B8,B11))","v":"15:00:00"},null,null,null,{"$f":"VALUE(o_Tijdstip_Isol_Max_Orientatie(F8,F11))","v":"09:00:00"},null,null,null,{"$f":"VALUE(o_Tijdstip_Isol_Max_Orientatie(J8,J11))","v":"14:00:00"},null,null,null,{"$f":"VALUE(o_Tijdstip_Isol_Max_Orientatie(N8,N11))","v":"18:00:00"},null,null,null,{"$f":"o_Tijdstip_Isol_Max_Orientatie(R8,R11)","v":"16:00:00"}]
["Buitenluchttemperatuur op tijdstip max koellast Θe",{"$f":"o_maxTemp(VALUE(B41))","v":29.8},null,null,"°C",{"$f":"o_maxTemp(VALUE(F41))","v":24.7},null,null,"°C",{"$f":"o_maxTemp(VALUE(J41))","v":29.9},null,null,"°C",{"$f":"o_maxTemp(VALUE(N41))","v":30.1},null,null,"°C",{"$f":"o_maxTemp(VALUE(R41))","v":30.4}]
[]
["Glasopppervlak",{"$f":"IF(B10=\"Ja\",B18+D18,0)","v":0},"m²",null,null,{"$f":"IF(F10=\"Ja\",F18+H18,0)","v":0},"m²",null,null,{"$f":"IF(J10=\"Ja\",J18+L18,0)","v":1.9},"m²",null,null,{"$f":"IF(N10=\"Ja\",N18+P18,0)","v":0},"m²",null,null,{"$f":"IF(R10=\"Ja\",R18+T18,0)","v":0},"m²"]
["Uitwendigescheidingsconstructie niet op Noord?",{"$f":"IF(B10=\"Ja\",IF(B8=\"Noord\",FALSE,TRUE),FALSE)","v":false},null,null,null,{"$f":"IF(F10=\"Ja\",IF(F8=\"Noord\",FALSE,TRUE),FALSE)","v":false},null,null,null,{"$f":"IF(J10=\"Ja\",IF(J8=\"Noord\",FALSE,TRUE),FALSE)","v":true},null,null,null,{"$f":"IF(N10=\"Ja\",IF(N8=\"Noord\",FALSE,TRUE),FALSE)","v":false},null,null,null,{"$f":"IF(R10=\"Ja\",IF(R8=\"Noord\",FALSE,TRUE),FALSE)","v":false}]
["De enige uitwendigescheidingscontructie?",{"$f":"IF(AND(B45=TRUE,COUNTIF($B$45:$R$45,TRUE)=1),TRUE,FALSE)","v":false},null,null,null,{"$f":"IF(AND(F45=TRUE,COUNTIF($B$45:$R$45,TRUE)=1),TRUE,FALSE)","v":false},null,null,null,{"$f":"IF(AND(J45=TRUE,COUNTIF($B$45:$R$45,TRUE)=1),TRUE,FALSE)","v":true},null,null,null,{"$f":"IF(AND(N45=TRUE,COUNTIF($B$45:$R$45,TRUE)=1),TRUE,FALSE)","v":false},null,null,null,{"$f":"IF(AND(R45=TRUE,COUNTIF($B$45:$R$45,TRUE)=1),TRUE,FALSE)","v":false}]
["Totaal glasoppervlak",{"$f":"IF(B8<>\"Noord\",B44,0)","v":0},"m²",null,null,{"$f":"IF(F8<>\"Noord\",F44,0)","v":0},"m²",null,null,{"$f":"IF(J8<>\"Noord\",J44,0)","v":1.9},"m²",null,null,{"$f":"IF(N8<>\"Noord\",N44,0)","v":0},"m²",null,null,{"$f":"R44","v":0},"m²"]
["Grootste glasoppervlak ",{"$f":"IF(AND(B45,B47=MAX($B$47:$R$47)),TRUE,FALSE)","v":false},null,null,null,{"$f":"IF(AND(F45,F47=MAX($B$47:$R$47)),TRUE,FALSE)","v":false},null,null,null,{"$f":"IF(AND(J45,J47=MAX($B$47:$R$47)),TRUE,FALSE)","v":true},null,null,null,{"$f":"IF(AND(N45,N47=MAX($B$47:$R$47)),TRUE,FALSE)","v":false},null,null,null,{"$f":"IF(AND(R45,R47=MAX($B$47:$R$47)),TRUE,FALSE)","v":false}]
["Dakvlak maatgevend?",{"$f":"IF(AND(B11<90,B15>3*(B18+D18),Invoerblad!$B$25<65),TRUE,FALSE)","v":false},null,null,null,{"$f":"IF(AND(F11<90,F15>3*(F18+H18),Invoerblad!$B$25<65),TRUE,FALSE)","v":false},null,null,null,{"$f":"IF(AND(J11<90,J15>3*(J18+L18),Invoerblad!$B$25<65),TRUE,FALSE)","v":false},null,null,null,{"$f":"IF(AND(N11<90,N15>3*(N18+P18),Invoerblad!$B$25<65),TRUE,FALSE)","v":false},null,null,null,{"$f":"IF(AND(R11<90,R15>3*(R18+T18),Invoerblad!$B$25<65),TRUE,FALSE)","v":false}]
["is er een maatgevend dakoppervlak",{"$f":"IF(COUNTIF($B$49:$R$49,TRUE)>0,TRUE,FALSE)","v":false},null,null,null,{"$f":"IF(COUNTIF($B$49:$R$49,TRUE)>0,TRUE,FALSE)","v":false},null,null,null,{"$f":"IF(COUNTIF($B$49:$R$49,TRUE)>0,TRUE,FALSE)","v":false},null,null,null,{"$f":"IF(COUNTIF($B$49:$R$49,TRUE)>0,TRUE,FALSE)","v":false},null,null,null,{"$f":"IF(COUNTIF($B$49:$R$49,TRUE)>0,TRUE,FALSE)","v":false}]
["Maatgevende tijdstip",{"$f":"IF(OR(B46,AND(B45,B50,B49),AND(B45,B48,NOT(B50))),B41)","v":false},null,null,null,{"$f":"IF(OR(F46,AND(F45,F50,F49),AND(F45,F48,NOT(F50))),F41)","v":false},null,null,null,{"$f":"IF(OR(J46,AND(J45,J50,J49),AND(J45,J48,NOT(J50))),J41)","v":"14:00:00"},null,null,null,{"$f":"IF(OR(N46,AND(N45,N50,N49),AND(N45,N48,NOT(N50))),N41)","v":false},null,null,null,{"$f":"IF(OR(R46,AND(R45,R50,R49),AND(R45,R48,NOT(R50))),R41)","v":false}]
["Maatgevende tijdstip tmax;zi",{"$f":"IFERROR(B84,\"geen glas ingevoerd\")","v":"14:00:00"}]
["Buitenluchttemperatuur op tijdstip max koellast Θe",{"$f":"o_maxTemp(VALUE(B52))","v":29.9},"°C"]
[]
["Koellastbijdrage transmissie transparante delen Ptr;gl;vr;zi",{"$f":"IF(B10=\"Nee\",0,B16*Invoerblad!$B$16)","v":0},null,null,"W",{"$f":"IF(F10=\"Nee\",0,F16*Invoerblad!$B$16)","v":0},null,null,"W",{"$f":"IF(J10=\"Nee\",0,J16*Invoerblad!$B$16)","v":16.059999999999999},null,null,"W",{"$f":"IF(N10=\"Nee\",0,N16*Invoerblad!$B$16)","v":0},null,null,"W",{"$f":"IF(R10=\"Nee\",0,R16*Invoerblad!$B$16)","v":0},null,null,"W"]
["Koellastbijdrage zoninstraling transparante delen Psol;vr;zi",{"$f":"(0.75*B18*FLOOR(B20,0.05)*0.9*B35*B38*B39)+(0.75*D18*FLOOR(D20,0.05)*0.9*D35*D38*D39)","v":0},null,null,"W",{"$f":"(0.75*F18*FLOOR(F20,0.05)*0.9*F35*F38*F39)+(0.75*H18*FLOOR(H20,0.05)*0.9*H35*H38*H39)","v":0},null,null,"W",{"$f":"(0.75*J18*FLOOR(J20,0.05)*0.9*J35*J38*J39)+(0.75*L18*FLOOR(L20,0.05)*0.9*L35*L38*L39)","v":142.36872749500935},null,null,"W",{"$f":"(0.75*N18*FLOOR(N20,0.05)*0.9*N35*N38*N39)+(0.75*P18*FLOOR(P20,0.05)*0.9*P35*P38*P39)","v":0},null,null,"W",{"$f":"(0.75*R18*FLOOR(R20,0.05)*0.9*R35*R38*R39)+(0.75*T18*FLOOR(T20,0.05)*0.9*T35*T38*T39)","v":0},null,null,"W"]
["Koellastbijdrage transmissie transparante delen Ptr;gl;vr;zi",{"$f":"IF(B10=\"Nee\",0,IFERROR(B18*B19*($B$53-24),0)+IFERROR(D18*D19*($B$53-24),0))","v":0},null,null,"W",{"$f":"IF(F10=\"Nee\",0,IFERROR(F18*F19*($B$53-24),0)+IFERROR(H18*H19*($B$53-24),0))","v":0},null,null,"W",{"$f":"IF(J10=\"Nee\",0,IFERROR(J18*J19*($B$53-24),0)+IFERROR(L18*L19*($B$53-24),0))","v":16.814999999999994},null,null,"W",{"$f":"IF(N10=\"Nee\",0,IFERROR(N18*N19*($B$53-24),0)+IFERROR(P18*P19*($B$53-24),0))","v":0},null,null,"W",{"$f":"IF(R10=\"Nee\",0,IFERROR(R18*R19*($B$53-24),0)+IFERROR(T18*T19*($B$53-24),0))","v":0},null,null,"W"]
["Totaal koellastbijdrage per gevel",{"$f":"SUM(B55:D57)","v":0},null,null,"W",{"$f":"SUM(F55:H57)","v":0},null,null,"W",{"$f":"SUM(J55:L57)","v":175.24372749500935},null,null,"W",{"$f":"SUM(N55:P57)","v":0},null,null,"W",{"$f":"SUM(R55:R57)","v":0},null,null,"W"]
[]
["Koellast door interne warmtelast Pint;calc;woon/overig;zi",{"$f":"IF(B5=0,0,IF(B4=\"Woonvertrek\",2*Invoerblad!$B$40*B5,Invoerblad!$B$40*B5))","v":50.969680851063835},null,null,"W"]
["Koellast door buitenluchttoetreding Pv;calc;vr;zi",{"$f":"IFERROR(MAX((SUM(Invoerblad!$B$28:$B$30)/3600*1.205*1005*(B53-24))/SUM(Invoerblad!$B$47:$T$47)*B5,0),0)","v":69.93003377781271},{"$f":"IFERROR(MAX(SUM(C57:C59)/3600*1.205*1005*(C60-24),0),0)","v":0},{"$f":"IFERROR(MAX(SUM(D57:D59)/3600*1.205*1005*(D60-24),0),0)","v":0},"W"]
[]
["Totaal koellastbijdrage",{"$f":"IFERROR(SUM(B58:T58)+B60+B61,0)","v":296.1434421238859},null,null,"W"]
["Koelbehoefte verblijfsruimte",{"$f":"IFERROR(B63/B5,0)","v":18.983553982300378},null,null,"W/m²"]
[]
[]
["Onderstaande tabellen worden verborgen in de uiteindelijke versie. De tabellen dienen om vast te stellen welk tijdstip tot de hoogste zonbelasting leidt"]
[]
["Isol max voor de orientatie",{"$f":"o_Isol_Max_Orientatie(B8,B11)","v":143.73988086183414},"W/m²",null,null,{"$f":"o_Isol_Max_Orientatie(F8,F11)","v":845.32772366250799},"W/m²",null,null,{"$f":"o_Isol_Max_Orientatie(J8,J11)","v":740.05836254715712},"W/m²",null,null,{"$f":"o_Isol_Max_Orientatie(N8,N11)","v":741.75809294382429},"W/m²",null,null,{"$f":"o_Isol_Max_Orientatie(R8,R11)","v":914.16092603772574},"W/m²"]
["Tijdstip bij Isol max bij orientatie",{"$f":"VALUE(o_Tijdstip_Isol_Max_Orientatie(B8,B11))","v":"15:00:00"},null,null,null,{"$f":"VALUE(o_Tijdstip_Isol_Max_Orientatie(F8,F11))","v":"09:00:00"},null,null,null,{"$f":"VALUE(o_Tijdstip_Isol_Max_Orientatie(J8,J11))","v":"14:00:00"},null,null,null,{"$f":"VALUE(o_Tijdstip_Isol_Max_Orientatie(N8,N11))","v":"18:00:00"},null,null,null,{"$f":"VALUE(o_Tijdstip_Isol_Max_Orientatie(R8,R11))","v":"16:00:00"}]
[]
["Koellastbijdrage zoninstraling transparante delen Psol;vr;zi"]
["09:00:00",{"$f":"(0.75*B$18*FLOOR(B$20,0.05)*0.9*B$35*B$38*o_Isol_Bij_Tijdstip($A73,B$8,B$11))+(0.75*D$18*FLOOR(D$20,0.05)*0.9*D$35*D$38*o_Isol_Bij_Tijdstip($A73,B$8,B$11))","v":0},"W",null,null,{"$f":"(0.75*F$18*FLOOR(F$20,0.05)*0.9*F$35*F$38*o_Isol_Bij_Tijdstip($A73,F$8,F$11))+(0.75*H$18*FLOOR(H$20,0.05)*0.9*H$35*H$38*o_Isol_Bij_Tijdstip($A73,F$8,F$11))","v":0},"W",null,null,{"$f":"(0.75*J$18*FLOOR(J$20,0.05)*0.9*J$35*J$38*o_Isol_Bij_Tijdstip($A73,J$8,J$11))+(0.75*L$18*FLOOR(L$20,0.05)*0.9*L$35*L$38*o_Isol_Bij_Tijdstip($A73,J$8,J$11))","v":43.348084450371083},"W",null,null,{"$f":"(0.75*N$18*FLOOR(N$20,0.05)*0.9*N$35*N$38*o_Isol_Bij_Tijdstip($A73,N$8,N$11))+(0.75*P$18*FLOOR(P$20,0.05)*0.9*P$35*P$38*o_Isol_Bij_Tijdstip($A73,N$8,N$11))","v":0},"W",null,null,{"$f":"(0.75*R$18*FLOOR(R$20,0.05)*0.9*R$35*R$38*o_Isol_Bij_Tijdstip($A73,R$8,R$11))+(0.75*T$18*FLOOR(T$20,0.05)*0.9*T$35*T$38*o_Isol_Bij_Tijdstip($A73,R$8,R$11))","v":0},"W",{"$f":"B73+F73+J73+N73+R73","v":43.348084450371083},"W"]
["10:00:00",{"$f":"(0.75*B$18*FLOOR(B$20,0.05)*0.9*B$35*B$38*o_Isol_Bij_Tijdstip($A74,B$8,B$11))+(0.75*D$18*FLOOR(D$20,0.05)*0.9*D$35*D$38*o_Isol_Bij_Tijdstip($A74,B$8,B$11))","v":0},"W",null,null,{"$f":"(0.75*F$18*FLOOR(F$20,0.05)*0.9*F$35*F$38*o_Isol_Bij_Tijdstip($A74,F$8,F$11))+(0.75*H$18*FLOOR(H$20,0.05)*0.9*H$35*H$38*o_Isol_Bij_Tijdstip($A74,F$8,F$11))","v":0},"W",null,null,{"$f":"(0.75*J$18*FLOOR(J$20,0.05)*0.9*J$35*J$38*o_Isol_Bij_Tijdstip($A74,J$8,J$11))+(0.75*L$18*FLOOR(L$20,0.05)*0.9*L$35*L$38*o_Isol_Bij_Tijdstip($A74,J$8,J$11))","v":78.932312139291795},"W",null,null,{"$f":"(0.75*N$18*FLOOR(N$20,0.05)*0.9*N$35*N$38*o_Isol_Bij_Tijdstip($A74,N$8,N$11))+(0.75*P$18*FLOOR(P$20,0.05)*0.9*P$35*P$38*o_Isol_Bij_Tijdstip($A74,N$8,N$11))","v":0},"W",null,null,{"$f":"(0.75*R$18*FLOOR(R$20,0.05)*0.9*R$35*R$38*o_Isol_Bij_Tijdstip($A74,R$8,R$11))+(0.75*T$18*FLOOR(T$20,0.05)*0.9*T$35*T$38*o_Isol_Bij_Tijdstip($A74,R$8,R$11))","v":0},"W",78.932312139291795,"W"]
["11:00:00",{"$f":"(0.75*B$18*FLOOR(B$20,0.05)*0.9*B$35*B$38*o_Isol_Bij_Tijdstip($A75,B$8,B$11))+(0.75*D$18*FLOOR(D$20,0.05)*0.9*D$35*D$38*o_Isol_Bij_Tijdstip($A75,B$8,B$11))","v":0},"W",null,null,{"$f":"(0.75*F$18*FLOOR(F$20,0.05)*0.9*F$35*F$38*o_Isol_Bij_Tijdstip($A75,F$8,F$11))+(0.75*H$18*FLOOR(H$20,0.05)*0.9*H$35*H$38*o_Isol_Bij_Tijdstip($A75,F$8,F$11))","v":0},"W",null,null,{"$f":"(0.75*J$18*FLOOR(J$20,0.05)*0.9*J$35*J$38*o_Isol_Bij_Tijdstip($A75,J$8,J$11))+(0.75*L$18*FLOOR(L$20,0.05)*0.9*L$35*L$38*o_Isol_Bij_Tijdstip($A75,J$8,J$11))","v":102.00582533956066},"W",null,null,{"$f":"(0.75*N$18*FLOOR(N$20,0.05)*0.9*N$35*N$38*o_Isol_Bij_Tijdstip($A75,N$8,N$11))+(0.75*P$18*FLOOR(P$20,0.05)*0.9*P$35*P$38*o_Isol_Bij_Tijdstip($A75,N$8,N$11))","v":0},"W",null,null,{"$f":"(0.75*R$18*FLOOR(R$20,0.05)*0.9*R$35*R$38*o_Isol_Bij_Tijdstip($A75,R$8,R$11))+(0.75*T$18*FLOOR(T$20,0.05)*0.9*T$35*T$38*o_Isol_Bij_Tijdstip($A75,R$8,R$11))","v":0},"W",102.00582533956066,"W"]
["12:00:00",{"$f":"(0.75*B$18*FLOOR(B$20,0.05)*0.9*B$35*B$38*o_Isol_Bij_Tijdstip($A76,B$8,B$11))+(0.75*D$18*FLOOR(D$20,0.05)*0.9*D$35*D$38*o_Isol_Bij_Tijdstip($A76,B$8,B$11))","v":0},"W",null,null,{"$f":"(0.75*F$18*FLOOR(F$20,0.05)*0.9*F$35*F$38*o_Isol_Bij_Tijdstip($A76,F$8,F$11))+(0.75*H$18*FLOOR(H$20,0.05)*0.9*H$35*H$38*o_Isol_Bij_Tijdstip($A76,F$8,F$11))","v":0},"W",null,null,{"$f":"(0.75*J$18*FLOOR(J$20,0.05)*0.9*J$35*J$38*o_Isol_Bij_Tijdstip($A76,J$8,J$11))+(0.75*L$18*FLOOR(L$20,0.05)*0.9*L$35*L$38*o_Isol_Bij_Tijdstip($A76,J$8,J$11))","v":119.55622506297408},"W",null,null,{"$f":"(0.75*N$18*FLOOR(N$20,0.05)*0.9*N$35*N$38*o_Isol_Bij_Tijdstip($A76,N$8,N$11))+(0.75*P$18*FLOOR(P$20,0.05)*0.9*P$35*P$38*o_Isol_Bij_Tijdstip($A76,N$8,N$11))","v":0},"W",null,null,{"$f":"(0.75*R$18*FLOOR(R$20,0.05)*0.9*R$35*R$38*o_Isol_Bij_Tijdstip($A76,R$8,R$11))+(0.75*T$18*FLOOR(T$20,0.05)*0.9*T$35*T$38*o_Isol_Bij_Tijdstip($A76,R$8,R$11))","v":0},"W",119.55622506297408,"W"]
["13:00:00",{"$f":"(0.75*B$18*FLOOR(B$20,0.05)*0.9*B$35*B$38*o_Isol_Bij_Tijdstip($A77,B$8,B$11))+(0.75*D$18*FLOOR(D$20,0.05)*0.9*D$35*D$38*o_Isol_Bij_Tijdstip($A77,B$8,B$11))","v":0},"W",null,null,{"$f":"(0.75*F$18*FLOOR(F$20,0.05)*0.9*F$35*F$38*o_Isol_Bij_Tijdstip($A77,F$8,F$11))+(0.75*H$18*FLOOR(H$20,0.05)*0.9*H$35*H$38*o_Isol_Bij_Tijdstip($A77,F$8,F$11))","v":0},"W",null,null,{"$f":"(0.75*J$18*FLOOR(J$20,0.05)*0.9*J$35*J$38*o_Isol_Bij_Tijdstip($A77,J$8,J$11))+(0.75*L$18*FLOOR(L$20,0.05)*0.9*L$35*L$38*o_Isol_Bij_Tijdstip($A77,J$8,J$11))","v":125.68230962010684},"W",null,null,{"$f":"(0.75*N$18*FLOOR(N$20,0.05)*0.9*N$35*N$38*o_Isol_Bij_Tijdstip($A77,N$8,N$11))+(0.75*P$18*FLOOR(P$20,0.05)*0.9*P$35*P$38*o_Isol_Bij_Tijdstip($A77,N$8,N$11))","v":0},"W",null,null,{"$f":"(0.75*R$18*FLOOR(R$20,0.05)*0.9*R$35*R$38*o_Isol_Bij_Tijdstip($A77,R$8,R$11))+(0.75*T$18*FLOOR(T$20,0.05)*0.9*T$35*T$38*o_Isol_Bij_Tijdstip($A77,R$8,R$11))","v":0},"W",125.68230962010684,"W"]
["14:00:00",{"$f":"(0.75*B$18*FLOOR(B$20,0.05)*0.9*B$35*B$38*o_Isol_Bij_Tijdstip($A78,B$8,B$11))+(0.75*D$18*FLOOR(D$20,0.05)*0.9*D$35*D$38*o_Isol_Bij_Tijdstip($A78,B$8,B$11))","v":0},"W",null,null,{"$f":"(0.75*F$18*FLOOR(F$20,0.05)*0.9*F$35*F$38*o_Isol_Bij_Tijdstip($A78,F$8,F$11))+(0.75*H$18*FLOOR(H$20,0.05)*0.9*H$35*H$38*o_Isol_Bij_Tijdstip($A78,F$8,F$11))","v":0},"W",null,null,{"$f":"(0.75*J$18*FLOOR(J$20,0.05)*0.9*J$35*J$38*o_Isol_Bij_Tijdstip($A78,J$8,J$11))+(0.75*L$18*FLOOR(L$20,0.05)*0.9*L$35*L$38*o_Isol_Bij_Tijdstip($A78,J$8,J$11))","v":142.36872749500935},"W",null,null,{"$f":"(0.75*N$18*FLOOR(N$20,0.05)*0.9*N$35*N$38*o_Isol_Bij_Tijdstip($A78,N$8,N$11))+(0.75*P$18*FLOOR(P$20,0.05)*0.9*P$35*P$38*o_Isol_Bij_Tijdstip($A78,N$8,N$11))","v":0},"W",null,null,{"$f":"(0.75*R$18*FLOOR(R$20,0.05)*0.9*R$35*R$38*o_Isol_Bij_Tijdstip($A78,R$8,R$11))+(0.75*T$18*FLOOR(T$20,0.05)*0.9*T$35*T$38*o_Isol_Bij_Tijdstip($A78,R$8,R$11))","v":0},"W",142.36872749500935,"W"]
["15:00:00",{"$f":"(0.75*B$18*FLOOR(B$20,0.05)*0.9*B$35*B$38*o_Isol_Bij_Tijdstip($A79,B$8,B$11))+(0.75*D$18*FLOOR(D$20,0.05)*0.9*D$35*D$38*o_Isol_Bij_Tijdstip($A79,B$8,B$11))","v":0},"W",null,null,{"$f":"(0.75*F$18*FLOOR(F$20,0.05)*0.9*F$35*F$38*o_Isol_Bij_Tijdstip($A79,F$8,F$11))+(0.75*H$18*FLOOR(H$20,0.05)*0.9*H$35*H$38*o_Isol_Bij_Tijdstip($A79,F$8,F$11))","v":0},"W",null,null,{"$f":"(0.75*J$18*FLOOR(J$20,0.05)*0.9*J$35*J$38*o_Isol_Bij_Tijdstip($A79,J$8,J$11))+(0.75*L$18*FLOOR(L$20,0.05)*0.9*L$35*L$38*o_Isol_Bij_Tijdstip($A79,J$8,J$11))","v":114.70664535757152},"W",null,null,{"$f":"(0.75*N$18*FLOOR(N$20,0.05)*0.9*N$35*N$38*o_Isol_Bij_Tijdstip($A79,N$8,N$11))+(0.75*P$18*FLOOR(P$20,0.05)*0.9*P$35*P$38*o_Isol_Bij_Tijdstip($A79,N$8,N$11))","v":0},"W",null,null,{"$f":"(0.75*R$18*FLOOR(R$20,0.05)*0.9*R$35*R$38*o_Isol_Bij_Tijdstip($A79,R$8,R$11))+(0.75*T$18*FLOOR(T$20,0.05)*0.9*T$35*T$38*o_Isol_Bij_Tijdstip($A79,R$8,R$11))","v":0},"W",114.70664535757152,"W"]
["16:00:00",{"$f":"(0.75*B$18*FLOOR(B$20,0.05)*0.9*B$35*B$38*o_Isol_Bij_Tijdstip($A80,B$8,B$11))+(0.75*D$18*FLOOR(D$20,0.05)*0.9*D$35*D$38*o_Isol_Bij_Tijdstip($A80,B$8,B$11))","v":0},"W",null,null,{"$f":"(0.75*F$18*FLOOR(F$20,0.05)*0.9*F$35*F$38*o_Isol_Bij_Tijdstip($A80,F$8,F$11))+(0.75*H$18*FLOOR(H$20,0.05)*0.9*H$35*H$38*o_Isol_Bij_Tijdstip($A80,F$8,F$11))","v":0},"W",null,null,{"$f":"(0.75*J$18*FLOOR(J$20,0.05)*0.9*J$35*J$38*o_Isol_Bij_Tijdstip($A80,J$8,J$11))+(0.75*L$18*FLOOR(L$20,0.05)*0.9*L$35*L$38*o_Isol_Bij_Tijdstip($A80,J$8,J$11))","v":72.906286071279368},"W",null,null,{"$f":"(0.75*N$18*FLOOR(N$20,0.05)*0.9*N$35*N$38*o_Isol_Bij_Tijdstip($A80,N$8,N$11))+(0.75*P$18*FLOOR(P$20,0.05)*0.9*P$35*P$38*o_Isol_Bij_Tijdstip($A80,N$8,N$11))","v":0},"W",null,null,{"$f":"(0.75*R$18*FLOOR(R$20,0.05)*0.9*R$35*R$38*o_Isol_Bij_Tijdstip($A80,R$8,R$11))+(0.75*T$18*FLOOR(T$20,0.05)*0.9*T$35*T$38*o_Isol_Bij_Tijdstip($A80,R$8,R$11))","v":0},"W",72.906286071279368,"W"]
["17:00:00",{"$f":"(0.75*B$18*FLOOR(B$20,0.05)*0.9*B$35*B$38*o_Isol_Bij_Tijdstip($A81,B$8,B$11))+(0.75*D$18*FLOOR(D$20,0.05)*0.9*D$35*D$38*o_Isol_Bij_Tijdstip($A81,B$8,B$11))","v":0},"W",null,null,{"$f":"(0.75*F$18*FLOOR(F$20,0.05)*0.9*F$35*F$38*o_Isol_Bij_Tijdstip($A81,F$8,F$11))+(0.75*H$18*FLOOR(H$20,0.05)*0.9*H$35*H$38*o_Isol_Bij_Tijdstip($A81,F$8,F$11))","v":0},"W",null,null,{"$f":"(0.75*J$18*FLOOR(J$20,0.05)*0.9*J$35*J$38*o_Isol_Bij_Tijdstip($A81,J$8,J$11))+(0.75*L$18*FLOOR(L$20,0.05)*0.9*L$35*L$38*o_Isol_Bij_Tijdstip($A81,J$8,J$11))","v":44.139002199995801},"W",null,null,{"$f":"(0.75*N$18*FLOOR(N$20,0.05)*0.9*N$35*N$38*o_Isol_Bij_Tijdstip($A81,N$8,N$11))+(0.75*P$18*FLOOR(P$20,0.05)*0.9*P$35*P$38*o_Isol_Bij_Tijdstip($A81,N$8,N$11))","v":0},"W",null,null,{"$f":"(0.75*R$18*FLOOR(R$20,0.05)*0.9*R$35*R$38*o_Isol_Bij_Tijdstip($A81,R$8,R$11))+(0.75*T$18*FLOOR(T$20,0.05)*0.9*T$35*T$38*o_Isol_Bij_Tijdstip($A81,R$8,R$11))","v":0},"W",44.139002199995801,"W"]
["18:00:00",{"$f":"(0.75*B$18*FLOOR(B$20,0.05)*0.9*B$35*B$38*o_Isol_Bij_Tijdstip($A82,B$8,B$11))+(0.75*D$18*FLOOR(D$20,0.05)*0.9*D$35*D$38*o_Isol_Bij_Tijdstip($A82,B$8,B$11))","v":0},"W",null,null,{"$f":"(0.75*F$18*FLOOR(F$20,0.05)*0.9*F$35*F$38*o_Isol_Bij_Tijdstip($A82,F$8,F$11))+(0.75*H$18*FLOOR(H$20,0.05)*0.9*H$35*H$38*o_Isol_Bij_Tijdstip($A82,F$8,F$11))","v":0},"W",null,null,{"$f":"(0.75*J$18*FLOOR(J$20,0.05)*0.9*J$35*J$38*o_Isol_Bij_Tijdstip($A82,J$8,J$11))+(0.75*L$18*FLOOR(L$20,0.05)*0.9*L$35*L$38*o_Isol_Bij_Tijdstip($A82,J$8,J$11))","v":16.171479168871954},"W",null,null,{"$f":"(0.75*N$18*FLOOR(N$20,0.05)*0.9*N$35*N$38*o_Isol_Bij_Tijdstip($A82,N$8,N$11))+(0.75*P$18*FLOOR(P$20,0.05)*0.9*P$35*P$38*o_Isol_Bij_Tijdstip($A82,N$8,N$11))","v":0},"W",null,null,{"$f":"(0.75*R$18*FLOOR(R$20,0.05)*0.9*R$35*R$38*o_Isol_Bij_Tijdstip($A82,R$8,R$11))+(0.75*T$18*FLOOR(T$20,0.05)*0.9*T$35*T$38*o_Isol_Bij_Tijdstip($A82,R$8,R$11))","v":0},"W",16.171479168871954,"W"]
[]
["Maatgevende tijdstip",{"$f":"IF(MAX(T73:T82)=0,\"Geen glas aanwezig\",_xlfn.XLOOKUP(MAX(T73:T82),T73:T82,A73:A82,\"nvt\"))","v":"14:00:00"}]

{"sheet":"Ruimte 4","index":6,"n_rows":84,"n_cols":21,"rows_kept":84,"cut":false,"hidden":false,"merged":[[66,0,67,20],[0,0,0,20],[6,1,6,3],[6,5,6,7],[6,9,6,11],[6,13,6,15],[6,17,6,20],[41,1,41,3],[41,5,41,7],[41,9,41,11],[41,13,41,15],[41,17,41,19],[40,1,40,3],[40,5,40,7],[40,9,40,11],[40,13,40,15],[40,17,40,19],[55,1,55,3],[55,5,55,7],[55,9,55,11],[55,13,55,15],[55,17,55,19],[54,1,54,3],[54,5,54,7],[54,9,54,11],[54,13,54,15],[54,17,54,19],[56,5,56,7],[56,9,56,11],[56,13,56,15],[56,17,56,19],[57,1,57,3],[57,5,57,7],[57,9,57,11],[57,13,57,15],[57,17,57,19],[59,1,59,3],[60,1,60,3],[62,1,62,3],[63,1,63,3],[56,1,56,3]]}
["RUIMTE 1"]
[]
["Ruimtenaam","slaap 3"]
["Type verblijfsruimte","Andere verblijfsruimte"]
["Vloeroppervlak verblijfsruimte Avr  (gebruiksoppervlak)",7.3,"m²"]
[]
[null,"Voorzijde woning",null,null,null,"Linker zijde woning",null,null,null,"Achterzijde woning",null,null,null,"Rechter zijde woning",null,null,null,"Platdak"]
["Orientatie gevel / dakvlak (Helling > 15°C)",{"$f":"Invoerblad!$B$17","v":"Noord"},null,null,null,{"$f":"o_Orientatie(F9)","v":"Oost"},null,null,null,{"$f":"o_Orientatie(J9)","v":"Zuid"},null,null,null,{"$f":"o_Orientatie(N9)","v":"West"},null,null,null,"Horizontaal"]
["Orientatiehoek gevel Ƴ",{"$f":"o_OrientatiehOEK(B8)","v":0},null,null,null,{"$f":"IF(B9+90>360,B9+90-360,B9+90)","v":90},null,null,null,{"$f":"IF(F9+90>360,F9+90-360,F9+90)","v":180},null,null,null,{"$f":"IF(J9+90>360,J9+90-360,J9+90)","v":270}]
["Grenst aan buitenlucht ja of nee","Nee",null,null,null,"Nee",null,null,null,"Ja",null,null,null,"Nee",null,null,null,"Nee"]
["Hellingshoek constructie ≥ 15° = hellenddak 90° = gevel",90,"°",null,null,90,"°",null,null,90,"°",null,null,90,"°",null,null,10,"°"]
["Type constructie",{"$f":"o_TypeConstructie(B10,B11)","v":"Woningscheidend"},null,null,null,{"$f":"o_TypeConstructie(F10,F11)","v":"Woningscheidend"},null,null,null,{"$f":"o_TypeConstructie(J10,J11)","v":"Buitengevel"},null,null,null,{"$f":"o_TypeConstructie(N10,N11)","v":"Woningscheidend"},null,null,null,{"$f":"o_TypeConstructie(R10,R11)","v":"Woningscheidend"}]
["Gevel lengte (binnenwerks)",0,"m",null,null,0,"m",null,null,0,"m",null,null,0,"m",null,null,0,"m"]
["Gevel hoogte / Dak breedte (binnenwerks)",0,"m",null,null,0,"m",null,null,0,"m",null,null,0,"m",null,null,0,"m"]
["Constructie oppervlak (binnenwerks)",0,"m²",null,null,{"$f":"F13*F14","v":0},"m²",null,null,6.67,"m²",null,null,{"$f":"N13*N14","v":0},"m²",null,null,{"$f":"R13*R14","v":0},"m²"]
["Gesloten constructie oppervlak",{"$f":"MAX(0,B15-B18-D18)","v":0},"m²",null,null,{"$f":"MAX(0,F15-F18-H18)","v":0},"m²",null,null,{"$f":"MAX(0,J15-J18-L18)","v":4.7699999999999996},"m²",null,null,{"$f":"MAX(0,N15-N18-P18)","v":0},"m²",null,null,{"$f":"MAX(0,R15-R18-T18)","v":0},"m²"]
[null,"Glasvlak type 1",null,"Glasvlak type 2",null,"Glasvlak type 1",null,"Glasvlak type 2",null,"Glasvlak type 1",null,"Glasvlak type 2",null,"Glasvlak type 1",null,"Glasvlak type 2",null,"Glasvlak type 1",null,"Glasvlak type 2"]
["Totaal oppervlak van raamtype Aw,k (inclusief kozijn)",null,"m²",null,"m²",null,"m²",null,"m²",1.9,"m²",null,"m²",null,"m²",null,"m²",null,"m²",null,"m²"]
["Warmtedoorgangscoefficient (U-waarde) van het raam Uw;wi;k",null,"W/m².K",null,"W/m².K",null,"W/m².K",null,"W/m².K",1.5,"W/m².K",null,"W/m².K",null,"W/m².K",null,"W/m².K",null,"W/m².K",null,"W/m².K"]
["Zontoetredingsfactor (g_waarde) van het glas Ggl;n;wi;k;C;juli",null,null,null,null,null,null,null,null,0.6]
["Beschaduwing situatie bij het raamtype","Minimale belemmering",null,"Minimale belemmering",null,"Minimale belemmering",null,"Minimale belemmering",null,"Minimale belemmering",null,"Minimale belemmering",null,"Minimale belemmering",null,"Minimale belemmering",null,"Minimale belemmering",null,"Minimale belemmering"]
[]
[null,"Overstek",null,"Overstek",null,"Overstek",null,"Overstek",null,"Overstek",null,"Overstek",null,"Overstek",null,"Overstek"]
["Hoogte verschil midden raam onderzijde overstek",0,"m",0,"m",0,"m",0,"m",0,"m",0,"m",0,"m",0,"m",0,null,null,"m"]
["Horizontale afstand glas tot eindpunt overstek",0,"m",0,"m",0,"m",0,"m",0,"m",0,"m",0,"m",0,"m",0,null,null,"m"]
["Overstekhoek",{"$f":"IFERROR(180/PI()*ATAN(B24/B25),0)","v":0},"°",{"$f":"IFERROR(180/PI()*ATAN(D24/D25),0)","v":0},"°",{"$f":"IFERROR(180/PI()*ATAN(F24/F25),0)","v":0},"°",{"$f":"IFERROR(180/PI()*ATAN(H24/H25),0)","v":0},"°",{"$f":"IFERROR(180/PI()*ATAN(J24/J25),0)","v":0},"°",{"$f":"IFERROR(180/PI()*ATAN(L24/L25),0)","v":0},"°",{"$f":"IFERROR(180/PI()*ATAN(N24/N25),0)","v":0},"°",{"$f":"IFERROR(180/PI()*ATAN(P24/P25),0)","v":0},"°",null,null,null,"°"]
["Relatieve hoogte van overstek",{"$f":"IFERROR(B24/B25,1)","v":1},null,{"$f":"IFERROR(D24/D25,1)","v":1},null,{"$f":"IFERROR(F24/F25,1)","v":1},null,{"$f":"IFERROR(H24/H25,1)","v":1},null,{"$f":"IFERROR(J24/J25,1)","v":1},null,{"$f":"IFERROR(L24/L25,1)","v":1},null,{"$f":"IFERROR(N24/N25,1)","v":1},null,{"$f":"IFERROR(P24/P25,1)","v":1}]
[]
[null,"Zijbelemmering",null,"Zijbelemmering",null,"Zijbelemmering",null,"Zijbelemmering",null,"Zijbelemmering",null,"Zijbelemmering",null,"Zijbelemmering",null,"Zijbelemmering"]
["Positie zijbelemmering irt zichtveld (naar buitengericht)","Links",null,"Links",null,"Links",null,"Links",null,"Links",null,"Links",null,"Links",null,"Links"]
["Horizontale afstand midden raam verste punt belemmering",0,"m",0,"m",null,"m",null,"m",null,"m",1,"m",null,"m",null,"m",null,null,null,"m"]
["Horizontale breedte glas tot eindpunt belemmering",0,"m",0,"m",null,"m",null,"m",null,"m",null,"m",null,"m",null,"m",null,null,null,"m"]
["Relatieve breedte van de zijbelemmering bb",{"$f":"IFERROR(B31/B32,999)","v":999},null,{"$f":"IFERROR(D31/D32,999)","v":999},null,{"$f":"IFERROR(F31/F32,999)","v":999},null,{"$f":"IFERROR(H31/H32,999)","v":999},null,{"$f":"IFERROR(J31/J32,999)","v":999},null,{"$f":"IFERROR(L31/L32,999)","v":999},null,{"$f":"IFERROR(N31/N32,999)","v":999},null,{"$f":"IFERROR(P31/P32,999)","v":999}]
[]
["De beschaduwingsreductiefactor Fsh;obst;wi;k;juli",{"$f":"IFERROR(o_Beschaduwingreductie(B21,B8,B27,B30,B33,B11),1)","v":1},null,{"$f":"IFERROR(o_Beschaduwingreductie(D21,B8,D27,D30,D33,B11),1)","v":1},null,{"$f":"IFERROR(o_Beschaduwingreductie(F21,F8,F27,F30,F33,F11),1)","v":1},null,{"$f":"IFERROR(o_Beschaduwingreductie(H21,F8,H27,H30,H33,F11),1)","v":1},null,{"$f":"IFERROR(o_Beschaduwingreductie(J21,J8,J27,J30,J33,J11),1)","v":1},null,{"$f":"IFERROR(o_Beschaduwingreductie(L21,J8,L27,L30,L33,J11),1)","v":1},null,{"$f":"IFERROR(o_Beschaduwingreductie(N21,N8,N27,N30,N33,N11),1)","v":1},null,{"$f":"IFERROR(o_Beschaduwingreductie(P21,N8,P27,P30,P33,N11),1)","v":1},null,{"$f":"o_Beschaduwingreductie(R21,R8,R27,R30,R33,R11)","v":1},null,{"$f":"o_Beschaduwingreductie(T21,R8,T27,T30,T33,R11)","v":1}]
[]
["Type zonwering","Geen zonwering",null,"Geen zonwering",null,"Geen zonwering",null,"Geen zonwering",null,"Screen (wit)",null,"Geen zonwering",null,"Geen zonwering",null,"Geen zonwering",null,"Geen zonwering",null,"Geen zonwering"]
["De reductiefactor voor zonwering Fc;wi;k",{"$f":"o_Zonweringreductie(B37,B8)","v":1},null,{"$f":"o_Zonweringreductie(D37,B8)","v":1},null,{"$f":"o_Zonweringreductie(F37,F8)","v":1},null,{"$f":"o_Zonweringreductie(H37,F8)","v":1},null,{"$f":"o_Zonweringreductie(J37,J8)","v":0.25},null,{"$f":"o_Zonweringreductie(L37,J8)","v":1},null,{"$f":"o_Zonweringreductie(N37,N8)","v":1},null,{"$f":"o_Zonweringreductie(P37,N8)","v":1},null,{"$f":"o_Zonweringreductie(R37,R8)","v":1},null,{"$f":"o_Zonweringreductie(T37,R8)","v":1}]
["Totaal opvallende zonnestraling van het raam Isol;wi;k;juli",{"$f":"IF(B10=\"Nee\",0,o_Isol_Bij_Tijdstip($B$52,B8,B11))","v":0},"W/m²",{"$f":"IF(B10=\"Nee\",0,o_Isol_Bij_Tijdstip($B$52,B8,B11))","v":0},"W/m²",{"$f":"IF(F10=\"Nee\",0,o_Isol_Bij_Tijdstip($B$52,F8,F11))","v":0},"W/m²",{"$f":"IF(F10=\"Nee\",0,o_Isol_Bij_Tijdstip($B$52,F8,F11))","v":0},"W/m²",{"$f":"IF(J10=\"Nee\",0,o_Isol_Bij_Tijdstip($B$52,J8,J11))","v":740.05836254715712},"W/m²",{"$f":"IF(J10=\"Nee\",0,o_Isol_Bij_Tijdstip($B$52,J8,J11))","v":740.05836254715712},"W/m²",{"$f":"IF(N10=\"Nee\",0,o_Isol_Bij_Tijdstip($B$52,N8,N11))","v":0},"W/m²",{"$f":"IF(N10=\"Nee\",0,o_Isol_Bij_Tijdstip($B$52,N8,N11))","v":0},"W/m²",{"$f":"IF(R10=\"Nee\",0,o_Isol_Bij_Tijdstip($B$52,R8,R11))","v":0},"W/m²",{"$f":"IF(R10=\"Nee\",0,o_Isol_Bij_Tijdstip($B$52,R8,R11))","v":0},"W/m²"]
[]
["Tijdstip maximale koellastbijdrage tmax;zi",{"$f":"VALUE(o_Tijdstip_Isol_Max_Orientatie(B8,B11))","v":"15:00:00"},null,null,null,{"$f":"VALUE(o_Tijdstip_Isol_Max_Orientatie(F8,F11))","v":"09:00:00"},null,null,null,{"$f":"VALUE(o_Tijdstip_Isol_Max_Orientatie(J8,J11))","v":"14:00:00"},null,null,null,{"$f":"VALUE(o_Tijdstip_Isol_Max_Orientatie(N8,N11))","v":"18:00:00"},null,null,null,{"$f":"o_Tijdstip_Isol_Max_Orientatie(R8,R11)","v":"16:00:00"}]
["Buitenluchttemperatuur op tijdstip max koellast Θe",{"$f":"o_maxTemp(VALUE(B41))","v":29.8},null,null,"°C",{"$f":"o_maxTemp(VALUE(F41))","v":24.7},null,null,"°C",{"$f":"o_maxTemp(VALUE(J41))","v":29.9},null,null,"°C",{"$f":"o_maxTemp(VALUE(N41))","v":30.1},null,null,"°C",{"$f":"o_maxTemp(VALUE(R41))","v":30.4}]
[]
["Glasopppervlak",{"$f":"IF(B10=\"Ja\",B18+D18,0)","v":0},"m²",null,null,{"$f":"IF(F10=\"Ja\",F18+H18,0)","v":0},"m²",null,null,{"$f":"IF(J10=\"Ja\",J18+L18,0)","v":1.9},"m²",null,null,{"$f":"IF(N10=\"Ja\",N18+P18,0)","v":0},"m²",null,null,{"$f":"IF(R10=\"Ja\",R18+T18,0)","v":0},"m²"]
["Uitwendigescheidingsconstructie niet op Noord?",{"$f":"IF(B10=\"Ja\",IF(B8=\"Noord\",FALSE,TRUE),FALSE)","v":false},null,null,null,{"$f":"IF(F10=\"Ja\",IF(F8=\"Noord\",FALSE,TRUE),FALSE)","v":false},null,null,null,{"$f":"IF(J10=\"Ja\",IF(J8=\"Noord\",FALSE,TRUE),FALSE)","v":true},null,null,null,{"$f":"IF(N10=\"Ja\",IF(N8=\"Noord\",FALSE,TRUE),FALSE)","v":false},null,null,null,{"$f":"IF(R10=\"Ja\",IF(R8=\"Noord\",FALSE,TRUE),FALSE)","v":false}]
["De enige uitwendigescheidingscontructie?",{"$f":"IF(AND(B45=TRUE,COUNTIF($B$45:$R$45,TRUE)=1),TRUE,FALSE)","v":false},null,null,null,{"$f":"IF(AND(F45=TRUE,COUNTIF($B$45:$R$45,TRUE)=1),TRUE,FALSE)","v":false},null,null,null,{"$f":"IF(AND(J45=TRUE,COUNTIF($B$45:$R$45,TRUE)=1),TRUE,FALSE)","v":true},null,null,null,{"$f":"IF(AND(N45=TRUE,COUNTIF($B$45:$R$45,TRUE)=1),TRUE,FALSE)","v":false},null,null,null,{"$f":"IF(AND(R45=TRUE,COUNTIF($B$45:$R$45,TRUE)=1),TRUE,FALSE)","v":false}]
["Totaal glasoppervlak",{"$f":"IF(B8<>\"Noord\",B44,0)","v":0},"m²",null,null,{"$f":"IF(F8<>\"Noord\",F44,0)","v":0},"m²",null,null,{"$f":"IF(J8<>\"Noord\",J44,0)","v":1.9},"m²",null,null,{"$f":"IF(N8<>\"Noord\",N44,0)","v":0},"m²",null,null,{"$f":"R44","v":0},"m²"]
["Grootste glasoppervlak ",{"$f":"IF(AND(B45,B47=MAX($B$47:$R$47)),TRUE,FALSE)","v":false},null,null,null,{"$f":"IF(AND(F45,F47=MAX($B$47:$R$47)),TRUE,FALSE)","v":false},null,null,null,{"$f":"IF(AND(J45,J47=MAX($B$47:$R$47)),TRUE,FALSE)","v":true},null,null,null,{"$f":"IF(AND(N45,N47=MAX($B$47:$R$47)),TRUE,FALSE)","v":false},null,null,null,{"$f":"IF(AND(R45,R47=MAX($B$47:$R$47)),TRUE,FALSE)","v":false}]
["Dakvlak maatgevend?",{"$f":"IF(AND(B11<90,B15>3*(B18+D18),Invoerblad!$B$25<65),TRUE,FALSE)","v":false},null,null,null,{"$f":"IF(AND(F11<90,F15>3*(F18+H18),Invoerblad!$B$25<65),TRUE,FALSE)","v":false},null,null,null,{"$f":"IF(AND(J11<90,J15>3*(J18+L18),Invoerblad!$B$25<65),TRUE,FALSE)","v":false},null,null,null,{"$f":"IF(AND(N11<90,N15>3*(N18+P18),Invoerblad!$B$25<65),TRUE,FALSE)","v":false},null,null,null,{"$f":"IF(AND(R11<90,R15>3*(R18+T18),Invoerblad!$B$25<65),TRUE,FALSE)","v":false}]
["is er een maatgevend dakoppervlak",{"$f":"IF(COUNTIF($B$49:$R$49,TRUE)>0,TRUE,FALSE)","v":false},null,null,null,{"$f":"IF(COUNTIF($B$49:$R$49,TRUE)>0,TRUE,FALSE)","v":false},null,null,null,{"$f":"IF(COUNTIF($B$49:$R$49,TRUE)>0,TRUE,FALSE)","v":false},null,null,null,{"$f":"IF(COUNTIF($B$49:$R$49,TRUE)>0,TRUE,FALSE)","v":false},null,null,null,{"$f":"IF(COUNTIF($B$49:$R$49,TRUE)>0,TRUE,FALSE)","v":false}]
["Maatgevende tijdstip",{"$f":"IF(OR(B46,AND(B45,B50,B49),AND(B45,B48,NOT(B50))),B41)","v":false},null,null,null,{"$f":"IF(OR(F46,AND(F45,F50,F49),AND(F45,F48,NOT(F50))),F41)","v":false},null,null,null,{"$f":"IF(OR(J46,AND(J45,J50,J49),AND(J45,J48,NOT(J50))),J41)","v":"14:00:00"},null,null,null,{"$f":"IF(OR(N46,AND(N45,N50,N49),AND(N45,N48,NOT(N50))),N41)","v":false},null,null,null,{"$f":"IF(OR(R46,AND(R45,R50,R49),AND(R45,R48,NOT(R50))),R41)","v":false}]
["Maatgevende tijdstip tmax;zi",{"$f":"IFERROR(B84,\"geen glas ingevoerd\")","v":"14:00:00"}]
["Buitenluchttemperatuur op tijdstip max koellast Θe",{"$f":"o_maxTemp(VALUE(B52))","v":29.9},"°C"]
[]
["Koellastbijdrage transmissie transparante delen Ptr;gl;vr;zi",{"$f":"IF(B10=\"Nee\",0,B16*Invoerblad!$B$16)","v":0},null,null,"W",{"$f":"IF(F10=\"Nee\",0,F16*Invoerblad!$B$16)","v":0},null,null,"W",{"$f":"IF(J10=\"Nee\",0,J16*Invoerblad!$B$16)","v":10.494},null,null,"W",{"$f":"IF(N10=\"Nee\",0,N16*Invoerblad!$B$16)","v":0},null,null,"W",{"$f":"IF(R10=\"Nee\",0,R16*Invoerblad!$B$16)","v":0},null,null,"W"]
["Koellastbijdrage zoninstraling transparante delen Psol;vr;zi",{"$f":"(0.75*B18*FLOOR(B20,0.05)*0.9*B35*B38*B39)+(0.75*D18*FLOOR(D20,0.05)*0.9*D35*D38*D39)","v":0},null,null,"W",{"$f":"(0.75*F18*FLOOR(F20,0.05)*0.9*F35*F38*F39)+(0.75*H18*FLOOR(H20,0.05)*0.9*H35*H38*H39)","v":0},null,null,"W",{"$f":"(0.75*J18*FLOOR(J20,0.05)*0.9*J35*J38*J39)+(0.75*L18*FLOOR(L20,0.05)*0.9*L35*L38*L39)","v":142.36872749500935},null,null,"W",{"$f":"(0.75*N18*FLOOR(N20,0.05)*0.9*N35*N38*N39)+(0.75*P18*FLOOR(P20,0.05)*0.9*P35*P38*P39)","v":0},null,null,"W",{"$f":"(0.75*R18*FLOOR(R20,0.05)*0.9*R35*R38*R39)+(0.75*T18*FLOOR(T20,0.05)*0.9*T35*T38*T39)","v":0},null,null,"W"]
["Koellastbijdrage transmissie transparante delen Ptr;gl;vr;zi",{"$f":"IF(B10=\"Nee\",0,IFERROR(B18*B19*($B$53-24),0)+IFERROR(D18*D19*($B$53-24),0))","v":0},null,null,"W",{"$f":"IF(F10=\"Nee\",0,IFERROR(F18*F19*($B$53-24),0)+IFERROR(H18*H19*($B$53-24),0))","v":0},null,null,"W",{"$f":"IF(J10=\"Nee\",0,IFERROR(J18*J19*($B$53-24),0)+IFERROR(L18*L19*($B$53-24),0))","v":16.814999999999994},null,null,"W",{"$f":"IF(N10=\"Nee\",0,IFERROR(N18*N19*($B$53-24),0)+IFERROR(P18*P19*($B$53-24),0))","v":0},null,null,"W",{"$f":"IF(R10=\"Nee\",0,IFERROR(R18*R19*($B$53-24),0)+IFERROR(T18*T19*($B$53-24),0))","v":0},null,null,"W"]
["Totaal koellastbijdrage per gevel",{"$f":"SUM(B55:D57)","v":0},null,null,"W",{"$f":"SUM(F55:H57)","v":0},null,null,"W",{"$f":"SUM(J55:L57)","v":169.67772749500935},null,null,"W",{"$f":"SUM(N55:P57)","v":0},null,null,"W",{"$f":"SUM(R55:R57)","v":0},null,null,"W"]
[]
["Koellast door interne warmtelast Pint;calc;woon/overig;zi",{"$f":"IF(B5=0,0,IF(B4=\"Woonvertrek\",2*Invoerblad!$B$40*B5,Invoerblad!$B$40*B5))","v":23.85119680851064},null,null,"W"]
["Koellast door buitenluchttoetreding Pv;calc;vr;zi",{"$f":"IFERROR(MAX((SUM(Invoerblad!$B$28:$B$30)/3600*1.205*1005*(B53-24))/SUM(Invoerblad!$B$47:$T$47)*B5,0),0)","v":32.723669652437998},{"$f":"IFERROR(MAX(SUM(C57:C59)/3600*1.205*1005*(C60-24),0),0)","v":0},{"$f":"IFERROR(MAX(SUM(D57:D59)/3600*1.205*1005*(D60-24),0),0)","v":0},"W"]
[]
["Totaal koellastbijdrage",{"$f":"IFERROR(SUM(B58:T58)+B60+B61,0)","v":226.25259395595799},null,null,"W"]
["Koelbehoefte verblijfsruimte",{"$f":"IFERROR(B63/B5,0)","v":30.993506021364109},null,null,"W/m²"]
[]
[]
["Onderstaande tabellen worden verborgen in de uiteindelijke versie. De tabellen dienen om vast te stellen welk tijdstip tot de hoogste zonbelasting leidt"]
[]
["Isol max voor de orientatie",{"$f":"o_Isol_Max_Orientatie(B8,B11)","v":143.73988086183414},"W/m²",null,null,{"$f":"o_Isol_Max_Orientatie(F8,F11)","v":845.32772366250799},"W/m²",null,null,{"$f":"o_Isol_Max_Orientatie(J8,J11)","v":740.05836254715712},"W/m²",null,null,{"$f":"o_Isol_Max_Orientatie(N8,N11)","v":741.75809294382429},"W/m²",null,null,{"$f":"o_Isol_Max_Orientatie(R8,R11)","v":914.16092603772574},"W/m²"]
["Tijdstip bij Isol max bij orientatie",{"$f":"VALUE(o_Tijdstip_Isol_Max_Orientatie(B8,B11))","v":"15:00:00"},null,null,null,{"$f":"VALUE(o_Tijdstip_Isol_Max_Orientatie(F8,F11))","v":"09:00:00"},null,null,null,{"$f":"VALUE(o_Tijdstip_Isol_Max_Orientatie(J8,J11))","v":"14:00:00"},null,null,null,{"$f":"VALUE(o_Tijdstip_Isol_Max_Orientatie(N8,N11))","v":"18:00:00"},null,null,null,{"$f":"VALUE(o_Tijdstip_Isol_Max_Orientatie(R8,R11))","v":"16:00:00"}]
[]
["Koellastbijdrage zoninstraling transparante delen Psol;vr;zi"]
["09:00:00",{"$f":"(0.75*B$18*FLOOR(B$20,0.05)*0.9*B$35*B$38*o_Isol_Bij_Tijdstip($A73,B$8,B$11))+(0.75*D$18*FLOOR(D$20,0.05)*0.9*D$35*D$38*o_Isol_Bij_Tijdstip($A73,B$8,B$11))","v":0},"W",{"$f":"o_maxTemp(VALUE(A73))","v":24.7},null,{"$f":"(0.75*F$18*FLOOR(F$20,0.05)*0.9*F$35*F$38*o_Isol_Bij_Tijdstip($A73,F$8,F$11))+(0.75*H$18*FLOOR(H$20,0.05)*0.9*H$35*H$38*o_Isol_Bij_Tijdstip($A73,F$8,F$11))","v":0},"W",null,null,{"$f":"(0.75*J$18*FLOOR(J$20,0.05)*0.9*J$35*J$38*o_Isol_Bij_Tijdstip($A73,J$8,J$11))+(0.75*L$18*FLOOR(L$20,0.05)*0.9*L$35*L$38*o_Isol_Bij_Tijdstip($A73,J$8,J$11))","v":43.348084450371083},"W",null,null,{"$f":"(0.75*N$18*FLOOR(N$20,0.05)*0.9*N$35*N$38*o_Isol_Bij_Tijdstip($A73,N$8,N$11))+(0.75*P$18*FLOOR(P$20,0.05)*0.9*P$35*P$38*o_Isol_Bij_Tijdstip($A73,N$8,N$11))","v":0},"W",null,null,{"$f":"(0.75*R$18*FLOOR(R$20,0.05)*0.9*R$35*R$38*o_Isol_Bij_Tijdstip($A73,R$8,R$11))+(0.75*T$18*FLOOR(T$20,0.05)*0.9*T$35*T$38*o_Isol_Bij_Tijdstip($A73,R$8,R$11))","v":0},"W",{"$f":"B73+F73+J73+N73+R73","v":43.348084450371083},"W"]
["10:00:00",{"$f":"(0.75*B$18*FLOOR(B$20,0.05)*0.9*B$35*B$38*o_Isol_Bij_Tijdstip($A74,B$8,B$11))+(0.75*D$18*FLOOR(D$20,0.05)*0.9*D$35*D$38*o_Isol_Bij_Tijdstip($A74,B$8,B$11))","v":0},"W",{"$f":"o_maxTemp(VALUE(A74))","v":26.9},null,{"$f":"(0.75*F$18*FLOOR(F$20,0.05)*0.9*F$35*F$38*o_Isol_Bij_Tijdstip($A74,F$8,F$11))+(0.75*H$18*FLOOR(H$20,0.05)*0.9*H$35*H$38*o_Isol_Bij_Tijdstip($A74,F$8,F$11))","v":0},"W",null,null,{"$f":"(0.75*J$18*FLOOR(J$20,0.05)*0.9*J$35*J$38*o_Isol_Bij_Tijdstip($A74,J$8,J$11))+(0.75*L$18*FLOOR(L$20,0.05)*0.9*L$35*L$38*o_Isol_Bij_Tijdstip($A74,J$8,J$11))","v":78.932312139291795},"W",null,null,{"$f":"(0.75*N$18*FLOOR(N$20,0.05)*0.9*N$35*N$38*o_Isol_Bij_Tijdstip($A74,N$8,N$11))+(0.75*P$18*FLOOR(P$20,0.05)*0.9*P$35*P$38*o_Isol_Bij_Tijdstip($A74,N$8,N$11))","v":0},"W",null,null,{"$f":"(0.75*R$18*FLOOR(R$20,0.05)*0.9*R$35*R$38*o_Isol_Bij_Tijdstip($A74,R$8,R$11))+(0.75*T$18*FLOOR(T$20,0.05)*0.9*T$35*T$38*o_Isol_Bij_Tijdstip($A74,R$8,R$11))","v":0},"W",78.932312139291795,"W"]
["11:00:00",{"$f":"(0.75*B$18*FLOOR(B$20,0.05)*0.9*B$35*B$38*o_Isol_Bij_Tijdstip($A75,B$8,B$11))+(0.75*D$18*FLOOR(D$20,0.05)*0.9*D$35*D$38*o_Isol_Bij_Tijdstip($A75,B$8,B$11))","v":0},"W",{"$f":"o_maxTemp(VALUE(A75))","v":28.2},null,{"$f":"(0.75*F$18*FLOOR(F$20,0.05)*0.9*F$35*F$38*o_Isol_Bij_Tijdstip($A75,F$8,F$11))+(0.75*H$18*FLOOR(H$20,0.05)*0.9*H$35*H$38*o_Isol_Bij_Tijdstip($A75,F$8,F$11))","v":0},"W",null,null,{"$f":"(0.75*J$18*FLOOR(J$20,0.05)*0.9*J$35*J$38*o_Isol_Bij_Tijdstip($A75,J$8,J$11))+(0.75*L$18*FLOOR(L$20,0.05)*0.9*L$35*L$38*o_Isol_Bij_Tijdstip($A75,J$8,J$11))","v":102.00582533956066},"W",null,null,{"$f":"(0.75*N$18*FLOOR(N$20,0.05)*0.9*N$35*N$38*o_Isol_Bij_Tijdstip($A75,N$8,N$11))+(0.75*P$18*FLOOR(P$20,0.05)*0.9*P$35*P$38*o_Isol_Bij_Tijdstip($A75,N$8,N$11))","v":0},"W",null,null,{"$f":"(0.75*R$18*FLOOR(R$20,0.05)*0.9*R$35*R$38*o_Isol_Bij_Tijdstip($A75,R$8,R$11))+(0.75*T$18*FLOOR(T$20,0.05)*0.9*T$35*T$38*o_Isol_Bij_Tijdstip($A75,R$8,R$11))","v":0},"W",102.00582533956066,"W"]
["12:00:00",{"$f":"(0.75*B$18*FLOOR(B$20,0.05)*0.9*B$35*B$38*o_Isol_Bij_Tijdstip($A76,B$8,B$11))+(0.75*D$18*FLOOR(D$20,0.05)*0.9*D$35*D$38*o_Isol_Bij_Tijdstip($A76,B$8,B$11))","v":0},"W",{"$f":"o_maxTemp(VALUE(A76))","v":28.9},null,{"$f":"(0.75*F$18*FLOOR(F$20,0.05)*0.9*F$35*F$38*o_Isol_Bij_Tijdstip($A76,F$8,F$11))+(0.75*H$18*FLOOR(H$20,0.05)*0.9*H$35*H$38*o_Isol_Bij_Tijdstip($A76,F$8,F$11))","v":0},"W",null,null,{"$f":"(0.75*J$18*FLOOR(J$20,0.05)*0.9*J$35*J$38*o_Isol_Bij_Tijdstip($A76,J$8,J$11))+(0.75*L$18*FLOOR(L$20,0.05)*0.9*L$35*L$38*o_Isol_Bij_Tijdstip($A76,J$8,J$11))","v":119.55622506297408},"W",null,null,{"$f":"(0.75*N$18*FLOOR(N$20,0.05)*0.9*N$35*N$38*o_Isol_Bij_Tijdstip($A76,N$8,N$11))+(0.75*P$18*FLOOR(P$20,0.05)*0.9*P$35*P$38*o_Isol_Bij_Tijdstip($A76,N$8,N$11))","v":0},"W",null,null,{"$f":"(0.75*R$18*FLOOR(R$20,0.05)*0.9*R$35*R$38*o_Isol_Bij_Tijdstip($A76,R$8,R$11))+(0.75*T$18*FLOOR(T$20,0.05)*0.9*T$35*T$38*o_Isol_Bij_Tijdstip($A76,R$8,R$11))","v":0},"W",119.55622506297408,"W"]
["13:00:00",{"$f":"(0.75*B$18*FLOOR(B$20,0.05)*0.9*B$35*B$38*o_Isol_Bij_Tijdstip($A77,B$8,B$11))+(0.75*D$18*FLOOR(D$20,0.05)*0.9*D$35*D$38*o_Isol_Bij_Tijdstip($A77,B$8,B$11))","v":0},"W",{"$f":"o_maxTemp(VALUE(A77))","v":29.7},null,{"$f":"(0.75*F$18*FLOOR(F$20,0.05)*0.9*F$35*F$38*o_Isol_Bij_Tijdstip($A77,F$8,F$11))+(0.75*H$18*FLOOR(H$20,0.05)*0.9*H$35*H$38*o_Isol_Bij_Tijdstip($A77,F$8,F$11))","v":0},"W",null,null,{"$f":"(0.75*J$18*FLOOR(J$20,0.05)*0.9*J$35*J$38*o_Isol_Bij_Tijdstip($A77,J$8,J$11))+(0.75*L$18*FLOOR(L$20,0.05)*0.9*L$35*L$38*o_Isol_Bij_Tijdstip($A77,J$8,J$11))","v":125.68230962010684},"W",null,null,{"$f":"(0.75*N$18*FLOOR(N$20,0.05)*0.9*N$35*N$38*o_Isol_Bij_Tijdstip($A77,N$8,N$11))+(0.75*P$18*FLOOR(P$20,0.05)*0.9*P$35*P$38*o_Isol_Bij_Tijdstip($A77,N$8,N$11))","v":0},"W",null,null,{"$f":"(0.75*R$18*FLOOR(R$20,0.05)*0.9*R$35*R$38*o_Isol_Bij_Tijdstip($A77,R$8,R$11))+(0.75*T$18*FLOOR(T$20,0.05)*0.9*T$35*T$38*o_Isol_Bij_Tijdstip($A77,R$8,R$11))","v":0},"W",125.68230962010684,"W"]
["14:00:00",{"$f":"(0.75*B$18*FLOOR(B$20,0.05)*0.9*B$35*B$38*o_Isol_Bij_Tijdstip($A78,B$8,B$11))+(0.75*D$18*FLOOR(D$20,0.05)*0.9*D$35*D$38*o_Isol_Bij_Tijdstip($A78,B$8,B$11))","v":0},"W",{"$f":"o_maxTemp(VALUE(A78))","v":29.9},null,{"$f":"(0.75*F$18*FLOOR(F$20,0.05)*0.9*F$35*F$38*o_Isol_Bij_Tijdstip($A78,F$8,F$11))+(0.75*H$18*FLOOR(H$20,0.05)*0.9*H$35*H$38*o_Isol_Bij_Tijdstip($A78,F$8,F$11))","v":0},"W",null,null,{"$f":"(0.75*J$18*FLOOR(J$20,0.05)*0.9*J$35*J$38*o_Isol_Bij_Tijdstip($A78,J$8,J$11))+(0.75*L$18*FLOOR(L$20,0.05)*0.9*L$35*L$38*o_Isol_Bij_Tijdstip($A78,J$8,J$11))","v":142.36872749500935},"W",null,null,{"$f":"(0.75*N$18*FLOOR(N$20,0.05)*0.9*N$35*N$38*o_Isol_Bij_Tijdstip($A78,N$8,N$11))+(0.75*P$18*FLOOR(P$20,0.05)*0.9*P$35*P$38*o_Isol_Bij_Tijdstip($A78,N$8,N$11))","v":0},"W",null,null,{"$f":"(0.75*R$18*FLOOR(R$20,0.05)*0.9*R$35*R$38*o_Isol_Bij_Tijdstip($A78,R$8,R$11))+(0.75*T$18*FLOOR(T$20,0.05)*0.9*T$35*T$38*o_Isol_Bij_Tijdstip($A78,R$8,R$11))","v":0},"W",142.36872749500935,"W"]
["15:00:00",{"$f":"(0.75*B$18*FLOOR(B$20,0.05)*0.9*B$35*B$38*o_Isol_Bij_Tijdstip($A79,B$8,B$11))+(0.75*D$18*FLOOR(D$20,0.05)*0.9*D$35*D$38*o_Isol_Bij_Tijdstip($A79,B$8,B$11))","v":0},"W",{"$f":"o_maxTemp(VALUE(A79))","v":29.800000000000015},null,{"$f":"(0.75*F$18*FLOOR(F$20,0.05)*0.9*F$35*F$38*o_Isol_Bij_Tijdstip($A79,F$8,F$11))+(0.75*H$18*FLOOR(H$20,0.05)*0.9*H$35*H$38*o_Isol_Bij_Tijdstip($A79,F$8,F$11))","v":0},"W",null,null,{"$f":"(0.75*J$18*FLOOR(J$20,0.05)*0.9*J$35*J$38*o_Isol_Bij_Tijdstip($A79,J$8,J$11))+(0.75*L$18*FLOOR(L$20,0.05)*0.9*L$35*L$38*o_Isol_Bij_Tijdstip($A79,J$8,J$11))","v":114.70664535757152},"W",null,null,{"$f":"(0.75*N$18*FLOOR(N$20,0.05)*0.9*N$35*N$38*o_Isol_Bij_Tijdstip($A79,N$8,N$11))+(0.75*P$18*FLOOR(P$20,0.05)*0.9*P$35*P$38*o_Isol_Bij_Tijdstip($A79,N$8,N$11))","v":0},"W",null,null,{"$f":"(0.75*R$18*FLOOR(R$20,0.05)*0.9*R$35*R$38*o_Isol_Bij_Tijdstip($A79,R$8,R$11))+(0.75*T$18*FLOOR(T$20,0.05)*0.9*T$35*T$38*o_Isol_Bij_Tijdstip($A79,R$8,R$11))","v":0},"W",114.70664535757152,"W"]
["16:00:00",{"$f":"(0.75*B$18*FLOOR(B$20,0.05)*0.9*B$35*B$38*o_Isol_Bij_Tijdstip($A80,B$8,B$11))+(0.75*D$18*FLOOR(D$20,0.05)*0.9*D$35*D$38*o_Isol_Bij_Tijdstip($A80,B$8,B$11))","v":0},"W",{"$f":"o_maxTemp(VALUE(A80))","v":30.400000000000006},null,{"$f":"(0.75*F$18*FLOOR(F$20,0.05)*0.9*F$35*F$38*o_Isol_Bij_Tijdstip($A80,F$8,F$11))+(0.75*H$18*FLOOR(H$20,0.05)*0.9*H$35*H$38*o_Isol_Bij_Tijdstip($A80,F$8,F$11))","v":0},"W",null,null,{"$f":"(0.75*J$18*FLOOR(J$20,0.05)*0.9*J$35*J$38*o_Isol_Bij_Tijdstip($A80,J$8,J$11))+(0.75*L$18*FLOOR(L$20,0.05)*0.9*L$35*L$38*o_Isol_Bij_Tijdstip($A80,J$8,J$11))","v":72.906286071279368},"W",null,null,{"$f":"(0.75*N$18*FLOOR(N$20,0.05)*0.9*N$35*N$38*o_Isol_Bij_Tijdstip($A80,N$8,N$11))+(0.75*P$18*FLOOR(P$20,0.05)*0.9*P$35*P$38*o_Isol_Bij_Tijdstip($A80,N$8,N$11))","v":0},"W",null,null,{"$f":"(0.75*R$18*FLOOR(R$20,0.05)*0.9*R$35*R$38*o_Isol_Bij_Tijdstip($A80,R$8,R$11))+(0.75*T$18*FLOOR(T$20,0.05)*0.9*T$35*T$38*o_Isol_Bij_Tijdstip($A80,R$8,R$11))","v":0},"W",72.906286071279368,"W"]
["17:00:00",{"$f":"(0.75*B$18*FLOOR(B$20,0.05)*0.9*B$35*B$38*o_Isol_Bij_Tijdstip($A81,B$8,B$11))+(0.75*D$18*FLOOR(D$20,0.05)*0.9*D$35*D$38*o_Isol_Bij_Tijdstip($A81,B$8,B$11))","v":0},"W",{"$f":"o_maxTemp(VALUE(A81))","v":30.59999999999998},null,{"$f":"(0.75*F$18*FLOOR(F$20,0.05)*0.9*F$35*F$38*o_Isol_Bij_Tijdstip($A81,F$8,F$11))+(0.75*H$18*FLOOR(H$20,0.05)*0.9*H$35*H$38*o_Isol_Bij_Tijdstip($A81,F$8,F$11))","v":0},"W",null,null,{"$f":"(0.75*J$18*FLOOR(J$20,0.05)*0.9*J$35*J$38*o_Isol_Bij_Tijdstip($A81,J$8,J$11))+(0.75*L$18*FLOOR(L$20,0.05)*0.9*L$35*L$38*o_Isol_Bij_Tijdstip($A81,J$8,J$11))","v":44.139002199995801},"W",null,null,{"$f":"(0.75*N$18*FLOOR(N$20,0.05)*0.9*N$35*N$38*o_Isol_Bij_Tijdstip($A81,N$8,N$11))+(0.75*P$18*FLOOR(P$20,0.05)*0.9*P$35*P$38*o_Isol_Bij_Tijdstip($A81,N$8,N$11))","v":0},"W",null,null,{"$f":"(0.75*R$18*FLOOR(R$20,0.05)*0.9*R$35*R$38*o_Isol_Bij_Tijdstip($A81,R$8,R$11))+(0.75*T$18*FLOOR(T$20,0.05)*0.9*T$35*T$38*o_Isol_Bij_Tijdstip($A81,R$8,R$11))","v":0},"W",44.139002199995801,"W"]
["18:00:00",{"$f":"(0.75*B$18*FLOOR(B$20,0.05)*0.9*B$35*B$38*o_Isol_Bij_Tijdstip($A82,B$8,B$11))+(0.75*D$18*FLOOR(D$20,0.05)*0.9*D$35*D$38*o_Isol_Bij_Tijdstip($A82,B$8,B$11))","v":0},"W",{"$f":"o_maxTemp(VALUE(A82))","v":30.099999999999973},null,{"$f":"(0.75*F$18*FLOOR(F$20,0.05)*0.9*F$35*F$38*o_Isol_Bij_Tijdstip($A82,F$8,F$11))+(0.75*H$18*FLOOR(H$20,0.05)*0.9*H$35*H$38*o_Isol_Bij_Tijdstip($A82,F$8,F$11))","v":0},"W",null,null,{"$f":"(0.75*J$18*FLOOR(J$20,0.05)*0.9*J$35*J$38*o_Isol_Bij_Tijdstip($A82,J$8,J$11))+(0.75*L$18*FLOOR(L$20,0.05)*0.9*L$35*L$38*o_Isol_Bij_Tijdstip($A82,J$8,J$11))","v":16.171479168871954},"W",null,null,{"$f":"(0.75*N$18*FLOOR(N$20,0.05)*0.9*N$35*N$38*o_Isol_Bij_Tijdstip($A82,N$8,N$11))+(0.75*P$18*FLOOR(P$20,0.05)*0.9*P$35*P$38*o_Isol_Bij_Tijdstip($A82,N$8,N$11))","v":0},"W",null,null,{"$f":"(0.75*R$18*FLOOR(R$20,0.05)*0.9*R$35*R$38*o_Isol_Bij_Tijdstip($A82,R$8,R$11))+(0.75*T$18*FLOOR(T$20,0.05)*0.9*T$35*T$38*o_Isol_Bij_Tijdstip($A82,R$8,R$11))","v":0},"W",16.171479168871954,"W"]
[]
["Maatgevende tijdstip",{"$f":"IF(MAX(T73:T82)=0,\"Geen glas aanwezig\",_xlfn.XLOOKUP(MAX(T73:T82),T73:T82,A73:A82,\"nvt\"))","v":"14:00:00"}]

{"sheet":"Ruimte 5","index":7,"n_rows":84,"n_cols":21,"rows_kept":84,"cut":false,"hidden":false,"merged":[[66,0,67,20],[0,0,0,20],[6,1,6,3],[6,5,6,7],[6,9,6,11],[6,13,6,15],[6,17,6,20],[41,1,41,3],[41,5,41,7],[41,9,41,11],[41,13,41,15],[41,17,41,19],[40,1,40,3],[40,5,40,7],[40,9,40,11],[40,13,40,15],[40,17,40,19],[55,1,55,3],[55,5,55,7],[55,9,55,11],[55,13,55,15],[55,17,55,19],[54,1,54,3],[54,5,54,7],[54,9,54,11],[54,13,54,15],[54,17,54,19],[56,5,56,7],[56,9,56,11],[56,13,56,15],[56,17,56,19],[57,1,57,3],[57,5,57,7],[57,9,57,11],[57,13,57,15],[57,17,57,19],[59,1,59,3],[60,1,60,3],[62,1,62,3],[63,1,63,3],[56,1,56,3]]}
["RUIMTE 5"]
[]
["Ruimtenaam","slaap 4"]
["Type verblijfsruimte","Andere verblijfsruimte"]
["Vloeroppervlak verblijfsruimte Avr  (gebruiksoppervlak)",20.399999999999999,"m²"]
[]
[null,"Voorzijde woning",null,null,null,"Linker zijde woning",null,null,null,"Achterzijde woning",null,null,null,"Rechter zijde woning",null,null,null,"Platdak"]
["Orientatie gevel / dakvlak (Helling > 15°C)",{"$f":"Invoerblad!$B$17","v":"Noord"},null,null,null,{"$f":"o_Orientatie(F9)","v":"Oost"},null,null,null,{"$f":"o_Orientatie(J9)","v":"Zuid"},null,null,null,{"$f":"o_Orientatie(N9)","v":"West"},null,null,null,"Horizontaal"]
["Orientatiehoek gevel Ƴ",{"$f":"o_OrientatiehOEK(B8)","v":0},null,null,null,{"$f":"IF(B9+90>360,B9+90-360,B9+90)","v":90},null,null,null,{"$f":"IF(F9+90>360,F9+90-360,F9+90)","v":180},null,null,null,{"$f":"IF(J9+90>360,J9+90-360,J9+90)","v":270}]
["Grenst aan buitenlucht ja of nee","Ja",null,null,null,"Nee",null,null,null,"Nee",null,null,null,"Nee",null,null,null,"Ja"]
["Hellingshoek constructie ≥ 15° = hellenddak 90° = gevel",90,"°",null,null,90,"°",null,null,90,"°",null,null,90,"°",null,null,10,"°"]
["Type constructie",{"$f":"o_TypeConstructie(B10,B11)","v":"Buitengevel"},null,null,null,{"$f":"o_TypeConstructie(F10,F11)","v":"Woningscheidend"},null,null,null,{"$f":"o_TypeConstructie(J10,J11)","v":"Woningscheidend"},null,null,null,{"$f":"o_TypeConstructie(N10,N11)","v":"Woningscheidend"},null,null,null,{"$f":"o_TypeConstructie(R10,R11)","v":"Platdak <15°"}]
["Gevel lengte (binnenwerks)",5,"m",null,null,0,"m",null,null,0,"m",null,null,0,"m",null,null,0,"m"]
["Gevel hoogte / Dak breedte (binnenwerks)",2,"m",null,null,0,"m",null,null,0,"m",null,null,0,"m",null,null,0,"m"]
["Constructie oppervlak (binnenwerks)",15.87,"m²",null,null,{"$f":"F13*F14","v":0},"m²",null,null,{"$f":"J13*J14","v":0},"m²",null,null,{"$f":"N13*N14","v":0},"m²",null,null,22.2,"m²"]
["Gesloten constructie oppervlak",{"$f":"MAX(0,B15-B18-D18)","v":10.069999999999999},"m²",null,null,{"$f":"MAX(0,F15-F18-H18)","v":0},"m²",null,null,{"$f":"MAX(0,J15-J18-L18)","v":0},"m²",null,null,{"$f":"MAX(0,N15-N18-P18)","v":0},"m²",null,null,{"$f":"MAX(0,R15-R18-T18)","v":22.2},"m²"]
[null,"Glasvlak type 1",null,"Glasvlak type 2",null,"Glasvlak type 1",null,"Glasvlak type 2",null,"Glasvlak type 1",null,"Glasvlak type 2",null,"Glasvlak type 1",null,"Glasvlak type 2",null,"Glasvlak type 1",null,"Glasvlak type 2"]
["Totaal oppervlak van raamtype Aw,k (inclusief kozijn)",2.9,"m²",2.9,"m²",null,"m²",null,"m²",null,"m²",null,"m²",null,"m²",null,"m²",null,"m²",null,"m²"]
["Warmtedoorgangscoefficient (U-waarde) van het raam Uw;wi;k",1.5,"W/m².K",1.5,"W/m².K",null,"W/m².K",null,"W/m².K",null,"W/m².K",null,"W/m².K",null,"W/m².K",null,"W/m².K",null,"W/m².K",null,"W/m².K"]
["Zontoetredingsfactor (g_waarde) van het glas Ggl;n;wi;k;C;juli",0.6,null,0.6]
["Beschaduwing situatie bij het raamtype","Minimale belemmering",null,"Minimale belemmering",null,"Minimale belemmering",null,"Minimale belemmering",null,"Minimale belemmering",null,"Minimale belemmering",null,"Minimale belemmering",null,"Minimale belemmering",null,"Minimale belemmering",null,"Minimale belemmering"]
[]
[null,"Overstek",null,"Overstek",null,"Overstek",null,"Overstek",null,"Overstek",null,"Overstek",null,"Overstek",null,"Overstek"]
["Hoogte verschil midden raam onderzijde overstek",0,"m",0,"m",0,"m",0,"m",0,"m",0,"m",0,"m",0,"m",0,null,null,"m"]
["Horizontale afstand glas tot eindpunt overstek",0,"m",0,"m",0,"m",0,"m",0,"m",0,"m",0,"m",0,"m",0,null,null,"m"]
["Overstekhoek",{"$f":"IFERROR(180/PI()*ATAN(B24/B25),0)","v":0},"°",{"$f":"IFERROR(180/PI()*ATAN(D24/D25),0)","v":0},"°",{"$f":"IFERROR(180/PI()*ATAN(F24/F25),0)","v":0},"°",{"$f":"IFERROR(180/PI()*ATAN(H24/H25),0)","v":0},"°",{"$f":"IFERROR(180/PI()*ATAN(J24/J25),0)","v":0},"°",{"$f":"IFERROR(180/PI()*ATAN(L24/L25),0)","v":0},"°",{"$f":"IFERROR(180/PI()*ATAN(N24/N25),0)","v":0},"°",{"$f":"IFERROR(180/PI()*ATAN(P24/P25),0)","v":0},"°",null,null,null,"°"]
["Relatieve hoogte van overstek",{"$f":"IFERROR(B24/B25,1)","v":1},null,{"$f":"IFERROR(D24/D25,1)","v":1},null,{"$f":"IFERROR(F24/F25,1)","v":1},null,{"$f":"IFERROR(H24/H25,1)","v":1},null,{"$f":"IFERROR(J24/J25,1)","v":1},null,{"$f":"IFERROR(L24/L25,1)","v":1},null,{"$f":"IFERROR(N24/N25,1)","v":1},null,{"$f":"IFERROR(P24/P25,1)","v":1}]
[]
[null,"Zijbelemmering",null,"Zijbelemmering",null,"Zijbelemmering",null,"Zijbelemmering",null,"Zijbelemmering",null,"Zijbelemmering",null,"Zijbelemmering",null,"Zijbelemmering"]
["Positie zijbelemmering irt zichtveld (naar buitengericht)","Links",null,"Links",null,"Links",null,"Links",null,"Links",null,"Links",null,"Links",null,"Links"]
["Horizontale afstand midden raam verste punt belemmering",0,"m",0,"m",null,"m",null,"m",null,"m",1,"m",null,"m",null,"m",null,null,null,"m"]
["Horizontale breedte glas tot eindpunt belemmering",0,"m",0,"m",null,"m",null,"m",null,"m",null,"m",null,"m",null,"m",null,null,null,"m"]
["Relatieve breedte van de zijbelemmering bb",{"$f":"IFERROR(B31/B32,999)","v":999},null,{"$f":"IFERROR(D31/D32,999)","v":999},null,{"$f":"IFERROR(F31/F32,999)","v":999},null,{"$f":"IFERROR(H31/H32,999)","v":999},null,{"$f":"IFERROR(J31/J32,999)","v":999},null,{"$f":"IFERROR(L31/L32,999)","v":999},null,{"$f":"IFERROR(N31/N32,999)","v":999},null,{"$f":"IFERROR(P31/P32,999)","v":999}]
[]
["De beschaduwingsreductiefactor Fsh;obst;wi;k;juli",{"$f":"IFERROR(o_Beschaduwingreductie(B21,B8,B27,B30,B33,B11),1)","v":1},null,{"$f":"IFERROR(o_Beschaduwingreductie(D21,B8,D27,D30,D33,B11),1)","v":1},null,{"$f":"IFERROR(o_Beschaduwingreductie(F21,F8,F27,F30,F33,F11),1)","v":1},null,{"$f":"IFERROR(o_Beschaduwingreductie(H21,F8,H27,H30,H33,F11),1)","v":1},null,{"$f":"IFERROR(o_Beschaduwingreductie(J21,J8,J27,J30,J33,J11),1)","v":1},null,{"$f":"IFERROR(o_Beschaduwingreductie(L21,J8,L27,L30,L33,J11),1)","v":1},null,{"$f":"IFERROR(o_Beschaduwingreductie(N21,N8,N27,N30,N33,N11),1)","v":1},null,{"$f":"IFERROR(o_Beschaduwingreductie(P21,N8,P27,P30,P33,N11),1)","v":1},null,{"$f":"o_Beschaduwingreductie(R21,R8,R27,R30,R33,R11)","v":1},null,{"$f":"o_Beschaduwingreductie(T21,R8,T27,T30,T33,R11)","v":1}]
[]
["Type zonwering","Geen zonwering",null,"Geen zonwering",null,"Geen zonwering",null,"Geen zonwering",null,"Geen zonwering",null,"Geen zonwering",null,"Geen zonwering",null,"Geen zonwering",null,"Geen zonwering",null,"Geen zonwering"]
["De reductiefactor voor zonwering Fc;wi;k",{"$f":"o_Zonweringreductie(B37,B8)","v":1},null,{"$f":"o_Zonweringreductie(D37,B8)","v":1},null,{"$f":"o_Zonweringreductie(F37,F8)","v":1},null,{"$f":"o_Zonweringreductie(H37,F8)","v":1},null,{"$f":"o_Zonweringreductie(J37,J8)","v":1},null,{"$f":"o_Zonweringreductie(L37,J8)","v":1},null,{"$f":"o_Zonweringreductie(N37,N8)","v":1},null,{"$f":"o_Zonweringreductie(P37,N8)","v":1},null,{"$f":"o_Zonweringreductie(R37,R8)","v":1},null,{"$f":"o_Zonweringreductie(T37,R8)","v":1}]
["Totaal opvallende zonnestraling van het raam Isol;wi;k;juli",{"$f":"IF(B10=\"Nee\",0,o_Isol_Bij_Tijdstip($B$52,B8,B11))","v":143.73988086183414},"W/m²",{"$f":"IF(B10=\"Nee\",0,o_Isol_Bij_Tijdstip($B$52,B8,B11))","v":143.73988086183414},"W/m²",{"$f":"IF(F10=\"Nee\",0,o_Isol_Bij_Tijdstip($B$52,F8,F11))","v":0},"W/m²",{"$f":"IF(F10=\"Nee\",0,o_Isol_Bij_Tijdstip($B$52,F8,F11))","v":0},"W/m²",{"$f":"IF(J10=\"Nee\",0,o_Isol_Bij_Tijdstip($B$52,J8,J11))","v":0},"W/m²",{"$f":"IF(J10=\"Nee\",0,o_Isol_Bij_Tijdstip($B$52,J8,J11))","v":0},"W/m²",{"$f":"IF(N10=\"Nee\",0,o_Isol_Bij_Tijdstip($B$52,N8,N11))","v":0},"W/m²",{"$f":"IF(N10=\"Nee\",0,o_Isol_Bij_Tijdstip($B$52,N8,N11))","v":0},"W/m²",{"$f":"IF(R10=\"Nee\",0,o_Isol_Bij_Tijdstip($B$52,R8,R11))","v":904.02678788476021},"W/m²",{"$f":"IF(R10=\"Nee\",0,o_Isol_Bij_Tijdstip($B$52,R8,R11))","v":904.02678788476021},"W/m²"]
[]
["Tijdstip maximale koellastbijdrage tmax;zi",{"$f":"VALUE(o_Tijdstip_Isol_Max_Orientatie(B8,B11))","v":"15:00:00"},null,null,null,{"$f":"VALUE(o_Tijdstip_Isol_Max_Orientatie(F8,F11))","v":"09:00:00"},null,null,null,{"$f":"VALUE(o_Tijdstip_Isol_Max_Orientatie(J8,J11))","v":"14:00:00"},null,null,null,{"$f":"VALUE(o_Tijdstip_Isol_Max_Orientatie(N8,N11))","v":"18:00:00"},null,null,null,{"$f":"o_Tijdstip_Isol_Max_Orientatie(R8,R11)","v":"16:00:00"}]
["Buitenluchttemperatuur op tijdstip max koellast Θe",{"$f":"o_maxTemp(VALUE(B41))","v":29.8},null,null,"°C",{"$f":"o_maxTemp(VALUE(F41))","v":24.7},null,null,"°C",{"$f":"o_maxTemp(VALUE(J41))","v":29.9},null,null,"°C",{"$f":"o_maxTemp(VALUE(N41))","v":30.1},null,null,"°C",{"$f":"o_maxTemp(VALUE(R41))","v":30.4}]
[]
["Glasopppervlak",{"$f":"IF(B10=\"Ja\",B18+D18,0)","v":5.8},"m²",null,null,{"$f":"IF(F10=\"Ja\",F18+H18,0)","v":0},"m²",null,null,{"$f":"IF(J10=\"Ja\",J18+L18,0)","v":0},"m²",null,null,{"$f":"IF(N10=\"Ja\",N18+P18,0)","v":0},"m²",null,null,{"$f":"IF(R10=\"Ja\",R18+T18,0)","v":0},"m²"]
["Uitwendigescheidingsconstructie niet op Noord?",{"$f":"IF(B10=\"Ja\",IF(B8=\"Noord\",FALSE,TRUE),FALSE)","v":false},null,null,null,{"$f":"IF(F10=\"Ja\",IF(F8=\"Noord\",FALSE,TRUE),FALSE)","v":false},null,null,null,{"$f":"IF(J10=\"Ja\",IF(J8=\"Noord\",FALSE,TRUE),FALSE)","v":false},null,null,null,{"$f":"IF(N10=\"Ja\",IF(N8=\"Noord\",FALSE,TRUE),FALSE)","v":false},null,null,null,{"$f":"IF(R10=\"Ja\",IF(R8=\"Noord\",FALSE,TRUE),FALSE)","v":true}]
["De enige uitwendigescheidingscontructie?",{"$f":"IF(AND(B45=TRUE,COUNTIF($B$45:$R$45,TRUE)=1),TRUE,FALSE)","v":false},null,null,null,{"$f":"IF(AND(F45=TRUE,COUNTIF($B$45:$R$45,TRUE)=1),TRUE,FALSE)","v":false},null,null,null,{"$f":"IF(AND(J45=TRUE,COUNTIF($B$45:$R$45,TRUE)=1),TRUE,FALSE)","v":false},null,null,null,{"$f":"IF(AND(N45=TRUE,COUNTIF($B$45:$R$45,TRUE)=1),TRUE,FALSE)","v":false},null,null,null,{"$f":"IF(AND(R45=TRUE,COUNTIF($B$45:$R$45,TRUE)=1),TRUE,FALSE)","v":true}]
["Totaal glasoppervlak",{"$f":"IF(B8<>\"Noord\",B44,0)","v":0},"m²",null,null,{"$f":"IF(F8<>\"Noord\",F44,0)","v":0},"m²",null,null,{"$f":"IF(J8<>\"Noord\",J44,0)","v":0},"m²",null,null,{"$f":"IF(N8<>\"Noord\",N44,0)","v":0},"m²",null,null,{"$f":"R44","v":0},"m²"]
["Grootste glasoppervlak ",{"$f":"IF(AND(B45,B47=MAX($B$47:$R$47)),TRUE,FALSE)","v":false},null,null,null,{"$f":"IF(AND(F45,F47=MAX($B$47:$R$47)),TRUE,FALSE)","v":false},null,null,null,{"$f":"IF(AND(J45,J47=MAX($B$47:$R$47)),TRUE,FALSE)","v":false},null,null,null,{"$f":"IF(AND(N45,N47=MAX($B$47:$R$47)),TRUE,FALSE)","v":false},null,null,null,{"$f":"IF(AND(R45,R47=MAX($B$47:$R$47)),TRUE,FALSE)","v":true}]
["Dakvlak maatgevend?",{"$f":"IF(AND(B11<90,B15>3*(B18+D18),Invoerblad!$B$25<65),TRUE,FALSE)","v":false},null,null,null,{"$f":"IF(AND(F11<90,F15>3*(F18+H18),Invoerblad!$B$25<65),TRUE,FALSE)","v":false},null,null,null,{"$f":"IF(AND(J11<90,J15>3*(J18+L18),Invoerblad!$B$25<65),TRUE,FALSE)","v":false},null,null,null,{"$f":"IF(AND(N11<90,N15>3*(N18+P18),Invoerblad!$B$25<65),TRUE,FALSE)","v":false},null,null,null,{"$f":"IF(AND(R11<90,R15>3*(R18+T18),Invoerblad!$B$25<65),TRUE,FALSE)","v":true}]
["is er een maatgevend dakoppervlak",{"$f":"IF(COUNTIF($B$49:$R$49,TRUE)>0,TRUE,FALSE)","v":true},null,null,null,{"$f":"IF(COUNTIF($B$49:$R$49,TRUE)>0,TRUE,FALSE)","v":true},null,null,null,{"$f":"IF(COUNTIF($B$49:$R$49,TRUE)>0,TRUE,FALSE)","v":true},null,null,null,{"$f":"IF(COUNTIF($B$49:$R$49,TRUE)>0,TRUE,FALSE)","v":true},null,null,null,{"$f":"IF(COUNTIF($B$49:$R$49,TRUE)>0,TRUE,FALSE)","v":true}]
["Maatgevende tijdstip",{"$f":"IF(OR(B46,AND(B45,B50,B49),AND(B45,B48,NOT(B50))),B41)","v":false},null,null,null,{"$f":"IF(OR(F46,AND(F45,F50,F49),AND(F45,F48,NOT(F50))),F41)","v":false},null,null,null,{"$f":"IF(OR(J46,AND(J45,J50,J49),AND(J45,J48,NOT(J50))),J41)","v":false},null,null,null,{"$f":"IF(OR(N46,AND(N45,N50,N49),AND(N45,N48,NOT(N50))),N41)","v":false},null,null,null,{"$f":"IF(OR(R46,AND(R45,R50,R49),AND(R45,R48,NOT(R50))),R41)","v":"16:00:00"}]
["Maatgevende tijdstip tmax;zi",{"$f":"IFERROR(B84,\"geen glas ingevoerd\")","v":"15:00:00"}]
["Buitenluchttemperatuur op tijdstip max koellast Θe",{"$f":"o_maxTemp(VALUE(B52))","v":29.800000000000015},"°C"]
[]
["Koellastbijdrage transmissie transparante delen Ptr;gl;vr;zi",{"$f":"IF(B10=\"Nee\",0,B16*Invoerblad!$B$16)","v":22.154},null,null,"W",{"$f":"IF(F10=\"Nee\",0,F16*Invoerblad!$B$16)","v":0},null,null,"W",{"$f":"IF(J10=\"Nee\",0,J16*Invoerblad!$B$16)","v":0},null,null,"W",{"$f":"IF(N10=\"Nee\",0,N16*Invoerblad!$B$16)","v":0},null,null,"W",{"$f":"IF(R10=\"Nee\",0,R16*Invoerblad!$B$16)","v":48.84},null,null,"W"]
["Koellastbijdrage zoninstraling transparante delen Psol;vr;zi",{"$f":"(0.75*B18*FLOOR(B20,0.05)*0.9*B35*B38*B39)+(0.75*D18*FLOOR(D20,0.05)*0.9*D35*D38*D39)","v":337.64498014444843},null,null,"W",{"$f":"(0.75*F18*FLOOR(F20,0.05)*0.9*F35*F38*F39)+(0.75*H18*FLOOR(H20,0.05)*0.9*H35*H38*H39)","v":0},null,null,"W",{"$f":"(0.75*J18*FLOOR(J20,0.05)*0.9*J35*J38*J39)+(0.75*L18*FLOOR(L20,0.05)*0.9*L35*L38*L39)","v":0},null,null,"W",{"$f":"(0.75*N18*FLOOR(N20,0.05)*0.9*N35*N38*N39)+(0.75*P18*FLOOR(P20,0.05)*0.9*P35*P38*P39)","v":0},null,null,"W",{"$f":"(0.75*R18*FLOOR(R20,0.05)*0.9*R35*R38*R39)+(0.75*T18*FLOOR(T20,0.05)*0.9*T35*T38*T39)","v":0},null,null,"W"]
["Koellastbijdrage transmissie transparante delen Ptr;gl;vr;zi",{"$f":"IF(B10=\"Nee\",0,IFERROR(B18*B19*($B$53-24),0)+IFERROR(D18*D19*($B$53-24),0))","v":50.460000000000129},null,null,"W",{"$f":"IF(F10=\"Nee\",0,IFERROR(F18*F19*($B$53-24),0)+IFERROR(H18*H19*($B$53-24),0))","v":0},null,null,"W",{"$f":"IF(J10=\"Nee\",0,IFERROR(J18*J19*($B$53-24),0)+IFERROR(L18*L19*($B$53-24),0))","v":0},null,null,"W",{"$f":"IF(N10=\"Nee\",0,IFERROR(N18*N19*($B$53-24),0)+IFERROR(P18*P19*($B$53-24),0))","v":0},null,null,"W",{"$f":"IF(R10=\"Nee\",0,IFERROR(R18*R19*($B$53-24),0)+IFERROR(T18*T19*($B$53-24),0))","v":0},null,null,"W"]
["Totaal koellastbijdrage per gevel",{"$f":"SUM(B55:D57)","v":410.25898014444857},null,null,"W",{"$f":"SUM(F55:H57)","v":0},null,null,"W",{"$f":"SUM(J55:L57)","v":0},null,null,"W",{"$f":"SUM(N55:P57)","v":0},null,null,"W",{"$f":"SUM(R55:R57)","v":48.84},null,null,"W"]
[]
["Koellast door interne warmtelast Pint;calc;woon/overig;zi",{"$f":"IF(B5=0,0,IF(B4=\"Woonvertrek\",2*Invoerblad!$B$40*B5,Invoerblad!$B$40*B5))","v":66.652659574468089},null,null,"W"]
["Koellast door buitenluchttoetreding Pv;calc;vr;zi",{"$f":"IFERROR(MAX((SUM(Invoerblad!$B$28:$B$30)/3600*1.205*1005*(B53-24))/SUM(Invoerblad!$B$47:$T$47)*B5,0),0)","v":89.897018650486984},{"$f":"IFERROR(MAX(SUM(C57:C59)/3600*1.205*1005*(C60-24),0),0)","v":0},{"$f":"IFERROR(MAX(SUM(D57:D59)/3600*1.205*1005*(D60-24),0),0)","v":0},"W"]
[]
["Totaal koellastbijdrage",{"$f":"IFERROR(SUM(B58:T58)+B60+B61,0)","v":615.64865836940362},null,null,"W"]
["Koelbehoefte verblijfsruimte",{"$f":"IFERROR(B63/B5,0)","v":30.178855802421747},null,null,"W/m²"]
[]
[]
["Onderstaande tabellen worden verborgen in de uiteindelijke versie. De tabellen dienen om vast te stellen welk tijdstip tot de hoogste zonbelasting leidt"]
[]
["Isol max voor de orientatie",{"$f":"o_Isol_Max_Orientatie(B8,B11)","v":143.73988086183414},"W/m²",null,null,{"$f":"o_Isol_Max_Orientatie(F8,F11)","v":845.32772366250799},"W/m²",null,null,{"$f":"o_Isol_Max_Orientatie(J8,J11)","v":740.05836254715712},"W/m²",null,null,{"$f":"o_Isol_Max_Orientatie(N8,N11)","v":741.75809294382429},"W/m²",null,null,{"$f":"o_Isol_Max_Orientatie(R8,R11)","v":914.16092603772574},"W/m²"]
["Tijdstip bij Isol max bij orientatie",{"$f":"VALUE(o_Tijdstip_Isol_Max_Orientatie(B8,B11))","v":"15:00:00"},null,null,null,{"$f":"VALUE(o_Tijdstip_Isol_Max_Orientatie(F8,F11))","v":"09:00:00"},null,null,null,{"$f":"VALUE(o_Tijdstip_Isol_Max_Orientatie(J8,J11))","v":"14:00:00"},null,null,null,{"$f":"VALUE(o_Tijdstip_Isol_Max_Orientatie(N8,N11))","v":"18:00:00"},null,null,null,{"$f":"VALUE(o_Tijdstip_Isol_Max_Orientatie(R8,R11))","v":"16:00:00"}]
[]
["Koellastbijdrage zoninstraling transparante delen Psol;vr;zi"]
["09:00:00",{"$f":"(0.75*B$18*FLOOR(B$20,0.05)*0.9*B$35*B$38*o_Isol_Bij_Tijdstip($A73,B$8,B$11))+(0.75*D$18*FLOOR(D$20,0.05)*0.9*D$35*D$38*o_Isol_Bij_Tijdstip($A73,B$8,B$11))","v":283.90571418378943},"W",null,null,{"$f":"(0.75*F$18*FLOOR(F$20,0.05)*0.9*F$35*F$38*o_Isol_Bij_Tijdstip($A73,F$8,F$11))+(0.75*H$18*FLOOR(H$20,0.05)*0.9*H$35*H$38*o_Isol_Bij_Tijdstip($A73,F$8,F$11))","v":0},"W",null,null,{"$f":"(0.75*J$18*FLOOR(J$20,0.05)*0.9*J$35*J$38*o_Isol_Bij_Tijdstip($A73,J$8,J$11))+(0.75*L$18*FLOOR(L$20,0.05)*0.9*L$35*L$38*o_Isol_Bij_Tijdstip($A73,J$8,J$11))","v":0},"W",null,null,{"$f":"(0.75*N$18*FLOOR(N$20,0.05)*0.9*N$35*N$38*o_Isol_Bij_Tijdstip($A73,N$8,N$11))+(0.75*P$18*FLOOR(P$20,0.05)*0.9*P$35*P$38*o_Isol_Bij_Tijdstip($A73,N$8,N$11))","v":0},"W",null,null,{"$f":"(0.75*R$18*FLOOR(R$20,0.05)*0.9*R$35*R$38*o_Isol_Bij_Tijdstip($A73,R$8,R$11))+(0.75*T$18*FLOOR(T$20,0.05)*0.9*T$35*T$38*o_Isol_Bij_Tijdstip($A73,R$8,R$11))","v":0},"W",{"$f":"B73+F73+J73+N73+R73","v":283.90571418378943},"W"]
["10:00:00",{"$f":"(0.75*B$18*FLOOR(B$20,0.05)*0.9*B$35*B$38*o_Isol_Bij_Tijdstip($A74,B$8,B$11))+(0.75*D$18*FLOOR(D$20,0.05)*0.9*D$35*D$38*o_Isol_Bij_Tijdstip($A74,B$8,B$11))","v":317.37923225739166},"W",null,null,{"$f":"(0.75*F$18*FLOOR(F$20,0.05)*0.9*F$35*F$38*o_Isol_Bij_Tijdstip($A74,F$8,F$11))+(0.75*H$18*FLOOR(H$20,0.05)*0.9*H$35*H$38*o_Isol_Bij_Tijdstip($A74,F$8,F$11))","v":0},"W",null,null,{"$f":"(0.75*J$18*FLOOR(J$20,0.05)*0.9*J$35*J$38*o_Isol_Bij_Tijdstip($A74,J$8,J$11))+(0.75*L$18*FLOOR(L$20,0.05)*0.9*L$35*L$38*o_Isol_Bij_Tijdstip($A74,J$8,J$11))","v":0},"W",null,null,{"$f":"(0.75*N$18*FLOOR(N$20,0.05)*0.9*N$35*N$38*o_Isol_Bij_Tijdstip($A74,N$8,N$11))+(0.75*P$18*FLOOR(P$20,0.05)*0.9*P$35*P$38*o_Isol_Bij_Tijdstip($A74,N$8,N$11))","v":0},"W",null,null,{"$f":"(0.75*R$18*FLOOR(R$20,0.05)*0.9*R$35*R$38*o_Isol_Bij_Tijdstip($A74,R$8,R$11))+(0.75*T$18*FLOOR(T$20,0.05)*0.9*T$35*T$38*o_Isol_Bij_Tijdstip($A74,R$8,R$11))","v":0},"W",317.37923225739166,"W"]
["11:00:00",{"$f":"(0.75*B$18*FLOOR(B$20,0.05)*0.9*B$35*B$38*o_Isol_Bij_Tijdstip($A75,B$8,B$11))+(0.75*D$18*FLOOR(D$20,0.05)*0.9*D$35*D$38*o_Isol_Bij_Tijdstip($A75,B$8,B$11))","v":320.01486008635646},"W",null,null,{"$f":"(0.75*F$18*FLOOR(F$20,0.05)*0.9*F$35*F$38*o_Isol_Bij_Tijdstip($A75,F$8,F$11))+(0.75*H$18*FLOOR(H$20,0.05)*0.9*H$35*H$38*o_Isol_Bij_Tijdstip($A75,F$8,F$11))","v":0},"W",null,null,{"$f":"(0.75*J$18*FLOOR(J$20,0.05)*0.9*J$35*J$38*o_Isol_Bij_Tijdstip($A75,J$8,J$11))+(0.75*L$18*FLOOR(L$20,0.05)*0.9*L$35*L$38*o_Isol_Bij_Tijdstip($A75,J$8,J$11))","v":0},"W",null,null,{"$f":"(0.75*N$18*FLOOR(N$20,0.05)*0.9*N$35*N$38*o_Isol_Bij_Tijdstip($A75,N$8,N$11))+(0.75*P$18*FLOOR(P$20,0.05)*0.9*P$35*P$38*o_Isol_Bij_Tijdstip($A75,N$8,N$11))","v":0},"W",null,null,{"$f":"(0.75*R$18*FLOOR(R$20,0.05)*0.9*R$35*R$38*o_Isol_Bij_Tijdstip($A75,R$8,R$11))+(0.75*T$18*FLOOR(T$20,0.05)*0.9*T$35*T$38*o_Isol_Bij_Tijdstip($A75,R$8,R$11))","v":0},"W",320.01486008635646,"W"]
["12:00:00",{"$f":"(0.75*B$18*FLOOR(B$20,0.05)*0.9*B$35*B$38*o_Isol_Bij_Tijdstip($A76,B$8,B$11))+(0.75*D$18*FLOOR(D$20,0.05)*0.9*D$35*D$38*o_Isol_Bij_Tijdstip($A76,B$8,B$11))","v":331.76387529691272},"W",null,null,{"$f":"(0.75*F$18*FLOOR(F$20,0.05)*0.9*F$35*F$38*o_Isol_Bij_Tijdstip($A76,F$8,F$11))+(0.75*H$18*FLOOR(H$20,0.05)*0.9*H$35*H$38*o_Isol_Bij_Tijdstip($A76,F$8,F$11))","v":0},"W",null,null,{"$f":"(0.75*J$18*FLOOR(J$20,0.05)*0.9*J$35*J$38*o_Isol_Bij_Tijdstip($A76,J$8,J$11))+(0.75*L$18*FLOOR(L$20,0.05)*0.9*L$35*L$38*o_Isol_Bij_Tijdstip($A76,J$8,J$11))","v":0},"W",null,null,{"$f":"(0.75*N$18*FLOOR(N$20,0.05)*0.9*N$35*N$38*o_Isol_Bij_Tijdstip($A76,N$8,N$11))+(0.75*P$18*FLOOR(P$20,0.05)*0.9*P$35*P$38*o_Isol_Bij_Tijdstip($A76,N$8,N$11))","v":0},"W",null,null,{"$f":"(0.75*R$18*FLOOR(R$20,0.05)*0.9*R$35*R$38*o_Isol_Bij_Tijdstip($A76,R$8,R$11))+(0.75*T$18*FLOOR(T$20,0.05)*0.9*T$35*T$38*o_Isol_Bij_Tijdstip($A76,R$8,R$11))","v":0},"W",331.76387529691272,"W"]
["13:00:00",{"$f":"(0.75*B$18*FLOOR(B$20,0.05)*0.9*B$35*B$38*o_Isol_Bij_Tijdstip($A77,B$8,B$11))+(0.75*D$18*FLOOR(D$20,0.05)*0.9*D$35*D$38*o_Isol_Bij_Tijdstip($A77,B$8,B$11))","v":331.28696333699457},"W",null,null,{"$f":"(0.75*F$18*FLOOR(F$20,0.05)*0.9*F$35*F$38*o_Isol_Bij_Tijdstip($A77,F$8,F$11))+(0.75*H$18*FLOOR(H$20,0.05)*0.9*H$35*H$38*o_Isol_Bij_Tijdstip($A77,F$8,F$11))","v":0},"W",null,null,{"$f":"(0.75*J$18*FLOOR(J$20,0.05)*0.9*J$35*J$38*o_Isol_Bij_Tijdstip($A77,J$8,J$11))+(0.75*L$18*FLOOR(L$20,0.05)*0.9*L$35*L$38*o_Isol_Bij_Tijdstip($A77,J$8,J$11))","v":0},"W",null,null,{"$f":"(0.75*N$18*FLOOR(N$20,0.05)*0.9*N$35*N$38*o_Isol_Bij_Tijdstip($A77,N$8,N$11))+(0.75*P$18*FLOOR(P$20,0.05)*0.9*P$35*P$38*o_Isol_Bij_Tijdstip($A77,N$8,N$11))","v":0},"W",null,null,{"$f":"(0.75*R$18*FLOOR(R$20,0.05)*0.9*R$35*R$38*o_Isol_Bij_Tijdstip($A77,R$8,R$11))+(0.75*T$18*FLOOR(T$20,0.05)*0.9*T$35*T$38*o_Isol_Bij_Tijdstip($A77,R$8,R$11))","v":0},"W",331.28696333699457,"W"]
["14:00:00",{"$f":"(0.75*B$18*FLOOR(B$20,0.05)*0.9*B$35*B$38*o_Isol_Bij_Tijdstip($A78,B$8,B$11))+(0.75*D$18*FLOOR(D$20,0.05)*0.9*D$35*D$38*o_Isol_Bij_Tijdstip($A78,B$8,B$11))","v":335.17531716087143},"W",null,null,{"$f":"(0.75*F$18*FLOOR(F$20,0.05)*0.9*F$35*F$38*o_Isol_Bij_Tijdstip($A78,F$8,F$11))+(0.75*H$18*FLOOR(H$20,0.05)*0.9*H$35*H$38*o_Isol_Bij_Tijdstip($A78,F$8,F$11))","v":0},"W",null,null,{"$f":"(0.75*J$18*FLOOR(J$20,0.05)*0.9*J$35*J$38*o_Isol_Bij_Tijdstip($A78,J$8,J$11))+(0.75*L$18*FLOOR(L$20,0.05)*0.9*L$35*L$38*o_Isol_Bij_Tijdstip($A78,J$8,J$11))","v":0},"W",null,null,{"$f":"(0.75*N$18*FLOOR(N$20,0.05)*0.9*N$35*N$38*o_Isol_Bij_Tijdstip($A78,N$8,N$11))+(0.75*P$18*FLOOR(P$20,0.05)*0.9*P$35*P$38*o_Isol_Bij_Tijdstip($A78,N$8,N$11))","v":0},"W",null,null,{"$f":"(0.75*R$18*FLOOR(R$20,0.05)*0.9*R$35*R$38*o_Isol_Bij_Tijdstip($A78,R$8,R$11))+(0.75*T$18*FLOOR(T$20,0.05)*0.9*T$35*T$38*o_Isol_Bij_Tijdstip($A78,R$8,R$11))","v":0},"W",335.17531716087143,"W"]
["15:00:00",{"$f":"(0.75*B$18*FLOOR(B$20,0.05)*0.9*B$35*B$38*o_Isol_Bij_Tijdstip($A79,B$8,B$11))+(0.75*D$18*FLOOR(D$20,0.05)*0.9*D$35*D$38*o_Isol_Bij_Tijdstip($A79,B$8,B$11))","v":337.64498014444843},"W",null,null,{"$f":"(0.75*F$18*FLOOR(F$20,0.05)*0.9*F$35*F$38*o_Isol_Bij_Tijdstip($A79,F$8,F$11))+(0.75*H$18*FLOOR(H$20,0.05)*0.9*H$35*H$38*o_Isol_Bij_Tijdstip($A79,F$8,F$11))","v":0},"W",null,null,{"$f":"(0.75*J$18*FLOOR(J$20,0.05)*0.9*J$35*J$38*o_Isol_Bij_Tijdstip($A79,J$8,J$11))+(0.75*L$18*FLOOR(L$20,0.05)*0.9*L$35*L$38*o_Isol_Bij_Tijdstip($A79,J$8,J$11))","v":0},"W",null,null,{"$f":"(0.75*N$18*FLOOR(N$20,0.05)*0.9*N$35*N$38*o_Isol_Bij_Tijdstip($A79,N$8,N$11))+(0.75*P$18*FLOOR(P$20,0.05)*0.9*P$35*P$38*o_Isol_Bij_Tijdstip($A79,N$8,N$11))","v":0},"W",null,null,{"$f":"(0.75*R$18*FLOOR(R$20,0.05)*0.9*R$35*R$38*o_Isol_Bij_Tijdstip($A79,R$8,R$11))+(0.75*T$18*FLOOR(T$20,0.05)*0.9*T$35*T$38*o_Isol_Bij_Tijdstip($A79,R$8,R$11))","v":0},"W",337.64498014444843,"W"]
["16:00:00",{"$f":"(0.75*B$18*FLOOR(B$20,0.05)*0.9*B$35*B$38*o_Isol_Bij_Tijdstip($A80,B$8,B$11))+(0.75*D$18*FLOOR(D$20,0.05)*0.9*D$35*D$38*o_Isol_Bij_Tijdstip($A80,B$8,B$11))","v":277.15816836965854},"W",null,null,{"$f":"(0.75*F$18*FLOOR(F$20,0.05)*0.9*F$35*F$38*o_Isol_Bij_Tijdstip($A80,F$8,F$11))+(0.75*H$18*FLOOR(H$20,0.05)*0.9*H$35*H$38*o_Isol_Bij_Tijdstip($A80,F$8,F$11))","v":0},"W",null,null,{"$f":"(0.75*J$18*FLOOR(J$20,0.05)*0.9*J$35*J$38*o_Isol_Bij_Tijdstip($A80,J$8,J$11))+(0.75*L$18*FLOOR(L$20,0.05)*0.9*L$35*L$38*o_Isol_Bij_Tijdstip($A80,J$8,J$11))","v":0},"W",null,null,{"$f":"(0.75*N$18*FLOOR(N$20,0.05)*0.9*N$35*N$38*o_Isol_Bij_Tijdstip($A80,N$8,N$11))+(0.75*P$18*FLOOR(P$20,0.05)*0.9*P$35*P$38*o_Isol_Bij_Tijdstip($A80,N$8,N$11))","v":0},"W",null,null,{"$f":"(0.75*R$18*FLOOR(R$20,0.05)*0.9*R$35*R$38*o_Isol_Bij_Tijdstip($A80,R$8,R$11))+(0.75*T$18*FLOOR(T$20,0.05)*0.9*T$35*T$38*o_Isol_Bij_Tijdstip($A80,R$8,R$11))","v":0},"W",277.15816836965854,"W"]
["17:00:00",{"$f":"(0.75*B$18*FLOOR(B$20,0.05)*0.9*B$35*B$38*o_Isol_Bij_Tijdstip($A81,B$8,B$11))+(0.75*D$18*FLOOR(D$20,0.05)*0.9*D$35*D$38*o_Isol_Bij_Tijdstip($A81,B$8,B$11))","v":244.99859497773366},"W",null,null,{"$f":"(0.75*F$18*FLOOR(F$20,0.05)*0.9*F$35*F$38*o_Isol_Bij_Tijdstip($A81,F$8,F$11))+(0.75*H$18*FLOOR(H$20,0.05)*0.9*H$35*H$38*o_Isol_Bij_Tijdstip($A81,F$8,F$11))","v":0},"W",null,null,{"$f":"(0.75*J$18*FLOOR(J$20,0.05)*0.9*J$35*J$38*o_Isol_Bij_Tijdstip($A81,J$8,J$11))+(0.75*L$18*FLOOR(L$20,0.05)*0.9*L$35*L$38*o_Isol_Bij_Tijdstip($A81,J$8,J$11))","v":0},"W",null,null,{"$f":"(0.75*N$18*FLOOR(N$20,0.05)*0.9*N$35*N$38*o_Isol_Bij_Tijdstip($A81,N$8,N$11))+(0.75*P$18*FLOOR(P$20,0.05)*0.9*P$35*P$38*o_Isol_Bij_Tijdstip($A81,N$8,N$11))","v":0},"W",null,null,{"$f":"(0.75*R$18*FLOOR(R$20,0.05)*0.9*R$35*R$38*o_Isol_Bij_Tijdstip($A81,R$8,R$11))+(0.75*T$18*FLOOR(T$20,0.05)*0.9*T$35*T$38*o_Isol_Bij_Tijdstip($A81,R$8,R$11))","v":0},"W",244.99859497773366,"W"]
["18:00:00",{"$f":"(0.75*B$18*FLOOR(B$20,0.05)*0.9*B$35*B$38*o_Isol_Bij_Tijdstip($A82,B$8,B$11))+(0.75*D$18*FLOOR(D$20,0.05)*0.9*D$35*D$38*o_Isol_Bij_Tijdstip($A82,B$8,B$11))","v":240.04133673077581},"W",null,null,{"$f":"(0.75*F$18*FLOOR(F$20,0.05)*0.9*F$35*F$38*o_Isol_Bij_Tijdstip($A82,F$8,F$11))+(0.75*H$18*FLOOR(H$20,0.05)*0.9*H$35*H$38*o_Isol_Bij_Tijdstip($A82,F$8,F$11))","v":0},"W",null,null,{"$f":"(0.75*J$18*FLOOR(J$20,0.05)*0.9*J$35*J$38*o_Isol_Bij_Tijdstip($A82,J$8,J$11))+(0.75*L$18*FLOOR(L$20,0.05)*0.9*L$35*L$38*o_Isol_Bij_Tijdstip($A82,J$8,J$11))","v":0},"W",null,null,{"$f":"(0.75*N$18*FLOOR(N$20,0.05)*0.9*N$35*N$38*o_Isol_Bij_Tijdstip($A82,N$8,N$11))+(0.75*P$18*FLOOR(P$20,0.05)*0.9*P$35*P$38*o_Isol_Bij_Tijdstip($A82,N$8,N$11))","v":0},"W",null,null,{"$f":"(0.75*R$18*FLOOR(R$20,0.05)*0.9*R$35*R$38*o_Isol_Bij_Tijdstip($A82,R$8,R$11))+(0.75*T$18*FLOOR(T$20,0.05)*0.9*T$35*T$38*o_Isol_Bij_Tijdstip($A82,R$8,R$11))","v":0},"W",240.04133673077581,"W"]
[]
["Maatgevende tijdstip",{"$f":"IF(MAX(T73:T82)=0,\"Geen glas aanwezig\",_xlfn.XLOOKUP(MAX(T73:T82),T73:T82,A73:A82,\"nvt\"))","v":"15:00:00"}]

{"sheet":"Ruimte 6","index":8,"n_rows":84,"n_cols":21,"rows_kept":84,"cut":false,"hidden":false,"merged":[[66,0,67,20],[0,0,0,20],[6,1,6,3],[6,5,6,7],[6,9,6,11],[6,13,6,15],[6,17,6,20],[41,1,41,3],[41,5,41,7],[41,9,41,11],[41,13,41,15],[41,17,41,19],[40,1,40,3],[40,5,40,7],[40,9,40,11],[40,13,40,15],[40,17,40,19],[55,1,55,3],[55,5,55,7],[55,9,55,11],[55,13,55,15],[55,17,55,19],[54,1,54,3],[54,5,54,7],[54,9,54,11],[54,13,54,15],[54,17,54,19],[56,5,56,7],[56,9,56,11],[56,13,56,15],[56,17,56,19],[57,1,57,3],[57,5,57,7],[57,9,57,11],[57,13,57,15],[57,17,57,19],[59,1,59,3],[60,1,60,3],[62,1,62,3],[63,1,63,3],[56,1,56,3]]}
["RUIMTE 6"]
[]
["Ruimtenaam","slaap 5"]
["Type verblijfsruimte","Andere verblijfsruimte"]
["Vloeroppervlak verblijfsruimte Avr  (gebruiksoppervlak)",18.100000000000001,"m²"]
[]
[null,"Voorzijde woning",null,null,null,"Linker zijde woning",null,null,null,"Achterzijde woning",null,null,null,"Rechter zijde woning",null,null,null,"Platdak"]
["Orientatie gevel / dakvlak (Helling > 15°C)",{"$f":"Invoerblad!$B$17","v":"Noord"},null,null,null,{"$f":"o_Orientatie(F9)","v":"Oost"},null,null,null,{"$f":"o_Orientatie(J9)","v":"Zuid"},null,null,null,{"$f":"o_Orientatie(N9)","v":"West"},null,null,null,"Horizontaal"]
["Orientatiehoek gevel Ƴ",{"$f":"o_OrientatiehOEK(B8)","v":0},null,null,null,{"$f":"IF(B9+90>360,B9+90-360,B9+90)","v":90},null,null,null,{"$f":"IF(F9+90>360,F9+90-360,F9+90)","v":180},null,null,null,{"$f":"IF(J9+90>360,J9+90-360,J9+90)","v":270}]
["Grenst aan buitenlucht ja of nee","Nee",null,null,null,"Nee",null,null,null,"Ja",null,null,null,"Nee",null,null,null,"Ja"]
["Hellingshoek constructie ≥ 15° = hellenddak 90° = gevel",90,"°",null,null,90,"°",null,null,90,"°",null,null,90,"°",null,null,10,"°"]
["Type constructie",{"$f":"o_TypeConstructie(B10,B11)","v":"Woningscheidend"},null,null,null,{"$f":"o_TypeConstructie(F10,F11)","v":"Woningscheidend"},null,null,null,{"$f":"o_TypeConstructie(J10,J11)","v":"Buitengevel"},null,null,null,{"$f":"o_TypeConstructie(N10,N11)","v":"Woningscheidend"},null,null,null,{"$f":"o_TypeConstructie(R10,R11)","v":"Platdak <15°"}]
["Gevel lengte (binnenwerks)",5,"m",null,null,0,"m",null,null,0,"m",null,null,0,"m",null,null,0,"m"]
["Gevel hoogte / Dak breedte (binnenwerks)",2,"m",null,null,0,"m",null,null,0,"m",null,null,0,"m",null,null,0,"m"]
["Constructie oppervlak (binnenwerks)",{"$f":"B13*B14","v":10},"m²",null,null,{"$f":"F13*F14","v":0},"m²",null,null,15.87,"m²",null,null,{"$f":"N13*N14","v":0},"m²",null,null,19.3,"m²"]
["Gesloten constructie oppervlak",{"$f":"MAX(0,B15-B18-D18)","v":10},"m²",null,null,{"$f":"MAX(0,F15-F18-H18)","v":0},"m²",null,null,{"$f":"MAX(0,J15-J18-L18)","v":12.069999999999999},"m²",null,null,{"$f":"MAX(0,N15-N18-P18)","v":0},"m²",null,null,{"$f":"MAX(0,R15-R18-T18)","v":19.3},"m²"]
[null,"Glasvlak type 1",null,"Glasvlak type 2",null,"Glasvlak type 1",null,"Glasvlak type 2",null,"Glasvlak type 1",null,"Glasvlak type 2",null,"Glasvlak type 1",null,"Glasvlak type 2",null,"Glasvlak type 1",null,"Glasvlak type 2"]
["Totaal oppervlak van raamtype Aw,k (inclusief kozijn)",0,"m²",0,"m²",0,"m²",0,"m²",1.9,"m²",1.9,"m²",0,"m²",0,"m²",0,"m²",0,"m²"]
["Warmtedoorgangscoefficient (U-waarde) van het raam Uw;wi;k",1.6,"W/m².K",1.6,"W/m².K",1.6,"W/m².K",1.6,"W/m².K",1.5,"W/m².K",1.5,"W/m².K",1.6,"W/m².K",1.6,"W/m².K",1.6,"W/m².K",1.6,"W/m².K"]
["Zontoetredingsfactor (g_waarde) van het glas Ggl;n;wi;k;C;juli",1,null,1,null,1,null,1,null,0.6,null,0.6,null,1,null,1,null,1,null,1]
["Beschaduwing situatie bij het raamtype","Minimale belemmering",null,"Minimale belemmering",null,"Minimale belemmering",null,"Minimale belemmering",null,"Minimale belemmering",null,"Minimale belemmering",null,"Minimale belemmering",null,"Minimale belemmering",null,"Minimale belemmering",null,"Minimale belemmering"]
[]
[null,"Overstek",null,"Overstek",null,"Overstek",null,"Overstek",null,"Overstek",null,"Overstek",null,"Overstek",null,"Overstek"]
["Hoogte verschil midden raam onderzijde overstek",0,"m",0,"m",0,"m",0,"m",0,"m",0,"m",0,"m",0,"m",0,null,null,"m"]
["Horizontale afstand glas tot eindpunt overstek",0,"m",0,"m",0,"m",0,"m",0,"m",0,"m",0,"m",0,"m",0,null,null,"m"]
["Overstekhoek",{"$f":"IFERROR(180/PI()*ATAN(B24/B25),0)","v":0},"°",{"$f":"IFERROR(180/PI()*ATAN(D24/D25),0)","v":0},"°",{"$f":"IFERROR(180/PI()*ATAN(F24/F25),0)","v":0},"°",{"$f":"IFERROR(180/PI()*ATAN(H24/H25),0)","v":0},"°",{"$f":"IFERROR(180/PI()*ATAN(J24/J25),0)","v":0},"°",{"$f":"IFERROR(180/PI()*ATAN(L24/L25),0)","v":0},"°",{"$f":"IFERROR(180/PI()*ATAN(N24/N25),0)","v":0},"°",{"$f":"IFERROR(180/PI()*ATAN(P24/P25),0)","v":0},"°",null,null,null,"°"]
["Relatieve hoogte van overstek",{"$f":"IFERROR(B24/B25,1)","v":1},null,{"$f":"IFERROR(D24/D25,1)","v":1},null,{"$f":"IFERROR(F24/F25,1)","v":1},null,{"$f":"IFERROR(H24/H25,1)","v":1},null,{"$f":"IFERROR(J24/J25,1)","v":1},null,{"$f":"IFERROR(L24/L25,1)","v":1},null,{"$f":"IFERROR(N24/N25,1)","v":1},null,{"$f":"IFERROR(P24/P25,1)","v":1}]
[]
[null,"Zijbelemmering",null,"Zijbelemmering",null,"Zijbelemmering",null,"Zijbelemmering",null,"Zijbelemmering",null,"Zijbelemmering",null,"Zijbelemmering",null,"Zijbelemmering"]
["Positie zijbelemmering irt zichtveld (naar buitengericht)","Links",null,"Links",null,"Links",null,"Links",null,"Links",null,"Links",null,"Links",null,"Links"]
["Horizontale afstand midden raam verste punt belemmering",0,"m",0,"m",null,"m",null,"m",null,"m",1,"m",null,"m",null,"m",null,null,null,"m"]
["Horizontale breedte glas tot eindpunt belemmering",0,"m",0,"m",null,"m",null,"m",null,"m",null,"m",null,"m",null,"m",null,null,null,"m"]
["Relatieve breedte van de zijbelemmering bb",{"$f":"IFERROR(B31/B32,999)","v":999},null,{"$f":"IFERROR(D31/D32,999)","v":999},null,{"$f":"IFERROR(F31/F32,999)","v":999},null,{"$f":"IFERROR(H31/H32,999)","v":999},null,{"$f":"IFERROR(J31/J32,999)","v":999},null,{"$f":"IFERROR(L31/L32,999)","v":999},null,{"$f":"IFERROR(N31/N32,999)","v":999},null,{"$f":"IFERROR(P31/P32,999)","v":999}]
[]
["De beschaduwingsreductiefactor Fsh;obst;wi;k;juli",{"$f":"IFERROR(o_Beschaduwingreductie(B21,B8,B27,B30,B33,B11),1)","v":1},null,{"$f":"IFERROR(o_Beschaduwingreductie(D21,B8,D27,D30,D33,B11),1)","v":1},null,{"$f":"IFERROR(o_Beschaduwingreductie(F21,F8,F27,F30,F33,F11),1)","v":1},null,{"$f":"IFERROR(o_Beschaduwingreductie(H21,F8,H27,H30,H33,F11),1)","v":1},null,{"$f":"IFERROR(o_Beschaduwingreductie(J21,J8,J27,J30,J33,J11),1)","v":1},null,{"$f":"IFERROR(o_Beschaduwingreductie(L21,J8,L27,L30,L33,J11),1)","v":1},null,{"$f":"IFERROR(o_Beschaduwingreductie(N21,N8,N27,N30,N33,N11),1)","v":1},null,{"$f":"IFERROR(o_Beschaduwingreductie(P21,N8,P27,P30,P33,N11),1)","v":1},null,{"$f":"o_Beschaduwingreductie(R21,R8,R27,R30,R33,R11)","v":1},null,{"$f":"o_Beschaduwingreductie(T21,R8,T27,T30,T33,R11)","v":1}]
[]
["Type zonwering","Geen zonwering",null,"Geen zonwering",null,"Geen zonwering",null,"Geen zonwering",null,"Screen (wit)",null,"Screen (wit)",null,"Geen zonwering",null,"Geen zonwering",null,"Geen zonwering",null,"Geen zonwering"]
["De reductiefactor voor zonwering Fc;wi;k",{"$f":"o_Zonweringreductie(B37,B8)","v":1},null,{"$f":"o_Zonweringreductie(D37,B8)","v":1},null,{"$f":"o_Zonweringreductie(F37,F8)","v":1},null,{"$f":"o_Zonweringreductie(H37,F8)","v":1},null,{"$f":"o_Zonweringreductie(J37,J8)","v":0.25},null,{"$f":"o_Zonweringreductie(L37,J8)","v":0.25},null,{"$f":"o_Zonweringreductie(N37,N8)","v":1},null,{"$f":"o_Zonweringreductie(P37,N8)","v":1},null,{"$f":"o_Zonweringreductie(R37,R8)","v":1},null,{"$f":"o_Zonweringreductie(T37,R8)","v":1}]
["Totaal opvallende zonnestraling van het raam Isol;wi;k;juli",{"$f":"IF(B10=\"Nee\",0,o_Isol_Bij_Tijdstip($B$52,B8,B11))","v":0},"W/m²",{"$f":"IF(B10=\"Nee\",0,o_Isol_Bij_Tijdstip($B$52,B8,B11))","v":0},"W/m²",{"$f":"IF(F10=\"Nee\",0,o_Isol_Bij_Tijdstip($B$52,F8,F11))","v":0},"W/m²",{"$f":"IF(F10=\"Nee\",0,o_Isol_Bij_Tijdstip($B$52,F8,F11))","v":0},"W/m²",{"$f":"IF(J10=\"Nee\",0,o_Isol_Bij_Tijdstip($B$52,J8,J11))","v":740.05836254715712},"W/m²",{"$f":"IF(J10=\"Nee\",0,o_Isol_Bij_Tijdstip($B$52,J8,J11))","v":740.05836254715712},"W/m²",{"$f":"IF(N10=\"Nee\",0,o_Isol_Bij_Tijdstip($B$52,N8,N11))","v":0},"W/m²",{"$f":"IF(N10=\"Nee\",0,o_Isol_Bij_Tijdstip($B$52,N8,N11))","v":0},"W/m²",{"$f":"IF(R10=\"Nee\",0,o_Isol_Bij_Tijdstip($B$52,R8,R11))","v":875.08681990532841},"W/m²",{"$f":"IF(R10=\"Nee\",0,o_Isol_Bij_Tijdstip($B$52,R8,R11))","v":875.08681990532841},"W/m²"]
[]
["Tijdstip maximale koellastbijdrage tmax;zi",{"$f":"VALUE(o_Tijdstip_Isol_Max_Orientatie(B8,B11))","v":"15:00:00"},null,null,null,{"$f":"VALUE(o_Tijdstip_Isol_Max_Orientatie(F8,F11))","v":"09:00:00"},null,null,null,{"$f":"VALUE(o_Tijdstip_Isol_Max_Orientatie(J8,J11))","v":"14:00:00"},null,null,null,{"$f":"VALUE(o_Tijdstip_Isol_Max_Orientatie(N8,N11))","v":"18:00:00"},null,null,null,{"$f":"o_Tijdstip_Isol_Max_Orientatie(R8,R11)","v":"16:00:00"}]
["Buitenluchttemperatuur op tijdstip max koellast Θe",{"$f":"o_maxTemp(VALUE(B41))","v":29.8},null,null,"°C",{"$f":"o_maxTemp(VALUE(F41))","v":24.7},null,null,"°C",{"$f":"o_maxTemp(VALUE(J41))","v":29.9},null,null,"°C",{"$f":"o_maxTemp(VALUE(N41))","v":30.1},null,null,"°C",{"$f":"o_maxTemp(VALUE(R41))","v":30.4}]
[]
["Glasopppervlak",{"$f":"IF(B10=\"Ja\",B18+D18,0)","v":0},"m²",null,null,{"$f":"IF(F10=\"Ja\",F18+H18,0)","v":0},"m²",null,null,{"$f":"IF(J10=\"Ja\",J18+L18,0)","v":3.8},"m²",null,null,{"$f":"IF(N10=\"Ja\",N18+P18,0)","v":0},"m²",null,null,{"$f":"IF(R10=\"Ja\",R18+T18,0)","v":0},"m²"]
["Uitwendigescheidingsconstructie niet op Noord?",{"$f":"IF(B10=\"Ja\",IF(B8=\"Noord\",FALSE,TRUE),FALSE)","v":false},null,null,null,{"$f":"IF(F10=\"Ja\",IF(F8=\"Noord\",FALSE,TRUE),FALSE)","v":false},null,null,null,{"$f":"IF(J10=\"Ja\",IF(J8=\"Noord\",FALSE,TRUE),FALSE)","v":true},null,null,null,{"$f":"IF(N10=\"Ja\",IF(N8=\"Noord\",FALSE,TRUE),FALSE)","v":false},null,null,null,{"$f":"IF(R10=\"Ja\",IF(R8=\"Noord\",FALSE,TRUE),FALSE)","v":true}]
["De enige uitwendigescheidingscontructie?",{"$f":"IF(AND(B45=TRUE,COUNTIF($B$45:$R$45,TRUE)=1),TRUE,FALSE)","v":false},null,null,null,{"$f":"IF(AND(F45=TRUE,COUNTIF($B$45:$R$45,TRUE)=1),TRUE,FALSE)","v":false},null,null,null,{"$f":"IF(AND(J45=TRUE,COUNTIF($B$45:$R$45,TRUE)=1),TRUE,FALSE)","v":false},null,null,null,{"$f":"IF(AND(N45=TRUE,COUNTIF($B$45:$R$45,TRUE)=1),TRUE,FALSE)","v":false},null,null,null,{"$f":"IF(AND(R45=TRUE,COUNTIF($B$45:$R$45,TRUE)=1),TRUE,FALSE)","v":false}]
["Totaal glasoppervlak",{"$f":"IF(B8<>\"Noord\",B44,0)","v":0},"m²",null,null,{"$f":"IF(F8<>\"Noord\",F44,0)","v":0},"m²",null,null,{"$f":"IF(J8<>\"Noord\",J44,0)","v":3.8},"m²",null,null,{"$f":"IF(N8<>\"Noord\",N44,0)","v":0},"m²",null,null,{"$f":"R44","v":0},"m²"]
["Grootste glasoppervlak ",{"$f":"IF(AND(B45,B47=MAX($B$47:$R$47)),TRUE,FALSE)","v":false},null,null,null,{"$f":"IF(AND(F45,F47=MAX($B$47:$R$47)),TRUE,FALSE)","v":false},null,null,null,{"$f":"IF(AND(J45,J47=MAX($B$47:$R$47)),TRUE,FALSE)","v":true},null,null,null,{"$f":"IF(AND(N45,N47=MAX($B$47:$R$47)),TRUE,FALSE)","v":false},null,null,null,{"$f":"IF(AND(R45,R47=MAX($B$47:$R$47)),TRUE,FALSE)","v":false}]
["Dakvlak maatgevend?",{"$f":"IF(AND(B11<90,B15>3*(B18+D18),Invoerblad!$B$25<65),TRUE,FALSE)","v":false},null,null,null,{"$f":"IF(AND(F11<90,F15>3*(F18+H18),Invoerblad!$B$25<65),TRUE,FALSE)","v":false},null,null,null,{"$f":"IF(AND(J11<90,J15>3*(J18+L18),Invoerblad!$B$25<65),TRUE,FALSE)","v":false},null,null,null,{"$f":"IF(AND(N11<90,N15>3*(N18+P18),Invoerblad!$B$25<65),TRUE,FALSE)","v":false},null,null,null,{"$f":"IF(AND(R11<90,R15>3*(R18+T18),Invoerblad!$B$25<65),TRUE,FALSE)","v":true}]
["is er een maatgevend dakoppervlak",{"$f":"IF(COUNTIF($B$49:$R$49,TRUE)>0,TRUE,FALSE)","v":true},null,null,null,{"$f":"IF(COUNTIF($B$49:$R$49,TRUE)>0,TRUE,FALSE)","v":true},null,null,null,{"$f":"IF(COUNTIF($B$49:$R$49,TRUE)>0,TRUE,FALSE)","v":true},null,null,null,{"$f":"IF(COUNTIF($B$49:$R$49,TRUE)>0,TRUE,FALSE)","v":true},null,null,null,{"$f":"IF(COUNTIF($B$49:$R$49,TRUE)>0,TRUE,FALSE)","v":true}]
["Maatgevende tijdstip",{"$f":"IF(OR(B46,AND(B45,B50,B49),AND(B45,B48,NOT(B50))),B41)","v":false},null,null,null,{"$f":"IF(OR(F46,AND(F45,F50,F49),AND(F45,F48,NOT(F50))),F41)","v":false},null,null,null,{"$f":"IF(OR(J46,AND(J45,J50,J49),AND(J45,J48,NOT(J50))),J41)","v":false},null,null,null,{"$f":"IF(OR(N46,AND(N45,N50,N49),AND(N45,N48,NOT(N50))),N41)","v":false},null,null,null,{"$f":"IF(OR(R46,AND(R45,R50,R49),AND(R45,R48,NOT(R50))),R41)","v":"16:00:00"}]
["Maatgevende tijdstip tmax;zi",{"$f":"IFERROR(B84,\"geen glas ingevoerd\")","v":"14:00:00"}]
["Buitenluchttemperatuur op tijdstip max koellast Θe",{"$f":"o_maxTemp(VALUE(B52))","v":29.9},"°C"]
[]
["Koellastbijdrage transmissie transparante delen Ptr;gl;vr;zi",{"$f":"IF(B10=\"Nee\",0,B16*Invoerblad!$B$16)","v":0},null,null,"W",{"$f":"IF(F10=\"Nee\",0,F16*Invoerblad!$B$16)","v":0},null,null,"W",{"$f":"IF(J10=\"Nee\",0,J16*Invoerblad!$B$16)","v":26.553999999999998},null,null,"W",{"$f":"IF(N10=\"Nee\",0,N16*Invoerblad!$B$16)","v":0},null,null,"W",{"$f":"IF(R10=\"Nee\",0,R16*Invoerblad!$B$16)","v":42.460000000000008},null,null,"W"]
["Koellastbijdrage zoninstraling transparante delen Psol;vr;zi",{"$f":"(0.75*B18*FLOOR(B20,0.05)*0.9*B35*B38*B39)+(0.75*D18*FLOOR(D20,0.05)*0.9*D35*D38*D39)","v":0},null,null,"W",{"$f":"(0.75*F18*FLOOR(F20,0.05)*0.9*F35*F38*F39)+(0.75*H18*FLOOR(H20,0.05)*0.9*H35*H38*H39)","v":0},null,null,"W",{"$f":"(0.75*J18*FLOOR(J20,0.05)*0.9*J35*J38*J39)+(0.75*L18*FLOOR(L20,0.05)*0.9*L35*L38*L39)","v":284.7374549900187},null,null,"W",{"$f":"(0.75*N18*FLOOR(N20,0.05)*0.9*N35*N38*N39)+(0.75*P18*FLOOR(P20,0.05)*0.9*P35*P38*P39)","v":0},null,null,"W",{"$f":"(0.75*R18*FLOOR(R20,0.05)*0.9*R35*R38*R39)+(0.75*T18*FLOOR(T20,0.05)*0.9*T35*T38*T39)","v":0},null,null,"W"]
["Koellastbijdrage transmissie transparante delen Ptr;gl;vr;zi",{"$f":"IF(B10=\"Nee\",0,IFERROR(B18*B19*($B$53-24),0)+IFERROR(D18*D19*($B$53-24),0))","v":0},null,null,"W",{"$f":"IF(F10=\"Nee\",0,IFERROR(F18*F19*($B$53-24),0)+IFERROR(H18*H19*($B$53-24),0))","v":0},null,null,"W",{"$f":"IF(J10=\"Nee\",0,IFERROR(J18*J19*($B$53-24),0)+IFERROR(L18*L19*($B$53-24),0))","v":33.629999999999988},null,null,"W",{"$f":"IF(N10=\"Nee\",0,IFERROR(N18*N19*($B$53-24),0)+IFERROR(P18*P19*($B$53-24),0))","v":0},null,null,"W",{"$f":"IF(R10=\"Nee\",0,IFERROR(R18*R19*($B$53-24),0)+IFERROR(T18*T19*($B$53-24),0))","v":0},null,null,"W"]
["Totaal koellastbijdrage per gevel",{"$f":"SUM(B55:D57)","v":0},null,null,"W",{"$f":"SUM(F55:H57)","v":0},null,null,"W",{"$f":"SUM(J55:L57)","v":344.92145499001867},null,null,"W",{"$f":"SUM(N55:P57)","v":0},null,null,"W",{"$f":"SUM(R55:R57)","v":42.460000000000008},null,null,"W"]
[]
["Koellast door interne warmtelast Pint;calc;woon/overig;zi",{"$f":"IF(B5=0,0,IF(B4=\"Woonvertrek\",2*Invoerblad!$B$40*B5,Invoerblad!$B$40*B5))","v":59.137898936170224},null,null,"W"]
["Koellast door buitenluchttoetreding Pv;calc;vr;zi",{"$f":"IFERROR(MAX((SUM(Invoerblad!$B$28:$B$30)/3600*1.205*1005*(B53-24))/SUM(Invoerblad!$B$47:$T$47)*B5,0),0)","v":81.136769960154496},{"$f":"IFERROR(MAX(SUM(C57:C59)/3600*1.205*1005*(C60-24),0),0)","v":0},{"$f":"IFERROR(MAX(SUM(D57:D59)/3600*1.205*1005*(D60-24),0),0)","v":0},"W"]
[]
["Totaal koellastbijdrage",{"$f":"IFERROR(SUM(B58:T58)+B60+B61,0)","v":527.65612388634349},null,null,"W"]
["Koelbehoefte verblijfsruimte",{"$f":"IFERROR(B63/B5,0)","v":29.152272037919527},null,null,"W/m²"]
[]
[]
["Onderstaande tabellen worden verborgen in de uiteindelijke versie. De tabellen dienen om vast te stellen welk tijdstip tot de hoogste zonbelasting leidt"]
[]
["Isol max voor de orientatie",{"$f":"o_Isol_Max_Orientatie(B8,B11)","v":143.73988086183414},"W/m²",null,null,{"$f":"o_Isol_Max_Orientatie(F8,F11)","v":845.32772366250799},"W/m²",null,null,{"$f":"o_Isol_Max_Orientatie(J8,J11)","v":740.05836254715712},"W/m²",null,null,{"$f":"o_Isol_Max_Orientatie(N8,N11)","v":741.75809294382429},"W/m²",null,null,{"$f":"o_Isol_Max_Orientatie(R8,R11)","v":914.16092603772574},"W/m²"]
["Tijdstip bij Isol max bij orientatie",{"$f":"VALUE(o_Tijdstip_Isol_Max_Orientatie(B8,B11))","v":"15:00:00"},null,null,null,{"$f":"VALUE(o_Tijdstip_Isol_Max_Orientatie(F8,F11))","v":"09:00:00"},null,null,null,{"$f":"VALUE(o_Tijdstip_Isol_Max_Orientatie(J8,J11))","v":"14:00:00"},null,null,null,{"$f":"VALUE(o_Tijdstip_Isol_Max_Orientatie(N8,N11))","v":"18:00:00"},null,null,null,{"$f":"VALUE(o_Tijdstip_Isol_Max_Orientatie(R8,R11))","v":"16:00:00"}]
[]
["Koellastbijdrage zoninstraling transparante delen Psol;vr;zi"]
["09:00:00",{"$f":"(0.75*B$18*FLOOR(B$20,0.05)*0.9*B$35*B$38*o_Isol_Bij_Tijdstip($A73,B$8,B$11))+(0.75*D$18*FLOOR(D$20,0.05)*0.9*D$35*D$38*o_Isol_Bij_Tijdstip($A73,B$8,B$11))","v":0},"W",null,null,{"$f":"(0.75*F$18*FLOOR(F$20,0.05)*0.9*F$35*F$38*o_Isol_Bij_Tijdstip($A73,F$8,F$11))+(0.75*H$18*FLOOR(H$20,0.05)*0.9*H$35*H$38*o_Isol_Bij_Tijdstip($A73,F$8,F$11))","v":0},"W",null,null,{"$f":"(0.75*J$18*FLOOR(J$20,0.05)*0.9*J$35*J$38*o_Isol_Bij_Tijdstip($A73,J$8,J$11))+(0.75*L$18*FLOOR(L$20,0.05)*0.9*L$35*L$38*o_Isol_Bij_Tijdstip($A73,J$8,J$11))","v":86.696168900742165},"W",null,null,{"$f":"(0.75*N$18*FLOOR(N$20,0.05)*0.9*N$35*N$38*o_Isol_Bij_Tijdstip($A73,N$8,N$11))+(0.75*P$18*FLOOR(P$20,0.05)*0.9*P$35*P$38*o_Isol_Bij_Tijdstip($A73,N$8,N$11))","v":0},"W",null,null,{"$f":"(0.75*R$18*FLOOR(R$20,0.05)*0.9*R$35*R$38*o_Isol_Bij_Tijdstip($A73,R$8,R$11))+(0.75*T$18*FLOOR(T$20,0.05)*0.9*T$35*T$38*o_Isol_Bij_Tijdstip($A73,R$8,R$11))","v":0},"W",{"$f":"B73+F73+J73+N73+R73","v":86.696168900742165},"W"]
["10:00:00",{"$f":"(0.75*B$18*FLOOR(B$20,0.05)*0.9*B$35*B$38*o_Isol_Bij_Tijdstip($A74,B$8,B$11))+(0.75*D$18*FLOOR(D$20,0.05)*0.9*D$35*D$38*o_Isol_Bij_Tijdstip($A74,B$8,B$11))","v":0},"W",null,null,{"$f":"(0.75*F$18*FLOOR(F$20,0.05)*0.9*F$35*F$38*o_Isol_Bij_Tijdstip($A74,F$8,F$11))+(0.75*H$18*FLOOR(H$20,0.05)*0.9*H$35*H$38*o_Isol_Bij_Tijdstip($A74,F$8,F$11))","v":0},"W",null,null,{"$f":"(0.75*J$18*FLOOR(J$20,0.05)*0.9*J$35*J$38*o_Isol_Bij_Tijdstip($A74,J$8,J$11))+(0.75*L$18*FLOOR(L$20,0.05)*0.9*L$35*L$38*o_Isol_Bij_Tijdstip($A74,J$8,J$11))","v":157.86462427858359},"W",null,null,{"$f":"(0.75*N$18*FLOOR(N$20,0.05)*0.9*N$35*N$38*o_Isol_Bij_Tijdstip($A74,N$8,N$11))+(0.75*P$18*FLOOR(P$20,0.05)*0.9*P$35*P$38*o_Isol_Bij_Tijdstip($A74,N$8,N$11))","v":0},"W",null,null,{"$f":"(0.75*R$18*FLOOR(R$20,0.05)*0.9*R$35*R$38*o_Isol_Bij_Tijdstip($A74,R$8,R$11))+(0.75*T$18*FLOOR(T$20,0.05)*0.9*T$35*T$38*o_Isol_Bij_Tijdstip($A74,R$8,R$11))","v":0},"W",157.86462427858359,"W"]
["11:00:00",{"$f":"(0.75*B$18*FLOOR(B$20,0.05)*0.9*B$35*B$38*o_Isol_Bij_Tijdstip($A75,B$8,B$11))+(0.75*D$18*FLOOR(D$20,0.05)*0.9*D$35*D$38*o_Isol_Bij_Tijdstip($A75,B$8,B$11))","v":0},"W",null,null,{"$f":"(0.75*F$18*FLOOR(F$20,0.05)*0.9*F$35*F$38*o_Isol_Bij_Tijdstip($A75,F$8,F$11))+(0.75*H$18*FLOOR(H$20,0.05)*0.9*H$35*H$38*o_Isol_Bij_Tijdstip($A75,F$8,F$11))","v":0},"W",null,null,{"$f":"(0.75*J$18*FLOOR(J$20,0.05)*0.9*J$35*J$38*o_Isol_Bij_Tijdstip($A75,J$8,J$11))+(0.75*L$18*FLOOR(L$20,0.05)*0.9*L$35*L$38*o_Isol_Bij_Tijdstip($A75,J$8,J$11))","v":204.01165067912132},"W",null,null,{"$f":"(0.75*N$18*FLOOR(N$20,0.05)*0.9*N$35*N$38*o_Isol_Bij_Tijdstip($A75,N$8,N$11))+(0.75*P$18*FLOOR(P$20,0.05)*0.9*P$35*P$38*o_Isol_Bij_Tijdstip($A75,N$8,N$11))","v":0},"W",null,null,{"$f":"(0.75*R$18*FLOOR(R$20,0.05)*0.9*R$35*R$38*o_Isol_Bij_Tijdstip($A75,R$8,R$11))+(0.75*T$18*FLOOR(T$20,0.05)*0.9*T$35*T$38*o_Isol_Bij_Tijdstip($A75,R$8,R$11))","v":0},"W",204.01165067912132,"W"]
["12:00:00",{"$f":"(0.75*B$18*FLOOR(B$20,0.05)*0.9*B$35*B$38*o_Isol_Bij_Tijdstip($A76,B$8,B$11))+(0.75*D$18*FLOOR(D$20,0.05)*0.9*D$35*D$38*o_Isol_Bij_Tijdstip($A76,B$8,B$11))","v":0},"W",null,null,{"$f":"(0.75*F$18*FLOOR(F$20,0.05)*0.9*F$35*F$38*o_Isol_Bij_Tijdstip($A76,F$8,F$11))+(0.75*H$18*FLOOR(H$20,0.05)*0.9*H$35*H$38*o_Isol_Bij_Tijdstip($A76,F$8,F$11))","v":0},"W",null,null,{"$f":"(0.75*J$18*FLOOR(J$20,0.05)*0.9*J$35*J$38*o_Isol_Bij_Tijdstip($A76,J$8,J$11))+(0.75*L$18*FLOOR(L$20,0.05)*0.9*L$35*L$38*o_Isol_Bij_Tijdstip($A76,J$8,J$11))","v":239.11245012594816},"W",null,null,{"$f":"(0.75*N$18*FLOOR(N$20,0.05)*0.9*N$35*N$38*o_Isol_Bij_Tijdstip($A76,N$8,N$11))+(0.75*P$18*FLOOR(P$20,0.05)*0.9*P$35*P$38*o_Isol_Bij_Tijdstip($A76,N$8,N$11))","v":0},"W",null,null,{"$f":"(0.75*R$18*FLOOR(R$20,0.05)*0.9*R$35*R$38*o_Isol_Bij_Tijdstip($A76,R$8,R$11))+(0.75*T$18*FLOOR(T$20,0.05)*0.9*T$35*T$38*o_Isol_Bij_Tijdstip($A76,R$8,R$11))","v":0},"W",239.11245012594816,"W"]
["13:00:00",{"$f":"(0.75*B$18*FLOOR(B$20,0.05)*0.9*B$35*B$38*o_Isol_Bij_Tijdstip($A77,B$8,B$11))+(0.75*D$18*FLOOR(D$20,0.05)*0.9*D$35*D$38*o_Isol_Bij_Tijdstip($A77,B$8,B$11))","v":0},"W",null,null,{"$f":"(0.75*F$18*FLOOR(F$20,0.05)*0.9*F$35*F$38*o_Isol_Bij_Tijdstip($A77,F$8,F$11))+(0.75*H$18*FLOOR(H$20,0.05)*0.9*H$35*H$38*o_Isol_Bij_Tijdstip($A77,F$8,F$11))","v":0},"W",null,null,{"$f":"(0.75*J$18*FLOOR(J$20,0.05)*0.9*J$35*J$38*o_Isol_Bij_Tijdstip($A77,J$8,J$11))+(0.75*L$18*FLOOR(L$20,0.05)*0.9*L$35*L$38*o_Isol_Bij_Tijdstip($A77,J$8,J$11))","v":251.36461924021367},"W",null,null,{"$f":"(0.75*N$18*FLOOR(N$20,0.05)*0.9*N$35*N$38*o_Isol_Bij_Tijdstip($A77,N$8,N$11))+(0.75*P$18*FLOOR(P$20,0.05)*0.9*P$35*P$38*o_Isol_Bij_Tijdstip($A77,N$8,N$11))","v":0},"W",null,null,{"$f":"(0.75*R$18*FLOOR(R$20,0.05)*0.9*R$35*R$38*o_Isol_Bij_Tijdstip($A77,R$8,R$11))+(0.75*T$18*FLOOR(T$20,0.05)*0.9*T$35*T$38*o_Isol_Bij_Tijdstip($A77,R$8,R$11))","v":0},"W",251.36461924021367,"W"]
["14:00:00",{"$f":"(0.75*B$18*FLOOR(B$20,0.05)*0.9*B$35*B$38*o_Isol_Bij_Tijdstip($A78,B$8,B$11))+(0.75*D$18*FLOOR(D$20,0.05)*0.9*D$35*D$38*o_Isol_Bij_Tijdstip($A78,B$8,B$11))","v":0},"W",null,null,{"$f":"(0.75*F$18*FLOOR(F$20,0.05)*0.9*F$35*F$38*o_Isol_Bij_Tijdstip($A78,F$8,F$11))+(0.75*H$18*FLOOR(H$20,0.05)*0.9*H$35*H$38*o_Isol_Bij_Tijdstip($A78,F$8,F$11))","v":0},"W",null,null,{"$f":"(0.75*J$18*FLOOR(J$20,0.05)*0.9*J$35*J$38*o_Isol_Bij_Tijdstip($A78,J$8,J$11))+(0.75*L$18*FLOOR(L$20,0.05)*0.9*L$35*L$38*o_Isol_Bij_Tijdstip($A78,J$8,J$11))","v":284.7374549900187},"W",null,null,{"$f":"(0.75*N$18*FLOOR(N$20,0.05)*0.9*N$35*N$38*o_Isol_Bij_Tijdstip($A78,N$8,N$11))+(0.75*P$18*FLOOR(P$20,0.05)*0.9*P$35*P$38*o_Isol_Bij_Tijdstip($A78,N$8,N$11))","v":0},"W",null,null,{"$f":"(0.75*R$18*FLOOR(R$20,0.05)*0.9*R$35*R$38*o_Isol_Bij_Tijdstip($A78,R$8,R$11))+(0.75*T$18*FLOOR(T$20,0.05)*0.9*T$35*T$38*o_Isol_Bij_Tijdstip($A78,R$8,R$11))","v":0},"W",284.7374549900187,"W"]
["15:00:00",{"$f":"(0.75*B$18*FLOOR(B$20,0.05)*0.9*B$35*B$38*o_Isol_Bij_Tijdstip($A79,B$8,B$11))+(0.75*D$18*FLOOR(D$20,0.05)*0.9*D$35*D$38*o_Isol_Bij_Tijdstip($A79,B$8,B$11))","v":0},"W",null,null,{"$f":"(0.75*F$18*FLOOR(F$20,0.05)*0.9*F$35*F$38*o_Isol_Bij_Tijdstip($A79,F$8,F$11))+(0.75*H$18*FLOOR(H$20,0.05)*0.9*H$35*H$38*o_Isol_Bij_Tijdstip($A79,F$8,F$11))","v":0},"W",null,null,{"$f":"(0.75*J$18*FLOOR(J$20,0.05)*0.9*J$35*J$38*o_Isol_Bij_Tijdstip($A79,J$8,J$11))+(0.75*L$18*FLOOR(L$20,0.05)*0.9*L$35*L$38*o_Isol_Bij_Tijdstip($A79,J$8,J$11))","v":229.41329071514303},"W",null,null,{"$f":"(0.75*N$18*FLOOR(N$20,0.05)*0.9*N$35*N$38*o_Isol_Bij_Tijdstip($A79,N$8,N$11))+(0.75*P$18*FLOOR(P$20,0.05)*0.9*P$35*P$38*o_Isol_Bij_Tijdstip($A79,N$8,N$11))","v":0},"W",null,null,{"$f":"(0.75*R$18*FLOOR(R$20,0.05)*0.9*R$35*R$38*o_Isol_Bij_Tijdstip($A79,R$8,R$11))+(0.75*T$18*FLOOR(T$20,0.05)*0.9*T$35*T$38*o_Isol_Bij_Tijdstip($A79,R$8,R$11))","v":0},"W",229.41329071514303,"W"]
["16:00:00",{"$f":"(0.75*B$18*FLOOR(B$20,0.05)*0.9*B$35*B$38*o_Isol_Bij_Tijdstip($A80,B$8,B$11))+(0.75*D$18*FLOOR(D$20,0.05)*0.9*D$35*D$38*o_Isol_Bij_Tijdstip($A80,B$8,B$11))","v":0},"W",null,null,{"$f":"(0.75*F$18*FLOOR(F$20,0.05)*0.9*F$35*F$38*o_Isol_Bij_Tijdstip($A80,F$8,F$11))+(0.75*H$18*FLOOR(H$20,0.05)*0.9*H$35*H$38*o_Isol_Bij_Tijdstip($A80,F$8,F$11))","v":0},"W",null,null,{"$f":"(0.75*J$18*FLOOR(J$20,0.05)*0.9*J$35*J$38*o_Isol_Bij_Tijdstip($A80,J$8,J$11))+(0.75*L$18*FLOOR(L$20,0.05)*0.9*L$35*L$38*o_Isol_Bij_Tijdstip($A80,J$8,J$11))","v":145.81257214255874},"W",null,null,{"$f":"(0.75*N$18*FLOOR(N$20,0.05)*0.9*N$35*N$38*o_Isol_Bij_Tijdstip($A80,N$8,N$11))+(0.75*P$18*FLOOR(P$20,0.05)*0.9*P$35*P$38*o_Isol_Bij_Tijdstip($A80,N$8,N$11))","v":0},"W",null,null,{"$f":"(0.75*R$18*FLOOR(R$20,0.05)*0.9*R$35*R$38*o_Isol_Bij_Tijdstip($A80,R$8,R$11))+(0.75*T$18*FLOOR(T$20,0.05)*0.9*T$35*T$38*o_Isol_Bij_Tijdstip($A80,R$8,R$11))","v":0},"W",145.81257214255874,"W"]
["17:00:00",{"$f":"(0.75*B$18*FLOOR(B$20,0.05)*0.9*B$35*B$38*o_Isol_Bij_Tijdstip($A81,B$8,B$11))+(0.75*D$18*FLOOR(D$20,0.05)*0.9*D$35*D$38*o_Isol_Bij_Tijdstip($A81,B$8,B$11))","v":0},"W",null,null,{"$f":"(0.75*F$18*FLOOR(F$20,0.05)*0.9*F$35*F$38*o_Isol_Bij_Tijdstip($A81,F$8,F$11))+(0.75*H$18*FLOOR(H$20,0.05)*0.9*H$35*H$38*o_Isol_Bij_Tijdstip($A81,F$8,F$11))","v":0},"W",null,null,{"$f":"(0.75*J$18*FLOOR(J$20,0.05)*0.9*J$35*J$38*o_Isol_Bij_Tijdstip($A81,J$8,J$11))+(0.75*L$18*FLOOR(L$20,0.05)*0.9*L$35*L$38*o_Isol_Bij_Tijdstip($A81,J$8,J$11))","v":88.278004399991602},"W",null,null,{"$f":"(0.75*N$18*FLOOR(N$20,0.05)*0.9*N$35*N$38*o_Isol_Bij_Tijdstip($A81,N$8,N$11))+(0.75*P$18*FLOOR(P$20,0.05)*0.9*P$35*P$38*o_Isol_Bij_Tijdstip($A81,N$8,N$11))","v":0},"W",null,null,{"$f":"(0.75*R$18*FLOOR(R$20,0.05)*0.9*R$35*R$38*o_Isol_Bij_Tijdstip($A81,R$8,R$11))+(0.75*T$18*FLOOR(T$20,0.05)*0.9*T$35*T$38*o_Isol_Bij_Tijdstip($A81,R$8,R$11))","v":0},"W",88.278004399991602,"W"]
["18:00:00",{"$f":"(0.75*B$18*FLOOR(B$20,0.05)*0.9*B$35*B$38*o_Isol_Bij_Tijdstip($A82,B$8,B$11))+(0.75*D$18*FLOOR(D$20,0.05)*0.9*D$35*D$38*o_Isol_Bij_Tijdstip($A82,B$8,B$11))","v":0},"W",null,null,{"$f":"(0.75*F$18*FLOOR(F$20,0.05)*0.9*F$35*F$38*o_Isol_Bij_Tijdstip($A82,F$8,F$11))+(0.75*H$18*FLOOR(H$20,0.05)*0.9*H$35*H$38*o_Isol_Bij_Tijdstip($A82,F$8,F$11))","v":0},"W",null,null,{"$f":"(0.75*J$18*FLOOR(J$20,0.05)*0.9*J$35*J$38*o_Isol_Bij_Tijdstip($A82,J$8,J$11))+(0.75*L$18*FLOOR(L$20,0.05)*0.9*L$35*L$38*o_Isol_Bij_Tijdstip($A82,J$8,J$11))","v":32.342958337743909},"W",null,null,{"$f":"(0.75*N$18*FLOOR(N$20,0.05)*0.9*N$35*N$38*o_Isol_Bij_Tijdstip($A82,N$8,N$11))+(0.75*P$18*FLOOR(P$20,0.05)*0.9*P$35*P$38*o_Isol_Bij_Tijdstip($A82,N$8,N$11))","v":0},"W",null,null,{"$f":"(0.75*R$18*FLOOR(R$20,0.05)*0.9*R$35*R$38*o_Isol_Bij_Tijdstip($A82,R$8,R$11))+(0.75*T$18*FLOOR(T$20,0.05)*0.9*T$35*T$38*o_Isol_Bij_Tijdstip($A82,R$8,R$11))","v":0},"W",32.342958337743909,"W"]
[]
["Maatgevende tijdstip",{"$f":"IF(MAX(T73:T82)=0,\"Geen glas aanwezig\",_xlfn.XLOOKUP(MAX(T73:T82),T73:T82,A73:A82,\"nvt\"))","v":"14:00:00"}]

{"sheet":"Ruimte 7","index":9,"n_rows":84,"n_cols":21,"rows_kept":84,"cut":false,"hidden":false,"merged":[[66,0,67,20],[0,0,0,20],[6,1,6,3],[6,5,6,7],[6,9,6,11],[6,13,6,15],[6,17,6,20],[41,1,41,3],[41,5,41,7],[41,9,41,11],[41,13,41,15],[41,17,41,19],[40,1,40,3],[40,5,40,7],[40,9,40,11],[40,13,40,15],[40,17,40,19],[55,1,55,3],[55,5,55,7],[55,9,55,11],[55,13,55,15],[55,17,55,19],[54,1,54,3],[54,5,54,7],[54,9,54,11],[54,13,54,15],[54,17,54,19],[56,5,56,7],[56,9,56,11],[56,13,56,15],[56,17,56,19],[57,1,57,3],[57,5,57,7],[57,9,57,11],[57,13,57,15],[57,17,57,19],[59,1,59,3],[60,1,60,3],[62,1,62,3],[63,1,63,3],[56,1,56,3]]}
["RUIMTE 7"]
[]
["Ruimtenaam",0]
["Type verblijfsruimte","Andere verblijfsruimte"]
["Vloeroppervlak verblijfsruimte Avr  (gebruiksoppervlak)",0,"m²"]
[]
[null,"Voorzijde woning",null,null,null,"Linker zijde woning",null,null,null,"Achterzijde woning",null,null,null,"Rechter zijde woning",null,null,null,"Platdak"]
["Orientatie gevel / dakvlak (Helling > 15°C)",{"$f":"Invoerblad!$B$17","v":"Noord"},null,null,null,{"$f":"o_Orientatie(F9)","v":"Oost"},null,null,null,{"$f":"o_Orientatie(J9)","v":"Zuid"},null,null,null,{"$f":"o_Orientatie(N9)","v":"West"},null,null,null,"Horizontaal"]
["Orientatiehoek gevel Ƴ",{"$f":"o_OrientatiehOEK(B8)","v":0},null,null,null,{"$f":"IF(B9+90>360,B9+90-360,B9+90)","v":90},null,null,null,{"$f":"IF(F9+90>360,F9+90-360,F9+90)","v":180},null,null,null,{"$f":"IF(J9+90>360,J9+90-360,J9+90)","v":270}]
["Grenst aan buitenlucht ja of nee","Nee",null,null,null,"Nee",null,null,null,"Nee",null,null,null,"Nee",null,null,null,"Nee"]
["Hellingshoek constructie ≥ 15° = hellenddak 90° = gevel",90,"°",null,null,90,"°",null,null,90,"°",null,null,90,"°",null,null,10,"°"]
["Type constructie",{"$f":"o_TypeConstructie(B10,B11)","v":"Woningscheidend"},null,null,null,{"$f":"o_TypeConstructie(F10,F11)","v":"Woningscheidend"},null,null,null,{"$f":"o_TypeConstructie(J10,J11)","v":"Woningscheidend"},null,null,null,{"$f":"o_TypeConstructie(N10,N11)","v":"Woningscheidend"},null,null,null,{"$f":"o_TypeConstructie(R10,R11)","v":"Woningscheidend"}]
["Gevel lengte (binnenwerks)",0,"m",null,null,0,"m",null,null,0,"m",null,null,0,"m",null,null,0,"m"]
["Gevel hoogte / Dak breedte (binnenwerks)",0,"m",null,null,0,"m",null,null,0,"m",null,null,0,"m",null,null,0,"m"]
["Constructie oppervlak (binnenwerks)",{"$f":"B13*B14","v":0},"m²",null,null,{"$f":"F13*F14","v":0},"m²",null,null,{"$f":"J13*J14","v":0},"m²",null,null,{"$f":"N13*N14","v":0},"m²",null,null,{"$f":"R13*R14","v":0},"m²"]
["Gesloten constructie oppervlak",{"$f":"MAX(0,B15-B18-D18)","v":0},"m²",null,null,{"$f":"MAX(0,F15-F18-H18)","v":0},"m²",null,null,{"$f":"MAX(0,J15-J18-L18)","v":0},"m²",null,null,{"$f":"MAX(0,N15-N18-P18)","v":0},"m²",null,null,{"$f":"MAX(0,R15-R18-T18)","v":0},"m²"]
[null,"Glasvlak type 1",null,"Glasvlak type 2",null,"Glasvlak type 1",null,"Glasvlak type 2",null,"Glasvlak type 1",null,"Glasvlak type 2",null,"Glasvlak type 1",null,"Glasvlak type 2",null,"Glasvlak type 1",null,"Glasvlak type 2"]
["Totaal oppervlak van raamtype Aw,k (inclusief kozijn)",0,"m²",0,"m²",0,"m²",0,"m²",0,"m²",0,"m²",0,"m²",0,"m²",0,"m²",0,"m²"]
["Warmtedoorgangscoefficient (U-waarde) van het raam Uw;wi;k",1.6,"W/m².K",1.6,"W/m².K",1.6,"W/m².K",1.6,"W/m².K",1.6,"W/m².K",1.6,"W/m².K",1.6,"W/m².K",1.6,"W/m².K",1.6,"W/m².K",1.6,"W/m².K"]
["Zontoetredingsfactor (g_waarde) van het glas Ggl;n;wi;k;C;juli",1,null,1,null,1,null,1,null,1,null,1,null,1,null,1,null,1,null,1]
["Beschaduwing situatie bij het raamtype","Minimale belemmering",null,"Minimale belemmering",null,"Minimale belemmering",null,"Minimale belemmering",null,"Minimale belemmering",null,"Minimale belemmering",null,"Minimale belemmering",null,"Minimale belemmering",null,"Minimale belemmering",null,"Minimale belemmering"]
[]
[null,"Overstek",null,"Overstek",null,"Overstek",null,"Overstek",null,"Overstek",null,"Overstek",null,"Overstek",null,"Overstek"]
["Hoogte verschil midden raam onderzijde overstek",0,"m",0,"m",0,"m",0,"m",0,"m",0,"m",0,"m",0,"m",0,null,null,"m"]
["Horizontale afstand glas tot eindpunt overstek",0,"m",0,"m",0,"m",0,"m",0,"m",0,"m",0,"m",0,"m",0,null,null,"m"]
["Overstekhoek",{"$f":"IFERROR(180/PI()*ATAN(B24/B25),0)","v":0},"°",{"$f":"IFERROR(180/PI()*ATAN(D24/D25),0)","v":0},"°",{"$f":"IFERROR(180/PI()*ATAN(F24/F25),0)","v":0},"°",{"$f":"IFERROR(180/PI()*ATAN(H24/H25),0)","v":0},"°",{"$f":"IFERROR(180/PI()*ATAN(J24/J25),0)","v":0},"°",{"$f":"IFERROR(180/PI()*ATAN(L24/L25),0)","v":0},"°",{"$f":"IFERROR(180/PI()*ATAN(N24/N25),0)","v":0},"°",{"$f":"IFERROR(180/PI()*ATAN(P24/P25),0)","v":0},"°",null,null,null,"°"]
["Relatieve hoogte van overstek",{"$f":"IFERROR(B24/B25,1)","v":1},null,{"$f":"IFERROR(D24/D25,1)","v":1},null,{"$f":"IFERROR(F24/F25,1)","v":1},null,{"$f":"IFERROR(H24/H25,1)","v":1},null,{"$f":"IFERROR(J24/J25,1)","v":1},null,{"$f":"IFERROR(L24/L25,1)","v":1},null,{"$f":"IFERROR(N24/N25,1)","v":1},null,{"$f":"IFERROR(P24/P25,1)","v":1}]
[]
[null,"Zijbelemmering",null,"Zijbelemmering",null,"Zijbelemmering",null,"Zijbelemmering",null,"Zijbelemmering",null,"Zijbelemmering",null,"Zijbelemmering",null,"Zijbelemmering"]
["Positie zijbelemmering irt zichtveld (naar buitengericht)","Links",null,"Links",null,"Links",null,"Links",null,"Links",null,"Links",null,"Links",null,"Links"]
["Horizontale afstand midden raam verste punt belemmering",0,"m",0,"m",null,"m",null,"m",null,"m",1,"m",null,"m",null,"m",null,null,null,"m"]
["Horizontale breedte glas tot eindpunt belemmering",0,"m",0,"m",null,"m",null,"m",null,"m",null,"m",null,"m",null,"m",null,null,null,"m"]
["Relatieve breedte van de zijbelemmering bb",{"$f":"IFERROR(B31/B32,999)","v":999},null,{"$f":"IFERROR(D31/D32,999)","v":999},null,{"$f":"IFERROR(F31/F32,999)","v":999},null,{"$f":"IFERROR(H31/H32,999)","v":999},null,{"$f":"IFERROR(J31/J32,999)","v":999},null,{"$f":"IFERROR(L31/L32,999)","v":999},null,{"$f":"IFERROR(N31/N32,999)","v":999},null,{"$f":"IFERROR(P31/P32,999)","v":999}]
[]
["De beschaduwingsreductiefactor Fsh;obst;wi;k;juli",{"$f":"IFERROR(o_Beschaduwingreductie(B21,B8,B27,B30,B33,B11),1)","v":1},null,{"$f":"IFERROR(o_Beschaduwingreductie(D21,B8,D27,D30,D33,B11),1)","v":1},null,{"$f":"IFERROR(o_Beschaduwingreductie(F21,F8,F27,F30,F33,F11),1)","v":1},null,{"$f":"IFERROR(o_Beschaduwingreductie(H21,F8,H27,H30,H33,F11),1)","v":1},null,{"$f":"IFERROR(o_Beschaduwingreductie(J21,J8,J27,J30,J33,J11),1)","v":1},null,{"$f":"IFERROR(o_Beschaduwingreductie(L21,J8,L27,L30,L33,J11),1)","v":1},null,{"$f":"IFERROR(o_Beschaduwingreductie(N21,N8,N27,N30,N33,N11),1)","v":1},null,{"$f":"IFERROR(o_Beschaduwingreductie(P21,N8,P27,P30,P33,N11),1)","v":1},null,{"$f":"o_Beschaduwingreductie(R21,R8,R27,R30,R33,R11)","v":1},null,{"$f":"o_Beschaduwingreductie(T21,R8,T27,T30,T33,R11)","v":1}]
[]
["Type zonwering","Geen zonwering",null,"Geen zonwering",null,"Geen zonwering",null,"Geen zonwering",null,"Geen zonwering",null,"Geen zonwering",null,"Geen zonwering",null,"Geen zonwering",null,"Geen zonwering",null,"Geen zonwering"]
["De reductiefactor voor zonwering Fc;wi;k",{"$f":"o_Zonweringreductie(B37,B8)","v":1},null,{"$f":"o_Zonweringreductie(D37,B8)","v":1},null,{"$f":"o_Zonweringreductie(F37,F8)","v":1},null,{"$f":"o_Zonweringreductie(H37,F8)","v":1},null,{"$f":"o_Zonweringreductie(J37,J8)","v":1},null,{"$f":"o_Zonweringreductie(L37,J8)","v":1},null,{"$f":"o_Zonweringreductie(N37,N8)","v":1},null,{"$f":"o_Zonweringreductie(P37,N8)","v":1},null,{"$f":"o_Zonweringreductie(R37,R8)","v":1},null,{"$f":"o_Zonweringreductie(T37,R8)","v":1}]
["Totaal opvallende zonnestraling van het raam Isol;wi;k;juli",{"$f":"IF(B10=\"Nee\",0,o_Isol_Bij_Tijdstip($B$52,B8,B11))","v":0},"W/m²",{"$f":"IF(B10=\"Nee\",0,o_Isol_Bij_Tijdstip($B$52,B8,B11))","v":0},"W/m²",{"$f":"IF(F10=\"Nee\",0,o_Isol_Bij_Tijdstip($B$52,F8,F11))","v":0},"W/m²",{"$f":"IF(F10=\"Nee\",0,o_Isol_Bij_Tijdstip($B$52,F8,F11))","v":0},"W/m²",{"$f":"IF(J10=\"Nee\",0,o_Isol_Bij_Tijdstip($B$52,J8,J11))","v":0},"W/m²",{"$f":"IF(J10=\"Nee\",0,o_Isol_Bij_Tijdstip($B$52,J8,J11))","v":0},"W/m²",{"$f":"IF(N10=\"Nee\",0,o_Isol_Bij_Tijdstip($B$52,N8,N11))","v":0},"W/m²",{"$f":"IF(N10=\"Nee\",0,o_Isol_Bij_Tijdstip($B$52,N8,N11))","v":0},"W/m²",{"$f":"IF(R10=\"Nee\",0,o_Isol_Bij_Tijdstip($B$52,R8,R11))","v":0},"W/m²",{"$f":"IF(R10=\"Nee\",0,o_Isol_Bij_Tijdstip($B$52,R8,R11))","v":0},"W/m²"]
[]
["Tijdstip maximale koellastbijdrage tmax;zi",{"$f":"VALUE(o_Tijdstip_Isol_Max_Orientatie(B8,B11))","v":"15:00:00"},null,null,null,{"$f":"VALUE(o_Tijdstip_Isol_Max_Orientatie(F8,F11))","v":"09:00:00"},null,null,null,{"$f":"VALUE(o_Tijdstip_Isol_Max_Orientatie(J8,J11))","v":"14:00:00"},null,null,null,{"$f":"VALUE(o_Tijdstip_Isol_Max_Orientatie(N8,N11))","v":"18:00:00"},null,null,null,{"$f":"o_Tijdstip_Isol_Max_Orientatie(R8,R11)","v":"16:00:00"}]
["Buitenluchttemperatuur op tijdstip max koellast Θe",{"$f":"o_maxTemp(VALUE(B41))","v":29.8},null,null,"°C",{"$f":"o_maxTemp(VALUE(F41))","v":24.7},null,null,"°C",{"$f":"o_maxTemp(VALUE(J41))","v":29.9},null,null,"°C",{"$f":"o_maxTemp(VALUE(N41))","v":30.1},null,null,"°C",{"$f":"o_maxTemp(VALUE(R41))","v":30.4}]
[]
["Glasopppervlak",{"$f":"IF(B10=\"Ja\",B18+D18,0)","v":0},"m²",null,null,{"$f":"IF(F10=\"Ja\",F18+H18,0)","v":0},"m²",null,null,{"$f":"IF(J10=\"Ja\",J18+L18,0)","v":0},"m²",null,null,{"$f":"IF(N10=\"Ja\",N18+P18,0)","v":0},"m²",null,null,{"$f":"IF(R10=\"Ja\",R18+T18,0)","v":0},"m²"]
["Uitwendigescheidingsconstructie niet op Noord?",{"$f":"IF(B10=\"Ja\",IF(B8=\"Noord\",FALSE,TRUE),FALSE)","v":false},null,null,null,{"$f":"IF(F10=\"Ja\",IF(F8=\"Noord\",FALSE,TRUE),FALSE)","v":false},null,null,null,{"$f":"IF(J10=\"Ja\",IF(J8=\"Noord\",FALSE,TRUE),FALSE)","v":false},null,null,null,{"$f":"IF(N10=\"Ja\",IF(N8=\"Noord\",FALSE,TRUE),FALSE)","v":false},null,null,null,{"$f":"IF(R10=\"Ja\",IF(R8=\"Noord\",FALSE,TRUE),FALSE)","v":false}]
["De enige uitwendigescheidingscontructie?",{"$f":"IF(AND(B45=TRUE,COUNTIF($B$45:$R$45,TRUE)=1),TRUE,FALSE)","v":false},null,null,null,{"$f":"IF(AND(F45=TRUE,COUNTIF($B$45:$R$45,TRUE)=1),TRUE,FALSE)","v":false},null,null,null,{"$f":"IF(AND(J45=TRUE,COUNTIF($B$45:$R$45,TRUE)=1),TRUE,FALSE)","v":false},null,null,null,{"$f":"IF(AND(N45=TRUE,COUNTIF($B$45:$R$45,TRUE)=1),TRUE,FALSE)","v":false},null,null,null,{"$f":"IF(AND(R45=TRUE,COUNTIF($B$45:$R$45,TRUE)=1),TRUE,FALSE)","v":false}]
["Totaal glasoppervlak",{"$f":"IF(B8<>\"Noord\",B44,0)","v":0},"m²",null,null,{"$f":"IF(F8<>\"Noord\",F44,0)","v":0},"m²",null,null,{"$f":"IF(J8<>\"Noord\",J44,0)","v":0},"m²",null,null,{"$f":"IF(N8<>\"Noord\",N44,0)","v":0},"m²",null,null,{"$f":"R44","v":0},"m²"]
["Grootste glasoppervlak ",{"$f":"IF(AND(B45,B47=MAX($B$47:$R$47)),TRUE,FALSE)","v":false},null,null,null,{"$f":"IF(AND(F45,F47=MAX($B$47:$R$47)),TRUE,FALSE)","v":false},null,null,null,{"$f":"IF(AND(J45,J47=MAX($B$47:$R$47)),TRUE,FALSE)","v":false},null,null,null,{"$f":"IF(AND(N45,N47=MAX($B$47:$R$47)),TRUE,FALSE)","v":false},null,null,null,{"$f":"IF(AND(R45,R47=MAX($B$47:$R$47)),TRUE,FALSE)","v":false}]
["Dakvlak maatgevend?",{"$f":"IF(AND(B11<90,B15>3*(B18+D18),Invoerblad!$B$25<65),TRUE,FALSE)","v":false},null,null,null,{"$f":"IF(AND(F11<90,F15>3*(F18+H18),Invoerblad!$B$25<65),TRUE,FALSE)","v":false},null,null,null,{"$f":"IF(AND(J11<90,J15>3*(J18+L18),Invoerblad!$B$25<65),TRUE,FALSE)","v":false},null,null,null,{"$f":"IF(AND(N11<90,N15>3*(N18+P18),Invoerblad!$B$25<65),TRUE,FALSE)","v":false},null,null,null,{"$f":"IF(AND(R11<90,R15>3*(R18+T18),Invoerblad!$B$25<65),TRUE,FALSE)","v":false}]
["is er een maatgevend dakoppervlak",{"$f":"IF(COUNTIF($B$49:$R$49,TRUE)>0,TRUE,FALSE)","v":false},null,null,null,{"$f":"IF(COUNTIF($B$49:$R$49,TRUE)>0,TRUE,FALSE)","v":false},null,null,null,{"$f":"IF(COUNTIF($B$49:$R$49,TRUE)>0,TRUE,FALSE)","v":false},null,null,null,{"$f":"IF(COUNTIF($B$49:$R$49,TRUE)>0,TRUE,FALSE)","v":false},null,null,null,{"$f":"IF(COUNTIF($B$49:$R$49,TRUE)>0,TRUE,FALSE)","v":false}]
["Maatgevende tijdstip",{"$f":"IF(OR(B46,AND(B45,B50,B49),AND(B45,B48,NOT(B50))),B41)","v":false},null,null,null,{"$f":"IF(OR(F46,AND(F45,F50,F49),AND(F45,F48,NOT(F50))),F41)","v":false},null,null,null,{"$f":"IF(OR(J46,AND(J45,J50,J49),AND(J45,J48,NOT(J50))),J41)","v":false},null,null,null,{"$f":"IF(OR(N46,AND(N45,N50,N49),AND(N45,N48,NOT(N50))),N41)","v":false},null,null,null,{"$f":"IF(OR(R46,AND(R45,R50,R49),AND(R45,R48,NOT(R50))),R41)","v":false}]
["Maatgevende tijdstip tmax;zi",{"$f":"IFERROR(B84,\"geen glas ingevoerd\")","v":"Geen glas aanwezig"}]
["Buitenluchttemperatuur op tijdstip max koellast Θe",{"$f":"o_maxTemp(VALUE(B52))","v":""},"°C"]
[]
["Koellastbijdrage transmissie transparante delen Ptr;gl;vr;zi",{"$f":"IF(B10=\"Nee\",0,B16*Invoerblad!$B$16)","v":0},null,null,"W",{"$f":"IF(F10=\"Nee\",0,F16*Invoerblad!$B$16)","v":0},null,null,"W",{"$f":"IF(J10=\"Nee\",0,J16*Invoerblad!$B$16)","v":0},null,null,"W",{"$f":"IF(N10=\"Nee\",0,N16*Invoerblad!$B$16)","v":0},null,null,"W",{"$f":"IF(R10=\"Nee\",0,R16*Invoerblad!$B$16)","v":0},null,null,"W"]
["Koellastbijdrage zoninstraling transparante delen Psol;vr;zi",{"$f":"(0.75*B18*FLOOR(B20,0.05)*0.9*B35*B38*B39)+(0.75*D18*FLOOR(D20,0.05)*0.9*D35*D38*D39)","v":0},null,null,"W",{"$f":"(0.75*F18*FLOOR(F20,0.05)*0.9*F35*F38*F39)+(0.75*H18*FLOOR(H20,0.05)*0.9*H35*H38*H39)","v":0},null,null,"W",{"$f":"(0.75*J18*FLOOR(J20,0.05)*0.9*J35*J38*J39)+(0.75*L18*FLOOR(L20,0.05)*0.9*L35*L38*L39)","v":0},null,null,"W",{"$f":"(0.75*N18*FLOOR(N20,0.05)*0.9*N35*N38*N39)+(0.75*P18*FLOOR(P20,0.05)*0.9*P35*P38*P39)","v":0},null,null,"W",{"$f":"(0.75*R18*FLOOR(R20,0.05)*0.9*R35*R38*R39)+(0.75*T18*FLOOR(T20,0.05)*0.9*T35*T38*T39)","v":0},null,null,"W"]
["Koellastbijdrage transmissie transparante delen Ptr;gl;vr;zi",{"$f":"IF(B10=\"Nee\",0,IFERROR(B18*B19*($B$53-24),0)+IFERROR(D18*D19*($B$53-24),0))","v":0},null,null,"W",{"$f":"IF(F10=\"Nee\",0,IFERROR(F18*F19*($B$53-24),0)+IFERROR(H18*H19*($B$53-24),0))","v":0},null,null,"W",{"$f":"IF(J10=\"Nee\",0,IFERROR(J18*J19*($B$53-24),0)+IFERROR(L18*L19*($B$53-24),0))","v":0},null,null,"W",{"$f":"IF(N10=\"Nee\",0,IFERROR(N18*N19*($B$53-24),0)+IFERROR(P18*P19*($B$53-24),0))","v":0},null,null,"W",{"$f":"IF(R10=\"Nee\",0,IFERROR(R18*R19*($B$53-24),0)+IFERROR(T18*T19*($B$53-24),0))","v":0},null,null,"W"]
["Totaal koellastbijdrage per gevel",{"$f":"SUM(B55:D57)","v":0},null,null,"W",{"$f":"SUM(F55:H57)","v":0},null,null,"W",{"$f":"SUM(J55:L57)","v":0},null,null,"W",{"$f":"SUM(N55:P57)","v":0},null,null,"W",{"$f":"SUM(R55:R57)","v":0},null,null,"W"]
[]
["Koellast door interne warmtelast Pint;calc;woon/overig;zi",{"$f":"IF(B5=0,0,IF(B4=\"Woonvertrek\",2*Invoerblad!$B$40*B5,Invoerblad!$B$40*B5))","v":0},null,null,"W"]
["Koellast door buitenluchttoetreding Pv;calc;vr;zi",{"$f":"IFERROR(MAX((SUM(Invoerblad!$B$28:$B$30)/3600*1.205*1005*(B53-24))/SUM(Invoerblad!$B$47:$T$47)*B5,0),0)","v":0},{"$f":"IFERROR(MAX(SUM(C57:C59)/3600*1.205*1005*(C60-24),0),0)","v":0},{"$f":"IFERROR(MAX(SUM(D57:D59)/3600*1.205*1005*(D60-24),0),0)","v":0},"W"]
[]
["Totaal koellastbijdrage",{"$f":"IFERROR(SUM(B58:T58)+B60+B61,0)","v":0},null,null,"W"]
["Koelbehoefte verblijfsruimte",{"$f":"IFERROR(B63/B5,0)","v":0},null,null,"W/m²"]
[]
[]
["Onderstaande tabellen worden verborgen in de uiteindelijke versie. De tabellen dienen om vast te stellen welk tijdstip tot de hoogste zonbelasting leidt"]
[]
["Isol max voor de orientatie",{"$f":"o_Isol_Max_Orientatie(B8,B11)","v":143.73988086183414},"W/m²",null,null,{"$f":"o_Isol_Max_Orientatie(F8,F11)","v":845.32772366250799},"W/m²",null,null,{"$f":"o_Isol_Max_Orientatie(J8,J11)","v":740.05836254715712},"W/m²",null,null,{"$f":"o_Isol_Max_Orientatie(N8,N11)","v":741.75809294382429},"W/m²",null,null,{"$f":"o_Isol_Max_Orientatie(R8,R11)","v":914.16092603772574},"W/m²"]
["Tijdstip bij Isol max bij orientatie",{"$f":"VALUE(o_Tijdstip_Isol_Max_Orientatie(B8,B11))","v":"15:00:00"},null,null,null,{"$f":"VALUE(o_Tijdstip_Isol_Max_Orientatie(F8,F11))","v":"09:00:00"},null,null,null,{"$f":"VALUE(o_Tijdstip_Isol_Max_Orientatie(J8,J11))","v":"14:00:00"},null,null,null,{"$f":"VALUE(o_Tijdstip_Isol_Max_Orientatie(N8,N11))","v":"18:00:00"},null,null,null,{"$f":"VALUE(o_Tijdstip_Isol_Max_Orientatie(R8,R11))","v":"16:00:00"}]
[]
["Koellastbijdrage zoninstraling transparante delen Psol;vr;zi"]
["09:00:00",{"$f":"(0.75*B$18*FLOOR(B$20,0.05)*0.9*B$35*B$38*o_Isol_Bij_Tijdstip($A73,B$8,B$11))+(0.75*D$18*FLOOR(D$20,0.05)*0.9*D$35*D$38*o_Isol_Bij_Tijdstip($A73,B$8,B$11))","v":0},"W",null,null,{"$f":"(0.75*F$18*FLOOR(F$20,0.05)*0.9*F$35*F$38*o_Isol_Bij_Tijdstip($A73,F$8,F$11))+(0.75*H$18*FLOOR(H$20,0.05)*0.9*H$35*H$38*o_Isol_Bij_Tijdstip($A73,F$8,F$11))","v":0},"W",null,null,{"$f":"(0.75*J$18*FLOOR(J$20,0.05)*0.9*J$35*J$38*o_Isol_Bij_Tijdstip($A73,J$8,J$11))+(0.75*L$18*FLOOR(L$20,0.05)*0.9*L$35*L$38*o_Isol_Bij_Tijdstip($A73,J$8,J$11))","v":0},"W",null,null,{"$f":"(0.75*N$18*FLOOR(N$20,0.05)*0.9*N$35*N$38*o_Isol_Bij_Tijdstip($A73,N$8,N$11))+(0.75*P$18*FLOOR(P$20,0.05)*0.9*P$35*P$38*o_Isol_Bij_Tijdstip($A73,N$8,N$11))","v":0},"W",null,null,{"$f":"(0.75*R$18*FLOOR(R$20,0.05)*0.9*R$35*R$38*o_Isol_Bij_Tijdstip($A73,R$8,R$11))+(0.75*T$18*FLOOR(T$20,0.05)*0.9*T$35*T$38*o_Isol_Bij_Tijdstip($A73,R$8,R$11))","v":0},"W",{"$f":"B73+F73+J73+N73+R73","v":0},"W"]
["10:00:00",{"$f":"(0.75*B$18*FLOOR(B$20,0.05)*0.9*B$35*B$38*o_Isol_Bij_Tijdstip($A74,B$8,B$11))+(0.75*D$18*FLOOR(D$20,0.05)*0.9*D$35*D$38*o_Isol_Bij_Tijdstip($A74,B$8,B$11))","v":0},"W",null,null,{"$f":"(0.75*F$18*FLOOR(F$20,0.05)*0.9*F$35*F$38*o_Isol_Bij_Tijdstip($A74,F$8,F$11))+(0.75*H$18*FLOOR(H$20,0.05)*0.9*H$35*H$38*o_Isol_Bij_Tijdstip($A74,F$8,F$11))","v":0},"W",null,null,{"$f":"(0.75*J$18*FLOOR(J$20,0.05)*0.9*J$35*J$38*o_Isol_Bij_Tijdstip($A74,J$8,J$11))+(0.75*L$18*FLOOR(L$20,0.05)*0.9*L$35*L$38*o_Isol_Bij_Tijdstip($A74,J$8,J$11))","v":0},"W",null,null,{"$f":"(0.75*N$18*FLOOR(N$20,0.05)*0.9*N$35*N$38*o_Isol_Bij_Tijdstip($A74,N$8,N$11))+(0.75*P$18*FLOOR(P$20,0.05)*0.9*P$35*P$38*o_Isol_Bij_Tijdstip($A74,N$8,N$11))","v":0},"W",null,null,{"$f":"(0.75*R$18*FLOOR(R$20,0.05)*0.9*R$35*R$38*o_Isol_Bij_Tijdstip($A74,R$8,R$11))+(0.75*T$18*FLOOR(T$20,0.05)*0.9*T$35*T$38*o_Isol_Bij_Tijdstip($A74,R$8,R$11))","v":0},"W",0,"W"]
["11:00:00",{"$f":"(0.75*B$18*FLOOR(B$20,0.05)*0.9*B$35*B$38*o_Isol_Bij_Tijdstip($A75,B$8,B$11))+(0.75*D$18*FLOOR(D$20,0.05)*0.9*D$35*D$38*o_Isol_Bij_Tijdstip($A75,B$8,B$11))","v":0},"W",null,null,{"$f":"(0.75*F$18*FLOOR(F$20,0.05)*0.9*F$35*F$38*o_Isol_Bij_Tijdstip($A75,F$8,F$11))+(0.75*H$18*FLOOR(H$20,0.05)*0.9*H$35*H$38*o_Isol_Bij_Tijdstip($A75,F$8,F$11))","v":0},"W",null,null,{"$f":"(0.75*J$18*FLOOR(J$20,0.05)*0.9*J$35*J$38*o_Isol_Bij_Tijdstip($A75,J$8,J$11))+(0.75*L$18*FLOOR(L$20,0.05)*0.9*L$35*L$38*o_Isol_Bij_Tijdstip($A75,J$8,J$11))","v":0},"W",null,null,{"$f":"(0.75*N$18*FLOOR(N$20,0.05)*0.9*N$35*N$38*o_Isol_Bij_Tijdstip($A75,N$8,N$11))+(0.75*P$18*FLOOR(P$20,0.05)*0.9*P$35*P$38*o_Isol_Bij_Tijdstip($A75,N$8,N$11))","v":0},"W",null,null,{"$f":"(0.75*R$18*FLOOR(R$20,0.05)*0.9*R$35*R$38*o_Isol_Bij_Tijdstip($A75,R$8,R$11))+(0.75*T$18*FLOOR(T$20,0.05)*0.9*T$35*T$38*o_Isol_Bij_Tijdstip($A75,R$8,R$11))","v":0},"W",0,"W"]
["12:00:00",{"$f":"(0.75*B$18*FLOOR(B$20,0.05)*0.9*B$35*B$38*o_Isol_Bij_Tijdstip($A76,B$8,B$11))+(0.75*D$18*FLOOR(D$20,0.05)*0.9*D$35*D$38*o_Isol_Bij_Tijdstip($A76,B$8,B$11))","v":0},"W",null,null,{"$f":"(0.75*F$18*FLOOR(F$20,0.05)*0.9*F$35*F$38*o_Isol_Bij_Tijdstip($A76,F$8,F$11))+(0.75*H$18*FLOOR(H$20,0.05)*0.9*H$35*H$38*o_Isol_Bij_Tijdstip($A76,F$8,F$11))","v":0},"W",null,null,{"$f":"(0.75*J$18*FLOOR(J$20,0.05)*0.9*J$35*J$38*o_Isol_Bij_Tijdstip($A76,J$8,J$11))+(0.75*L$18*FLOOR(L$20,0.05)*0.9*L$35*L$38*o_Isol_Bij_Tijdstip($A76,J$8,J$11))","v":0},"W",null,null,{"$f":"(0.75*N$18*FLOOR(N$20,0.05)*0.9*N$35*N$38*o_Isol_Bij_Tijdstip($A76,N$8,N$11))+(0.75*P$18*FLOOR(P$20,0.05)*0.9*P$35*P$38*o_Isol_Bij_Tijdstip($A76,N$8,N$11))","v":0},"W",null,null,{"$f":"(0.75*R$18*FLOOR(R$20,0.05)*0.9*R$35*R$38*o_Isol_Bij_Tijdstip($A76,R$8,R$11))+(0.75*T$18*FLOOR(T$20,0.05)*0.9*T$35*T$38*o_Isol_Bij_Tijdstip($A76,R$8,R$11))","v":0},"W",0,"W"]
["13:00:00",{"$f":"(0.75*B$18*FLOOR(B$20,0.05)*0.9*B$35*B$38*o_Isol_Bij_Tijdstip($A77,B$8,B$11))+(0.75*D$18*FLOOR(D$20,0.05)*0.9*D$35*D$38*o_Isol_Bij_Tijdstip($A77,B$8,B$11))","v":0},"W",null,null,{"$f":"(0.75*F$18*FLOOR(F$20,0.05)*0.9*F$35*F$38*o_Isol_Bij_Tijdstip($A77,F$8,F$11))+(0.75*H$18*FLOOR(H$20,0.05)*0.9*H$35*H$38*o_Isol_Bij_Tijdstip($A77,F$8,F$11))","v":0},"W",null,null,{"$f":"(0.75*J$18*FLOOR(J$20,0.05)*0.9*J$35*J$38*o_Isol_Bij_Tijdstip($A77,J$8,J$11))+(0.75*L$18*FLOOR(L$20,0.05)*0.9*L$35*L$38*o_Isol_Bij_Tijdstip($A77,J$8,J$11))","v":0},"W",null,null,{"$f":"(0.75*N$18*FLOOR(N$20,0.05)*0.9*N$35*N$38*o_Isol_Bij_Tijdstip($A77,N$8,N$11))+(0.75*P$18*FLOOR(P$20,0.05)*0.9*P$35*P$38*o_Isol_Bij_Tijdstip($A77,N$8,N$11))","v":0},"W",null,null,{"$f":"(0.75*R$18*FLOOR(R$20,0.05)*0.9*R$35*R$38*o_Isol_Bij_Tijdstip($A77,R$8,R$11))+(0.75*T$18*FLOOR(T$20,0.05)*0.9*T$35*T$38*o_Isol_Bij_Tijdstip($A77,R$8,R$11))","v":0},"W",0,"W"]
["14:00:00",{"$f":"(0.75*B$18*FLOOR(B$20,0.05)*0.9*B$35*B$38*o_Isol_Bij_Tijdstip($A78,B$8,B$11))+(0.75*D$18*FLOOR(D$20,0.05)*0.9*D$35*D$38*o_Isol_Bij_Tijdstip($A78,B$8,B$11))","v":0},"W",null,null,{"$f":"(0.75*F$18*FLOOR(F$20,0.05)*0.9*F$35*F$38*o_Isol_Bij_Tijdstip($A78,F$8,F$11))+(0.75*H$18*FLOOR(H$20,0.05)*0.9*H$35*H$38*o_Isol_Bij_Tijdstip($A78,F$8,F$11))","v":0},"W",null,null,{"$f":"(0.75*J$18*FLOOR(J$20,0.05)*0.9*J$35*J$38*o_Isol_Bij_Tijdstip($A78,J$8,J$11))+(0.75*L$18*FLOOR(L$20,0.05)*0.9*L$35*L$38*o_Isol_Bij_Tijdstip($A78,J$8,J$11))","v":0},"W",null,null,{"$f":"(0.75*N$18*FLOOR(N$20,0.05)*0.9*N$35*N$38*o_Isol_Bij_Tijdstip($A78,N$8,N$11))+(0.75*P$18*FLOOR(P$20,0.05)*0.9*P$35*P$38*o_Isol_Bij_Tijdstip($A78,N$8,N$11))","v":0},"W",null,null,{"$f":"(0.75*R$18*FLOOR(R$20,0.05)*0.9*R$35*R$38*o_Isol_Bij_Tijdstip($A78,R$8,R$11))+(0.75*T$18*FLOOR(T$20,0.05)*0.9*T$35*T$38*o_Isol_Bij_Tijdstip($A78,R$8,R$11))","v":0},"W",0,"W"]
["15:00:00",{"$f":"(0.75*B$18*FLOOR(B$20,0.05)*0.9*B$35*B$38*o_Isol_Bij_Tijdstip($A79,B$8,B$11))+(0.75*D$18*FLOOR(D$20,0.05)*0.9*D$35*D$38*o_Isol_Bij_Tijdstip($A79,B$8,B$11))","v":0},"W",null,null,{"$f":"(0.75*F$18*FLOOR(F$20,0.05)*0.9*F$35*F$38*o_Isol_Bij_Tijdstip($A79,F$8,F$11))+(0.75*H$18*FLOOR(H$20,0.05)*0.9*H$35*H$38*o_Isol_Bij_Tijdstip($A79,F$8,F$11))","v":0},"W",null,null,{"$f":"(0.75*J$18*FLOOR(J$20,0.05)*0.9*J$35*J$38*o_Isol_Bij_Tijdstip($A79,J$8,J$11))+(0.75*L$18*FLOOR(L$20,0.05)*0.9*L$35*L$38*o_Isol_Bij_Tijdstip($A79,J$8,J$11))","v":0},"W",null,null,{"$f":"(0.75*N$18*FLOOR(N$20,0.05)*0.9*N$35*N$38*o_Isol_Bij_Tijdstip($A79,N$8,N$11))+(0.75*P$18*FLOOR(P$20,0.05)*0.9*P$35*P$38*o_Isol_Bij_Tijdstip($A79,N$8,N$11))","v":0},"W",null,null,{"$f":"(0.75*R$18*FLOOR(R$20,0.05)*0.9*R$35*R$38*o_Isol_Bij_Tijdstip($A79,R$8,R$11))+(0.75*T$18*FLOOR(T$20,0.05)*0.9*T$35*T$38*o_Isol_Bij_Tijdstip($A79,R$8,R$11))","v":0},"W",0,"W"]
["16:00:00",{"$f":"(0.75*B$18*FLOOR(B$20,0.05)*0.9*B$35*B$38*o_Isol_Bij_Tijdstip($A80,B$8,B$11))+(0.75*D$18*FLOOR(D$20,0.05)*0.9*D$35*D$38*o_Isol_Bij_Tijdstip($A80,B$8,B$11))","v":0},"W",null,null,{"$f":"(0.75*F$18*FLOOR(F$20,0.05)*0.9*F$35*F$38*o_Isol_Bij_Tijdstip($A80,F$8,F$11))+(0.75*H$18*FLOOR(H$20,0.05)*0.9*H$35*H$38*o_Isol_Bij_Tijdstip($A80,F$8,F$11))","v":0},"W",null,null,{"$f":"(0.75*J$18*FLOOR(J$20,0.05)*0.9*J$35*J$38*o_Isol_Bij_Tijdstip($A80,J$8,J$11))+(0.75*L$18*FLOOR(L$20,0.05)*0.9*L$35*L$38*o_Isol_Bij_Tijdstip($A80,J$8,J$11))","v":0},"W",null,null,{"$f":"(0.75*N$18*FLOOR(N$20,0.05)*0.9*N$35*N$38*o_Isol_Bij_Tijdstip($A80,N$8,N$11))+(0.75*P$18*FLOOR(P$20,0.05)*0.9*P$35*P$38*o_Isol_Bij_Tijdstip($A80,N$8,N$11))","v":0},"W",null,null,{"$f":"(0.75*R$18*FLOOR(R$20,0.05)*0.9*R$35*R$38*o_Isol_Bij_Tijdstip($A80,R$8,R$11))+(0.75*T$18*FLOOR(T$20,0.05)*0.9*T$35*T$38*o_Isol_Bij_Tijdstip($A80,R$8,R$11))","v":0},"W",0,"W"]
["17:00:00",{"$f":"(0.75*B$18*FLOOR(B$20,0.05)*0.9*B$35*B$38*o_Isol_Bij_Tijdstip($A81,B$8,B$11))+(0.75*D$18*FLOOR(D$20,0.05)*0.9*D$35*D$38*o_Isol_Bij_Tijdstip($A81,B$8,B$11))","v":0},"W",null,null,{"$f":"(0.75*F$18*FLOOR(F$20,0.05)*0.9*F$35*F$38*o_Isol_Bij_Tijdstip($A81,F$8,F$11))+(0.75*H$18*FLOOR(H$20,0.05)*0.9*H$35*H$38*o_Isol_Bij_Tijdstip($A81,F$8,F$11))","v":0},"W",null,null,{"$f":"(0.75*J$18*FLOOR(J$20,0.05)*0.9*J$35*J$38*o_Isol_Bij_Tijdstip($A81,J$8,J$11))+(0.75*L$18*FLOOR(L$20,0.05)*0.9*L$35*L$38*o_Isol_Bij_Tijdstip($A81,J$8,J$11))","v":0},"W",null,null,{"$f":"(0.75*N$18*FLOOR(N$20,0.05)*0.9*N$35*N$38*o_Isol_Bij_Tijdstip($A81,N$8,N$11))+(0.75*P$18*FLOOR(P$20,0.05)*0.9*P$35*P$38*o_Isol_Bij_Tijdstip($A81,N$8,N$11))","v":0},"W",null,null,{"$f":"(0.75*R$18*FLOOR(R$20,0.05)*0.9*R$35*R$38*o_Isol_Bij_Tijdstip($A81,R$8,R$11))+(0.75*T$18*FLOOR(T$20,0.05)*0.9*T$35*T$38*o_Isol_Bij_Tijdstip($A81,R$8,R$11))","v":0},"W",0,"W"]
["18:00:00",{"$f":"(0.75*B$18*FLOOR(B$20,0.05)*0.9*B$35*B$38*o_Isol_Bij_Tijdstip($A82,B$8,B$11))+(0.75*D$18*FLOOR(D$20,0.05)*0.9*D$35*D$38*o_Isol_Bij_Tijdstip($A82,B$8,B$11))","v":0},"W",null,null,{"$f":"(0.75*F$18*FLOOR(F$20,0.05)*0.9*F$35*F$38*o_Isol_Bij_Tijdstip($A82,F$8,F$11))+(0.75*H$18*FLOOR(H$20,0.05)*0.9*H$35*H$38*o_Isol_Bij_Tijdstip($A82,F$8,F$11))","v":0},"W",null,null,{"$f":"(0.75*J$18*FLOOR(J$20,0.05)*0.9*J$35*J$38*o_Isol_Bij_Tijdstip($A82,J$8,J$11))+(0.75*L$18*FLOOR(L$20,0.05)*0.9*L$35*L$38*o_Isol_Bij_Tijdstip($A82,J$8,J$11))","v":0},"W",null,null,{"$f":"(0.75*N$18*FLOOR(N$20,0.05)*0.9*N$35*N$38*o_Isol_Bij_Tijdstip($A82,N$8,N$11))+(0.75*P$18*FLOOR(P$20,0.05)*0.9*P$35*P$38*o_Isol_Bij_Tijdstip($A82,N$8,N$11))","v":0},"W",null,null,{"$f":"(0.75*R$18*FLOOR(R$20,0.05)*0.9*R$35*R$38*o_Isol_Bij_Tijdstip($A82,R$8,R$11))+(0.75*T$18*FLOOR(T$20,0.05)*0.9*T$35*T$38*o_Isol_Bij_Tijdstip($A82,R$8,R$11))","v":0},"W",0,"W"]
[]
["Maatgevende tijdstip",{"$f":"IF(MAX(T73:T82)=0,\"Geen glas aanwezig\",_xlfn.XLOOKUP(MAX(T73:T82),T73:T82,A73:A82,\"nvt\"))","v":"Geen glas aanwezig"}]

{"sheet":"Ruimte 8","index":10,"n_rows":84,"n_cols":21,"rows_kept":84,"cut":false,"hidden":false,"merged":[[66,0,67,20],[0,0,0,20],[6,1,6,3],[6,5,6,7],[6,9,6,11],[6,13,6,15],[6,17,6,20],[41,1,41,3],[41,5,41,7],[41,9,41,11],[41,13,41,15],[41,17,41,19],[40,1,40,3],[40,5,40,7],[40,9,40,11],[40,13,40,15],[40,17,40,19],[55,1,55,3],[55,5,55,7],[55,9,55,11],[55,13,55,15],[55,17,55,19],[54,1,54,3],[54,5,54,7],[54,9,54,11],[54,13,54,15],[54,17,54,19],[56,5,56,7],[56,9,56,11],[56,13,56,15],[56,17,56,19],[57,1,57,3],[57,5,57,7],[57,9,57,11],[57,13,57,15],[57,17,57,19],[59,1,59,3],[60,1,60,3],[62,1,62,3],[63,1,63,3],[56,1,56,3]]}
["RUIMTE 8"]
[]
["Ruimtenaam",0]
["Type verblijfsruimte","Andere verblijfsruimte"]
["Vloeroppervlak verblijfsruimte Avr  (gebruiksoppervlak)",0,"m²"]
[]
[null,"Voorzijde woning",null,null,null,"Linker zijde woning",null,null,null,"Achterzijde woning",null,null,null,"Rechter zijde woning",null,null,null,"Platdak"]
["Orientatie gevel / dakvlak (Helling > 15°C)",{"$f":"Invoerblad!$B$17","v":"Noord"},null,null,null,{"$f":"o_Orientatie(F9)","v":"Oost"},null,null,null,{"$f":"o_Orientatie(J9)","v":"Zuid"},null,null,null,{"$f":"o_Orientatie(N9)","v":"West"},null,null,null,"Horizontaal"]
["Orientatiehoek gevel Ƴ",{"$f":"o_OrientatiehOEK(B8)","v":0},null,null,null,{"$f":"IF(B9+90>360,B9+90-360,B9+90)","v":90},null,null,null,{"$f":"IF(F9+90>360,F9+90-360,F9+90)","v":180},null,null,null,{"$f":"IF(J9+90>360,J9+90-360,J9+90)","v":270}]
["Grenst aan buitenlucht ja of nee","Ja",null,null,null,"Ja",null,null,null,"Ja",null,null,null,"Ja",null,null,null,"Ja"]
["Hellingshoek constructie ≥ 15° = hellenddak 90° = gevel",90,"°",null,null,90,"°",null,null,90,"°",null,null,90,"°",null,null,10,"°"]
["Type constructie",{"$f":"o_TypeConstructie(B10,B11)","v":"Buitengevel"},null,null,null,{"$f":"o_TypeConstructie(F10,F11)","v":"Buitengevel"},null,null,null,{"$f":"o_TypeConstructie(J10,J11)","v":"Buitengevel"},null,null,null,{"$f":"o_TypeConstructie(N10,N11)","v":"Buitengevel"},null,null,null,{"$f":"o_TypeConstructie(R10,R11)","v":"Platdak <15°"}]
["Gevel lengte (binnenwerks)",0,"m",null,null,0,"m",null,null,0,"m",null,null,0,"m",null,null,0,"m"]
["Gevel hoogte / Dak breedte (binnenwerks)",0,"m",null,null,0,"m",null,null,0,"m",null,null,0,"m",null,null,0,"m"]
["Constructie oppervlak (binnenwerks)",{"$f":"B13*B14","v":0},"m²",null,null,{"$f":"F13*F14","v":0},"m²",null,null,{"$f":"J13*J14","v":0},"m²",null,null,{"$f":"N13*N14","v":0},"m²",null,null,{"$f":"R13*R14","v":0},"m²"]
["Gesloten constructie oppervlak",{"$f":"MAX(0,B15-B18-D18)","v":0},"m²",null,null,{"$f":"MAX(0,F15-F18-H18)","v":0},"m²",null,null,{"$f":"MAX(0,J15-J18-L18)","v":0},"m²",null,null,{"$f":"MAX(0,N15-N18-P18)","v":0},"m²",null,null,{"$f":"MAX(0,R15-R18-T18)","v":0},"m²"]
[null,"Glasvlak type 1",null,"Glasvlak type 2",null,"Glasvlak type 1",null,"Glasvlak type 2",null,"Glasvlak type 1",null,"Glasvlak type 2",null,"Glasvlak type 1",null,"Glasvlak type 2",null,"Glasvlak type 1",null,"Glasvlak type 2"]
["Totaal oppervlak van raamtype Aw,k (inclusief kozijn)",0,"m²",0,"m²",0,"m²",0,"m²",0,"m²",0,"m²",0,"m²",0,"m²",0,"m²",0,"m²"]
["Warmtedoorgangscoefficient (U-waarde) van het raam Uw;wi;k",1.6,"W/m².K",1.6,"W/m².K",1.6,"W/m².K",1.6,"W/m².K",1.6,"W/m².K",1.6,"W/m².K",1.6,"W/m².K",1.6,"W/m².K",1.6,"W/m².K",1.6,"W/m².K"]
["Zontoetredingsfactor (g_waarde) van het glas Ggl;n;wi;k;C;juli",1,null,1,null,1,null,1,null,1,null,1,null,1,null,1,null,1,null,1]
["Beschaduwing situatie bij het raamtype","Minimale belemmering",null,"Minimale belemmering",null,"Minimale belemmering",null,"Minimale belemmering",null,"Minimale belemmering",null,"Minimale belemmering",null,"Minimale belemmering",null,"Minimale belemmering",null,"Minimale belemmering",null,"Minimale belemmering"]
[]
[null,"Overstek",null,"Overstek",null,"Overstek",null,"Overstek",null,"Overstek",null,"Overstek",null,"Overstek",null,"Overstek"]
["Hoogte verschil midden raam onderzijde overstek",0,"m",0,"m",0,"m",0,"m",0,"m",0,"m",0,"m",0,"m",0,null,null,"m"]
["Horizontale afstand glas tot eindpunt overstek",0,"m",0,"m",0,"m",0,"m",0,"m",0,"m",0,"m",0,"m",0,null,null,"m"]
["Overstekhoek",{"$f":"IFERROR(180/PI()*ATAN(B24/B25),0)","v":0},"°",{"$f":"IFERROR(180/PI()*ATAN(D24/D25),0)","v":0},"°",{"$f":"IFERROR(180/PI()*ATAN(F24/F25),0)","v":0},"°",{"$f":"IFERROR(180/PI()*ATAN(H24/H25),0)","v":0},"°",{"$f":"IFERROR(180/PI()*ATAN(J24/J25),0)","v":0},"°",{"$f":"IFERROR(180/PI()*ATAN(L24/L25),0)","v":0},"°",{"$f":"IFERROR(180/PI()*ATAN(N24/N25),0)","v":0},"°",{"$f":"IFERROR(180/PI()*ATAN(P24/P25),0)","v":0},"°",null,null,null,"°"]
["Relatieve hoogte van overstek",{"$f":"IFERROR(B24/B25,1)","v":1},null,{"$f":"IFERROR(D24/D25,1)","v":1},null,{"$f":"IFERROR(F24/F25,1)","v":1},null,{"$f":"IFERROR(H24/H25,1)","v":1},null,{"$f":"IFERROR(J24/J25,1)","v":1},null,{"$f":"IFERROR(L24/L25,1)","v":1},null,{"$f":"IFERROR(N24/N25,1)","v":1},null,{"$f":"IFERROR(P24/P25,1)","v":1}]
[]
[null,"Zijbelemmering",null,"Zijbelemmering",null,"Zijbelemmering",null,"Zijbelemmering",null,"Zijbelemmering",null,"Zijbelemmering",null,"Zijbelemmering",null,"Zijbelemmering"]
["Positie zijbelemmering irt zichtveld (naar buitengericht)","Links",null,"Links",null,"Links",null,"Links",null,"Links",null,"Links",null,"Links",null,"Links"]
["Horizontale afstand midden raam verste punt belemmering",0,"m",0,"m",null,"m",null,"m",null,"m",1,"m",null,"m",null,"m",null,null,null,"m"]
["Horizontale breedte glas tot eindpunt belemmering",0,"m",0,"m",null,"m",null,"m",null,"m",null,"m",null,"m",null,"m",null,null,null,"m"]
["Relatieve breedte van de zijbelemmering bb",{"$f":"IFERROR(B31/B32,999)","v":999},null,{"$f":"IFERROR(D31/D32,999)","v":999},null,{"$f":"IFERROR(F31/F32,999)","v":999},null,{"$f":"IFERROR(H31/H32,999)","v":999},null,{"$f":"IFERROR(J31/J32,999)","v":999},null,{"$f":"IFERROR(L31/L32,999)","v":999},null,{"$f":"IFERROR(N31/N32,999)","v":999},null,{"$f":"IFERROR(P31/P32,999)","v":999}]
[]
["De beschaduwingsreductiefactor Fsh;obst;wi;k;juli",{"$f":"IFERROR(o_Beschaduwingreductie(B21,B8,B27,B30,B33,B11),1)","v":1},null,{"$f":"IFERROR(o_Beschaduwingreductie(D21,B8,D27,D30,D33,B11),1)","v":1},null,{"$f":"IFERROR(o_Beschaduwingreductie(F21,F8,F27,F30,F33,F11),1)","v":1},null,{"$f":"IFERROR(o_Beschaduwingreductie(H21,F8,H27,H30,H33,F11),1)","v":1},null,{"$f":"IFERROR(o_Beschaduwingreductie(J21,J8,J27,J30,J33,J11),1)","v":1},null,{"$f":"IFERROR(o_Beschaduwingreductie(L21,J8,L27,L30,L33,J11),1)","v":1},null,{"$f":"IFERROR(o_Beschaduwingreductie(N21,N8,N27,N30,N33,N11),1)","v":1},null,{"$f":"IFERROR(o_Beschaduwingreductie(P21,N8,P27,P30,P33,N11),1)","v":1},null,{"$f":"o_Beschaduwingreductie(R21,R8,R27,R30,R33,R11)","v":1},null,{"$f":"o_Beschaduwingreductie(T21,R8,T27,T30,T33,R11)","v":1}]
[]
["Type zonwering","Geen zonwering",null,"Geen zonwering",null,"Geen zonwering",null,"Geen zonwering",null,"Geen zonwering",null,"Geen zonwering",null,"Geen zonwering",null,"Geen zonwering",null,"Geen zonwering",null,"Geen zonwering"]
["De reductiefactor voor zonwering Fc;wi;k",{"$f":"o_Zonweringreductie(B37,B8)","v":1},null,{"$f":"o_Zonweringreductie(D37,B8)","v":1},null,{"$f":"o_Zonweringreductie(F37,F8)","v":1},null,{"$f":"o_Zonweringreductie(H37,F8)","v":1},null,{"$f":"o_Zonweringreductie(J37,J8)","v":1},null,{"$f":"o_Zonweringreductie(L37,J8)","v":1},null,{"$f":"o_Zonweringreductie(N37,N8)","v":1},null,{"$f":"o_Zonweringreductie(P37,N8)","v":1},null,{"$f":"o_Zonweringreductie(R37,R8)","v":1},null,{"$f":"o_Zonweringreductie(T37,R8)","v":1}]
["Totaal opvallende zonnestraling van het raam Isol;wi;k;juli",{"$f":"IF(B10=\"Nee\",0,o_Isol_Bij_Tijdstip($B$52,B8,B11))","v":102.18873424043244},"W/m²",{"$f":"IF(B10=\"Nee\",0,o_Isol_Bij_Tijdstip($B$52,B8,B11))","v":102.18873424043244},"W/m²",{"$f":"IF(F10=\"Nee\",0,o_Isol_Bij_Tijdstip($B$52,F8,F11))","v":84.062269883674873},"W/m²",{"$f":"IF(F10=\"Nee\",0,o_Isol_Bij_Tijdstip($B$52,F8,F11))","v":84.062269883674873},"W/m²",{"$f":"IF(J10=\"Nee\",0,o_Isol_Bij_Tijdstip($B$52,J8,J11))","v":84.062269883674873},"W/m²",{"$f":"IF(J10=\"Nee\",0,o_Isol_Bij_Tijdstip($B$52,J8,J11))","v":84.062269883674873},"W/m²",{"$f":"IF(N10=\"Nee\",0,o_Isol_Bij_Tijdstip($B$52,N8,N11))","v":741.75809294382429},"W/m²",{"$f":"IF(N10=\"Nee\",0,o_Isol_Bij_Tijdstip($B$52,N8,N11))","v":741.75809294382429},"W/m²",{"$f":"IF(R10=\"Nee\",0,o_Isol_Bij_Tijdstip($B$52,R8,R11))","v":408.30602418254711},"W/m²",{"$f":"IF(R10=\"Nee\",0,o_Isol_Bij_Tijdstip($B$52,R8,R11))","v":408.30602418254711},"W/m²"]
[]
["Tijdstip maximale koellastbijdrage tmax;zi",{"$f":"VALUE(o_Tijdstip_Isol_Max_Orientatie(B8,B11))","v":"15:00:00"},null,null,null,{"$f":"VALUE(o_Tijdstip_Isol_Max_Orientatie(F8,F11))","v":"09:00:00"},null,null,null,{"$f":"VALUE(o_Tijdstip_Isol_Max_Orientatie(J8,J11))","v":"14:00:00"},null,null,null,{"$f":"VALUE(o_Tijdstip_Isol_Max_Orientatie(N8,N11))","v":"18:00:00"},null,null,null,{"$f":"o_Tijdstip_Isol_Max_Orientatie(R8,R11)","v":"16:00:00"}]
["Buitenluchttemperatuur op tijdstip max koellast Θe",{"$f":"o_maxTemp(VALUE(B41))","v":29.8},null,null,"°C",{"$f":"o_maxTemp(VALUE(F41))","v":24.7},null,null,"°C",{"$f":"o_maxTemp(VALUE(J41))","v":29.9},null,null,"°C",{"$f":"o_maxTemp(VALUE(N41))","v":30.1},null,null,"°C",{"$f":"o_maxTemp(VALUE(R41))","v":30.4}]
[]
["Glasopppervlak",{"$f":"IF(B10=\"Ja\",B18+D18,0)","v":0},"m²",null,null,{"$f":"IF(F10=\"Ja\",F18+H18,0)","v":0},"m²",null,null,{"$f":"IF(J10=\"Ja\",J18+L18,0)","v":0},"m²",null,null,{"$f":"IF(N10=\"Ja\",N18+P18,0)","v":0},"m²",null,null,{"$f":"IF(R10=\"Ja\",R18+T18,0)","v":0},"m²"]
["Uitwendigescheidingsconstructie niet op Noord?",{"$f":"IF(B10=\"Ja\",IF(B8=\"Noord\",FALSE,TRUE),FALSE)","v":false},null,null,null,{"$f":"IF(F10=\"Ja\",IF(F8=\"Noord\",FALSE,TRUE),FALSE)","v":true},null,null,null,{"$f":"IF(J10=\"Ja\",IF(J8=\"Noord\",FALSE,TRUE),FALSE)","v":true},null,null,null,{"$f":"IF(N10=\"Ja\",IF(N8=\"Noord\",FALSE,TRUE),FALSE)","v":true},null,null,null,{"$f":"IF(R10=\"Ja\",IF(R8=\"Noord\",FALSE,TRUE),FALSE)","v":true}]
["De enige uitwendigescheidingscontructie?",{"$f":"IF(AND(B45=TRUE,COUNTIF($B$45:$R$45,TRUE)=1),TRUE,FALSE)","v":false},null,null,null,{"$f":"IF(AND(F45=TRUE,COUNTIF($B$45:$R$45,TRUE)=1),TRUE,FALSE)","v":false},null,null,null,{"$f":"IF(AND(J45=TRUE,COUNTIF($B$45:$R$45,TRUE)=1),TRUE,FALSE)","v":false},null,null,null,{"$f":"IF(AND(N45=TRUE,COUNTIF($B$45:$R$45,TRUE)=1),TRUE,FALSE)","v":false},null,null,null,{"$f":"IF(AND(R45=TRUE,COUNTIF($B$45:$R$45,TRUE)=1),TRUE,FALSE)","v":false}]
["Totaal glasoppervlak",{"$f":"IF(B8<>\"Noord\",B44,0)","v":0},"m²",null,null,{"$f":"IF(F8<>\"Noord\",F44,0)","v":0},"m²",null,null,{"$f":"IF(J8<>\"Noord\",J44,0)","v":0},"m²",null,null,{"$f":"IF(N8<>\"Noord\",N44,0)","v":0},"m²",null,null,{"$f":"R44","v":0},"m²"]
["Grootste glasoppervlak ",{"$f":"IF(AND(B45,B47=MAX($B$47:$R$47)),TRUE,FALSE)","v":false},null,null,null,{"$f":"IF(AND(F45,F47=MAX($B$47:$R$47)),TRUE,FALSE)","v":true},null,null,null,{"$f":"IF(AND(J45,J47=MAX($B$47:$R$47)),TRUE,FALSE)","v":true},null,null,null,{"$f":"IF(AND(N45,N47=MAX($B$47:$R$47)),TRUE,FALSE)","v":true},null,null,null,{"$f":"IF(AND(R45,R47=MAX($B$47:$R$47)),TRUE,FALSE)","v":true}]
["Dakvlak maatgevend?",{"$f":"IF(AND(B11<90,B15>3*(B18+D18),Invoerblad!$B$25<65),TRUE,FALSE)","v":false},null,null,null,{"$f":"IF(AND(F11<90,F15>3*(F18+H18),Invoerblad!$B$25<65),TRUE,FALSE)","v":false},null,null,null,{"$f":"IF(AND(J11<90,J15>3*(J18+L18),Invoerblad!$B$25<65),TRUE,FALSE)","v":false},null,null,null,{"$f":"IF(AND(N11<90,N15>3*(N18+P18),Invoerblad!$B$25<65),TRUE,FALSE)","v":false},null,null,null,{"$f":"IF(AND(R11<90,R15>3*(R18+T18),Invoerblad!$B$25<65),TRUE,FALSE)","v":false}]
["is er een maatgevend dakoppervlak",{"$f":"IF(COUNTIF($B$49:$R$49,TRUE)>0,TRUE,FALSE)","v":false},null,null,null,{"$f":"IF(COUNTIF($B$49:$R$49,TRUE)>0,TRUE,FALSE)","v":false},null,null,null,{"$f":"IF(COUNTIF($B$49:$R$49,TRUE)>0,TRUE,FALSE)","v":false},null,null,null,{"$f":"IF(COUNTIF($B$49:$R$49,TRUE)>0,TRUE,FALSE)","v":false},null,null,null,{"$f":"IF(COUNTIF($B$49:$R$49,TRUE)>0,TRUE,FALSE)","v":false}]
["Maatgevende tijdstip",{"$f":"IF(OR(B46,AND(B45,B50,B49),AND(B45,B48,NOT(B50))),B41)","v":false},null,null,null,{"$f":"IF(OR(F46,AND(F45,F50,F49),AND(F45,F48,NOT(F50))),F41)","v":"09:00:00"},null,null,null,{"$f":"IF(OR(J46,AND(J45,J50,J49),AND(J45,J48,NOT(J50))),J41)","v":"14:00:00"},null,null,null,{"$f":"IF(OR(N46,AND(N45,N50,N49),AND(N45,N48,NOT(N50))),N41)","v":"18:00:00"},null,null,null,{"$f":"IF(OR(R46,AND(R45,R50,R49),AND(R45,R48,NOT(R50))),R41)","v":"16:00:00"}]
["Maatgevende tijdstip tmax;zi",{"$f":"IFERROR(B84,\"geen glas ingevoerd\")","v":"Geen glas aanwezig"}]
["Buitenluchttemperatuur op tijdstip max koellast Θe",{"$f":"o_maxTemp(VALUE(B52))","v":""},"°C"]
[]
["Koellastbijdrage transmissie transparante delen Ptr;gl;vr;zi",{"$f":"IF(B10=\"Nee\",0,B16*Invoerblad!$B$16)","v":0},null,null,"W",{"$f":"IF(F10=\"Nee\",0,F16*Invoerblad!$B$16)","v":0},null,null,"W",{"$f":"IF(J10=\"Nee\",0,J16*Invoerblad!$B$16)","v":0},null,null,"W",{"$f":"IF(N10=\"Nee\",0,N16*Invoerblad!$B$16)","v":0},null,null,"W",{"$f":"IF(R10=\"Nee\",0,R16*Invoerblad!$B$16)","v":0},null,null,"W"]
["Koellastbijdrage zoninstraling transparante delen Psol;vr;zi",{"$f":"(0.75*B18*FLOOR(B20,0.05)*0.9*B35*B38*B39)+(0.75*D18*FLOOR(D20,0.05)*0.9*D35*D38*D39)","v":0},null,null,"W",{"$f":"(0.75*F18*FLOOR(F20,0.05)*0.9*F35*F38*F39)+(0.75*H18*FLOOR(H20,0.05)*0.9*H35*H38*H39)","v":0},null,null,"W",{"$f":"(0.75*J18*FLOOR(J20,0.05)*0.9*J35*J38*J39)+(0.75*L18*FLOOR(L20,0.05)*0.9*L35*L38*L39)","v":0},null,null,"W",{"$f":"(0.75*N18*FLOOR(N20,0.05)*0.9*N35*N38*N39)+(0.75*P18*FLOOR(P20,0.05)*0.9*P35*P38*P39)","v":0},null,null,"W",{"$f":"(0.75*R18*FLOOR(R20,0.05)*0.9*R35*R38*R39)+(0.75*T18*FLOOR(T20,0.05)*0.9*T35*T38*T39)","v":0},null,null,"W"]
["Koellastbijdrage transmissie transparante delen Ptr;gl;vr;zi",{"$f":"IF(B10=\"Nee\",0,IFERROR(B18*B19*($B$53-24),0)+IFERROR(D18*D19*($B$53-24),0))","v":0},null,null,"W",{"$f":"IF(F10=\"Nee\",0,IFERROR(F18*F19*($B$53-24),0)+IFERROR(H18*H19*($B$53-24),0))","v":0},null,null,"W",{"$f":"IF(J10=\"Nee\",0,IFERROR(J18*J19*($B$53-24),0)+IFERROR(L18*L19*($B$53-24),0))","v":0},null,null,"W",{"$f":"IF(N10=\"Nee\",0,IFERROR(N18*N19*($B$53-24),0)+IFERROR(P18*P19*($B$53-24),0))","v":0},null,null,"W",{"$f":"IF(R10=\"Nee\",0,IFERROR(R18*R19*($B$53-24),0)+IFERROR(T18*T19*($B$53-24),0))","v":0},null,null,"W"]
["Totaal koellastbijdrage per gevel",{"$f":"SUM(B55:D57)","v":0},null,null,"W",{"$f":"SUM(F55:H57)","v":0},null,null,"W",{"$f":"SUM(J55:L57)","v":0},null,null,"W",{"$f":"SUM(N55:P57)","v":0},null,null,"W",{"$f":"SUM(R55:R57)","v":0},null,null,"W"]
[]
["Koellast door interne warmtelast Pint;calc;woon/overig;zi",{"$f":"IF(B5=0,0,IF(B4=\"Woonvertrek\",2*Invoerblad!$B$40*B5,Invoerblad!$B$40*B5))","v":0},null,null,"W"]
["Koellast door buitenluchttoetreding Pv;calc;vr;zi",{"$f":"IFERROR(MAX((SUM(Invoerblad!$B$28:$B$30)/3600*1.205*1005*(B53-24))/SUM(Invoerblad!$B$47:$T$47)*B5,0),0)","v":0},{"$f":"IFERROR(MAX(SUM(C57:C59)/3600*1.205*1005*(C60-24),0),0)","v":0},{"$f":"IFERROR(MAX(SUM(D57:D59)/3600*1.205*1005*(D60-24),0),0)","v":0},"W"]
[]
["Totaal koellastbijdrage",{"$f":"IFERROR(SUM(B58:T58)+B60+B61,0)","v":0},null,null,"W"]
["Koelbehoefte verblijfsruimte",{"$f":"IFERROR(B63/B5,0)","v":0},null,null,"W/m²"]
[]
[]
["Onderstaande tabellen worden verborgen in de uiteindelijke versie. De tabellen dienen om vast te stellen welk tijdstip tot de hoogste zonbelasting leidt"]
[]
["Isol max voor de orientatie",{"$f":"o_Isol_Max_Orientatie(B8,B11)","v":143.73988086183414},"W/m²",null,null,{"$f":"o_Isol_Max_Orientatie(F8,F11)","v":845.32772366250799},"W/m²",null,null,{"$f":"o_Isol_Max_Orientatie(J8,J11)","v":740.05836254715712},"W/m²",null,null,{"$f":"o_Isol_Max_Orientatie(N8,N11)","v":741.75809294382429},"W/m²",null,null,{"$f":"o_Isol_Max_Orientatie(R8,R11)","v":914.16092603772574},"W/m²"]
["Tijdstip bij Isol max bij orientatie",{"$f":"VALUE(o_Tijdstip_Isol_Max_Orientatie(B8,B11))","v":"15:00:00"},null,null,null,{"$f":"VALUE(o_Tijdstip_Isol_Max_Orientatie(F8,F11))","v":"09:00:00"},null,null,null,{"$f":"VALUE(o_Tijdstip_Isol_Max_Orientatie(J8,J11))","v":"14:00:00"},null,null,null,{"$f":"VALUE(o_Tijdstip_Isol_Max_Orientatie(N8,N11))","v":"18:00:00"},null,null,null,{"$f":"VALUE(o_Tijdstip_Isol_Max_Orientatie(R8,R11))","v":"16:00:00"}]
[]
["Koellastbijdrage zoninstraling transparante delen Psol;vr;zi"]
["09:00:00",{"$f":"(0.75*B$18*FLOOR(B$20,0.05)*0.9*B$35*B$38*o_Isol_Bij_Tijdstip($A73,B$8,B$11))+(0.75*D$18*FLOOR(D$20,0.05)*0.9*D$35*D$38*o_Isol_Bij_Tijdstip($A73,B$8,B$11))","v":0},"W",null,null,{"$f":"(0.75*F$18*FLOOR(F$20,0.05)*0.9*F$35*F$38*o_Isol_Bij_Tijdstip($A73,F$8,F$11))+(0.75*H$18*FLOOR(H$20,0.05)*0.9*H$35*H$38*o_Isol_Bij_Tijdstip($A73,F$8,F$11))","v":0},"W",null,null,{"$f":"(0.75*J$18*FLOOR(J$20,0.05)*0.9*J$35*J$38*o_Isol_Bij_Tijdstip($A73,J$8,J$11))+(0.75*L$18*FLOOR(L$20,0.05)*0.9*L$35*L$38*o_Isol_Bij_Tijdstip($A73,J$8,J$11))","v":0},"W",null,null,{"$f":"(0.75*N$18*FLOOR(N$20,0.05)*0.9*N$35*N$38*o_Isol_Bij_Tijdstip($A73,N$8,N$11))+(0.75*P$18*FLOOR(P$20,0.05)*0.9*P$35*P$38*o_Isol_Bij_Tijdstip($A73,N$8,N$11))","v":0},"W",null,null,{"$f":"(0.75*R$18*FLOOR(R$20,0.05)*0.9*R$35*R$38*o_Isol_Bij_Tijdstip($A73,R$8,R$11))+(0.75*T$18*FLOOR(T$20,0.05)*0.9*T$35*T$38*o_Isol_Bij_Tijdstip($A73,R$8,R$11))","v":0},"W",{"$f":"B73+F73+J73+N73+R73","v":0},"W"]
["10:00:00",{"$f":"(0.75*B$18*FLOOR(B$20,0.05)*0.9*B$35*B$38*o_Isol_Bij_Tijdstip($A74,B$8,B$11))+(0.75*D$18*FLOOR(D$20,0.05)*0.9*D$35*D$38*o_Isol_Bij_Tijdstip($A74,B$8,B$11))","v":0},"W",null,null,{"$f":"(0.75*F$18*FLOOR(F$20,0.05)*0.9*F$35*F$38*o_Isol_Bij_Tijdstip($A74,F$8,F$11))+(0.75*H$18*FLOOR(H$20,0.05)*0.9*H$35*H$38*o_Isol_Bij_Tijdstip($A74,F$8,F$11))","v":0},"W",null,null,{"$f":"(0.75*J$18*FLOOR(J$20,0.05)*0.9*J$35*J$38*o_Isol_Bij_Tijdstip($A74,J$8,J$11))+(0.75*L$18*FLOOR(L$20,0.05)*0.9*L$35*L$38*o_Isol_Bij_Tijdstip($A74,J$8,J$11))","v":0},"W",null,null,{"$f":"(0.75*N$18*FLOOR(N$20,0.05)*0.9*N$35*N$38*o_Isol_Bij_Tijdstip($A74,N$8,N$11))+(0.75*P$18*FLOOR(P$20,0.05)*0.9*P$35*P$38*o_Isol_Bij_Tijdstip($A74,N$8,N$11))","v":0},"W",null,null,{"$f":"(0.75*R$18*FLOOR(R$20,0.05)*0.9*R$35*R$38*o_Isol_Bij_Tijdstip($A74,R$8,R$11))+(0.75*T$18*FLOOR(T$20,0.05)*0.9*T$35*T$38*o_Isol_Bij_Tijdstip($A74,R$8,R$11))","v":0},"W",0,"W"]
["11:00:00",{"$f":"(0.75*B$18*FLOOR(B$20,0.05)*0.9*B$35*B$38*o_Isol_Bij_Tijdstip($A75,B$8,B$11))+(0.75*D$18*FLOOR(D$20,0.05)*0.9*D$35*D$38*o_Isol_Bij_Tijdstip($A75,B$8,B$11))","v":0},"W",null,null,{"$f":"(0.75*F$18*FLOOR(F$20,0.05)*0.9*F$35*F$38*o_Isol_Bij_Tijdstip($A75,F$8,F$11))+(0.75*H$18*FLOOR(H$20,0.05)*0.9*H$35*H$38*o_Isol_Bij_Tijdstip($A75,F$8,F$11))","v":0},"W",null,null,{"$f":"(0.75*J$18*FLOOR(J$20,0.05)*0.9*J$35*J$38*o_Isol_Bij_Tijdstip($A75,J$8,J$11))+(0.75*L$18*FLOOR(L$20,0.05)*0.9*L$35*L$38*o_Isol_Bij_Tijdstip($A75,J$8,J$11))","v":0},"W",null,null,{"$f":"(0.75*N$18*FLOOR(N$20,0.05)*0.9*N$35*N$38*o_Isol_Bij_Tijdstip($A75,N$8,N$11))+(0.75*P$18*FLOOR(P$20,0.05)*0.9*P$35*P$38*o_Isol_Bij_Tijdstip($A75,N$8,N$11))","v":0},"W",null,null,{"$f":"(0.75*R$18*FLOOR(R$20,0.05)*0.9*R$35*R$38*o_Isol_Bij_Tijdstip($A75,R$8,R$11))+(0.75*T$18*FLOOR(T$20,0.05)*0.9*T$35*T$38*o_Isol_Bij_Tijdstip($A75,R$8,R$11))","v":0},"W",0,"W"]
["12:00:00",{"$f":"(0.75*B$18*FLOOR(B$20,0.05)*0.9*B$35*B$38*o_Isol_Bij_Tijdstip($A76,B$8,B$11))+(0.75*D$18*FLOOR(D$20,0.05)*0.9*D$35*D$38*o_Isol_Bij_Tijdstip($A76,B$8,B$11))","v":0},"W",null,null,{"$f":"(0.75*F$18*FLOOR(F$20,0.05)*0.9*F$35*F$38*o_Isol_Bij_Tijdstip($A76,F$8,F$11))+(0.75*H$18*FLOOR(H$20,0.05)*0.9*H$35*H$38*o_Isol_Bij_Tijdstip($A76,F$8,F$11))","v":0},"W",null,null,{"$f":"(0.75*J$18*FLOOR(J$20,0.05)*0.9*J$35*J$38*o_Isol_Bij_Tijdstip($A76,J$8,J$11))+(0.75*L$18*FLOOR(L$20,0.05)*0.9*L$35*L$38*o_Isol_Bij_Tijdstip($A76,J$8,J$11))","v":0},"W",null,null,{"$f":"(0.75*N$18*FLOOR(N$20,0.05)*0.9*N$35*N$38*o_Isol_Bij_Tijdstip($A76,N$8,N$11))+(0.75*P$18*FLOOR(P$20,0.05)*0.9*P$35*P$38*o_Isol_Bij_Tijdstip($A76,N$8,N$11))","v":0},"W",null,null,{"$f":"(0.75*R$18*FLOOR(R$20,0.05)*0.9*R$35*R$38*o_Isol_Bij_Tijdstip($A76,R$8,R$11))+(0.75*T$18*FLOOR(T$20,0.05)*0.9*T$35*T$38*o_Isol_Bij_Tijdstip($A76,R$8,R$11))","v":0},"W",0,"W"]
["13:00:00",{"$f":"(0.75*B$18*FLOOR(B$20,0.05)*0.9*B$35*B$38*o_Isol_Bij_Tijdstip($A77,B$8,B$11))+(0.75*D$18*FLOOR(D$20,0.05)*0.9*D$35*D$38*o_Isol_Bij_Tijdstip($A77,B$8,B$11))","v":0},"W",null,null,{"$f":"(0.75*F$18*FLOOR(F$20,0.05)*0.9*F$35*F$38*o_Isol_Bij_Tijdstip($A77,F$8,F$11))+(0.75*H$18*FLOOR(H$20,0.05)*0.9*H$35*H$38*o_Isol_Bij_Tijdstip($A77,F$8,F$11))","v":0},"W",null,null,{"$f":"(0.75*J$18*FLOOR(J$20,0.05)*0.9*J$35*J$38*o_Isol_Bij_Tijdstip($A77,J$8,J$11))+(0.75*L$18*FLOOR(L$20,0.05)*0.9*L$35*L$38*o_Isol_Bij_Tijdstip($A77,J$8,J$11))","v":0},"W",null,null,{"$f":"(0.75*N$18*FLOOR(N$20,0.05)*0.9*N$35*N$38*o_Isol_Bij_Tijdstip($A77,N$8,N$11))+(0.75*P$18*FLOOR(P$20,0.05)*0.9*P$35*P$38*o_Isol_Bij_Tijdstip($A77,N$8,N$11))","v":0},"W",null,null,{"$f":"(0.75*R$18*FLOOR(R$20,0.05)*0.9*R$35*R$38*o_Isol_Bij_Tijdstip($A77,R$8,R$11))+(0.75*T$18*FLOOR(T$20,0.05)*0.9*T$35*T$38*o_Isol_Bij_Tijdstip($A77,R$8,R$11))","v":0},"W",0,"W"]
["14:00:00",{"$f":"(0.75*B$18*FLOOR(B$20,0.05)*0.9*B$35*B$38*o_Isol_Bij_Tijdstip($A78,B$8,B$11))+(0.75*D$18*FLOOR(D$20,0.05)*0.9*D$35*D$38*o_Isol_Bij_Tijdstip($A78,B$8,B$11))","v":0},"W",null,null,{"$f":"(0.75*F$18*FLOOR(F$20,0.05)*0.9*F$35*F$38*o_Isol_Bij_Tijdstip($A78,F$8,F$11))+(0.75*H$18*FLOOR(H$20,0.05)*0.9*H$35*H$38*o_Isol_Bij_Tijdstip($A78,F$8,F$11))","v":0},"W",null,null,{"$f":"(0.75*J$18*FLOOR(J$20,0.05)*0.9*J$35*J$38*o_Isol_Bij_Tijdstip($A78,J$8,J$11))+(0.75*L$18*FLOOR(L$20,0.05)*0.9*L$35*L$38*o_Isol_Bij_Tijdstip($A78,J$8,J$11))","v":0},"W",null,null,{"$f":"(0.75*N$18*FLOOR(N$20,0.05)*0.9*N$35*N$38*o_Isol_Bij_Tijdstip($A78,N$8,N$11))+(0.75*P$18*FLOOR(P$20,0.05)*0.9*P$35*P$38*o_Isol_Bij_Tijdstip($A78,N$8,N$11))","v":0},"W",null,null,{"$f":"(0.75*R$18*FLOOR(R$20,0.05)*0.9*R$35*R$38*o_Isol_Bij_Tijdstip($A78,R$8,R$11))+(0.75*T$18*FLOOR(T$20,0.05)*0.9*T$35*T$38*o_Isol_Bij_Tijdstip($A78,R$8,R$11))","v":0},"W",0,"W"]
["15:00:00",{"$f":"(0.75*B$18*FLOOR(B$20,0.05)*0.9*B$35*B$38*o_Isol_Bij_Tijdstip($A79,B$8,B$11))+(0.75*D$18*FLOOR(D$20,0.05)*0.9*D$35*D$38*o_Isol_Bij_Tijdstip($A79,B$8,B$11))","v":0},"W",null,null,{"$f":"(0.75*F$18*FLOOR(F$20,0.05)*0.9*F$35*F$38*o_Isol_Bij_Tijdstip($A79,F$8,F$11))+(0.75*H$18*FLOOR(H$20,0.05)*0.9*H$35*H$38*o_Isol_Bij_Tijdstip($A79,F$8,F$11))","v":0},"W",null,null,{"$f":"(0.75*J$18*FLOOR(J$20,0.05)*0.9*J$35*J$38*o_Isol_Bij_Tijdstip($A79,J$8,J$11))+(0.75*L$18*FLOOR(L$20,0.05)*0.9*L$35*L$38*o_Isol_Bij_Tijdstip($A79,J$8,J$11))","v":0},"W",null,null,{"$f":"(0.75*N$18*FLOOR(N$20,0.05)*0.9*N$35*N$38*o_Isol_Bij_Tijdstip($A79,N$8,N$11))+(0.75*P$18*FLOOR(P$20,0.05)*0.9*P$35*P$38*o_Isol_Bij_Tijdstip($A79,N$8,N$11))","v":0},"W",null,null,{"$f":"(0.75*R$18*FLOOR(R$20,0.05)*0.9*R$35*R$38*o_Isol_Bij_Tijdstip($A79,R$8,R$11))+(0.75*T$18*FLOOR(T$20,0.05)*0.9*T$35*T$38*o_Isol_Bij_Tijdstip($A79,R$8,R$11))","v":0},"W",0,"W"]
["16:00:00",{"$f":"(0.75*B$18*FLOOR(B$20,0.05)*0.9*B$35*B$38*o_Isol_Bij_Tijdstip($A80,B$8,B$11))+(0.75*D$18*FLOOR(D$20,0.05)*0.9*D$35*D$38*o_Isol_Bij_Tijdstip($A80,B$8,B$11))","v":0},"W",null,null,{"$f":"(0.75*F$18*FLOOR(F$20,0.05)*0.9*F$35*F$38*o_Isol_Bij_Tijdstip($A80,F$8,F$11))+(0.75*H$18*FLOOR(H$20,0.05)*0.9*H$35*H$38*o_Isol_Bij_Tijdstip($A80,F$8,F$11))","v":0},"W",null,null,{"$f":"(0.75*J$18*FLOOR(J$20,0.05)*0.9*J$35*J$38*o_Isol_Bij_Tijdstip($A80,J$8,J$11))+(0.75*L$18*FLOOR(L$20,0.05)*0.9*L$35*L$38*o_Isol_Bij_Tijdstip($A80,J$8,J$11))","v":0},"W",null,null,{"$f":"(0.75*N$18*FLOOR(N$20,0.05)*0.9*N$35*N$38*o_Isol_Bij_Tijdstip($A80,N$8,N$11))+(0.75*P$18*FLOOR(P$20,0.05)*0.9*P$35*P$38*o_Isol_Bij_Tijdstip($A80,N$8,N$11))","v":0},"W",null,null,{"$f":"(0.75*R$18*FLOOR(R$20,0.05)*0.9*R$35*R$38*o_Isol_Bij_Tijdstip($A80,R$8,R$11))+(0.75*T$18*FLOOR(T$20,0.05)*0.9*T$35*T$38*o_Isol_Bij_Tijdstip($A80,R$8,R$11))","v":0},"W",0,"W"]
["17:00:00",{"$f":"(0.75*B$18*FLOOR(B$20,0.05)*0.9*B$35*B$38*o_Isol_Bij_Tijdstip($A81,B$8,B$11))+(0.75*D$18*FLOOR(D$20,0.05)*0.9*D$35*D$38*o_Isol_Bij_Tijdstip($A81,B$8,B$11))","v":0},"W",null,null,{"$f":"(0.75*F$18*FLOOR(F$20,0.05)*0.9*F$35*F$38*o_Isol_Bij_Tijdstip($A81,F$8,F$11))+(0.75*H$18*FLOOR(H$20,0.05)*0.9*H$35*H$38*o_Isol_Bij_Tijdstip($A81,F$8,F$11))","v":0},"W",null,null,{"$f":"(0.75*J$18*FLOOR(J$20,0.05)*0.9*J$35*J$38*o_Isol_Bij_Tijdstip($A81,J$8,J$11))+(0.75*L$18*FLOOR(L$20,0.05)*0.9*L$35*L$38*o_Isol_Bij_Tijdstip($A81,J$8,J$11))","v":0},"W",null,null,{"$f":"(0.75*N$18*FLOOR(N$20,0.05)*0.9*N$35*N$38*o_Isol_Bij_Tijdstip($A81,N$8,N$11))+(0.75*P$18*FLOOR(P$20,0.05)*0.9*P$35*P$38*o_Isol_Bij_Tijdstip($A81,N$8,N$11))","v":0},"W",null,null,{"$f":"(0.75*R$18*FLOOR(R$20,0.05)*0.9*R$35*R$38*o_Isol_Bij_Tijdstip($A81,R$8,R$11))+(0.75*T$18*FLOOR(T$20,0.05)*0.9*T$35*T$38*o_Isol_Bij_Tijdstip($A81,R$8,R$11))","v":0},"W",0,"W"]
["18:00:00",{"$f":"(0.75*B$18*FLOOR(B$20,0.05)*0.9*B$35*B$38*o_Isol_Bij_Tijdstip($A82,B$8,B$11))+(0.75*D$18*FLOOR(D$20,0.05)*0.9*D$35*D$38*o_Isol_Bij_Tijdstip($A82,B$8,B$11))","v":0},"W",null,null,{"$f":"(0.75*F$18*FLOOR(F$20,0.05)*0.9*F$35*F$38*o_Isol_Bij_Tijdstip($A82,F$8,F$11))+(0.75*H$18*FLOOR(H$20,0.05)*0.9*H$35*H$38*o_Isol_Bij_Tijdstip($A82,F$8,F$11))","v":0},"W",null,null,{"$f":"(0.75*J$18*FLOOR(J$20,0.05)*0.9*J$35*J$38*o_Isol_Bij_Tijdstip($A82,J$8,J$11))+(0.75*L$18*FLOOR(L$20,0.05)*0.9*L$35*L$38*o_Isol_Bij_Tijdstip($A82,J$8,J$11))","v":0},"W",null,null,{"$f":"(0.75*N$18*FLOOR(N$20,0.05)*0.9*N$35*N$38*o_Isol_Bij_Tijdstip($A82,N$8,N$11))+(0.75*P$18*FLOOR(P$20,0.05)*0.9*P$35*P$38*o_Isol_Bij_Tijdstip($A82,N$8,N$11))","v":0},"W",null,null,{"$f":"(0.75*R$18*FLOOR(R$20,0.05)*0.9*R$35*R$38*o_Isol_Bij_Tijdstip($A82,R$8,R$11))+(0.75*T$18*FLOOR(T$20,0.05)*0.9*T$35*T$38*o_Isol_Bij_Tijdstip($A82,R$8,R$11))","v":0},"W",0,"W"]
[]
["Maatgevende tijdstip",{"$f":"IF(MAX(T73:T82)=0,\"Geen glas aanwezig\",_xlfn.XLOOKUP(MAX(T73:T82),T73:T82,A73:A82,\"nvt\"))","v":"Geen glas aanwezig"}]

{"sheet":"Ruimte 9","index":11,"n_rows":84,"n_cols":21,"rows_kept":84,"cut":false,"hidden":false,"merged":[[66,0,67,20],[0,0,0,20],[6,1,6,3],[6,5,6,7],[6,9,6,11],[6,13,6,15],[6,17,6,20],[41,1,41,3],[41,5,41,7],[41,9,41,11],[41,13,41,15],[41,17,41,19],[40,1,40,3],[40,5,40,7],[40,9,40,11],[40,13,40,15],[40,17,40,19],[55,1,55,3],[55,5,55,7],[55,9,55,11],[55,13,55,15],[55,17,55,19],[54,1,54,3],[54,5,54,7],[54,9,54,11],[54,13,54,15],[54,17,54,19],[56,5,56,7],[56,9,56,11],[56,13,56,15],[56,17,56,19],[57,1,57,3],[57,5,57,7],[57,9,57,11],[57,13,57,15],[57,17,57,19],[59,1,59,3],[60,1,60,3],[62,1,62,3],[63,1,63,3],[56,1,56,3]]}
["RUIMTE 9"]
[]
["Ruimtenaam",0]
["Type verblijfsruimte","Andere verblijfsruimte"]
["Vloeroppervlak verblijfsruimte Avr  (gebruiksoppervlak)",0,"m²"]
[]
[null,"Voorzijde woning",null,null,null,"Linker zijde woning",null,null,null,"Achterzijde woning",null,null,null,"Rechter zijde woning",null,null,null,"Platdak"]
["Orientatie gevel / dakvlak (Helling > 15°C)",{"$f":"Invoerblad!$B$17","v":"Noord"},null,null,null,{"$f":"o_Orientatie(F9)","v":"Oost"},null,null,null,{"$f":"o_Orientatie(J9)","v":"Zuid"},null,null,null,{"$f":"o_Orientatie(N9)","v":"West"},null,null,null,"Horizontaal"]
["Orientatiehoek gevel Ƴ",{"$f":"o_OrientatiehOEK(B8)","v":0},null,null,null,{"$f":"IF(B9+90>360,B9+90-360,B9+90)","v":90},null,null,null,{"$f":"IF(F9+90>360,F9+90-360,F9+90)","v":180},null,null,null,{"$f":"IF(J9+90>360,J9+90-360,J9+90)","v":270}]
["Grenst aan buitenlucht ja of nee","Ja",null,null,null,"Ja",null,null,null,"Ja",null,null,null,"Ja",null,null,null,"Ja"]
["Hellingshoek constructie ≥ 15° = hellenddak 90° = gevel",90,"°",null,null,90,"°",null,null,90,"°",null,null,90,"°",null,null,10,"°"]
["Type constructie",{"$f":"o_TypeConstructie(B10,B11)","v":"Buitengevel"},null,null,null,{"$f":"o_TypeConstructie(F10,F11)","v":"Buitengevel"},null,null,null,{"$f":"o_TypeConstructie(J10,J11)","v":"Buitengevel"},null,null,null,{"$f":"o_TypeConstructie(N10,N11)","v":"Buitengevel"},null,null,null,{"$f":"o_TypeConstructie(R10,R11)","v":"Platdak <15°"}]
["Gevel lengte (binnenwerks)",0,"m",null,null,0,"m",null,null,0,"m",null,null,0,"m",null,null,0,"m"]
["Gevel hoogte / Dak breedte (binnenwerks)",0,"m",null,null,0,"m",null,null,0,"m",null,null,0,"m",null,null,0,"m"]
["Constructie oppervlak (binnenwerks)",{"$f":"B13*B14","v":0},"m²",null,null,{"$f":"F13*F14","v":0},"m²",null,null,{"$f":"J13*J14","v":0},"m²",null,null,{"$f":"N13*N14","v":0},"m²",null,null,{"$f":"R13*R14","v":0},"m²"]
["Gesloten constructie oppervlak",{"$f":"MAX(0,B15-B18-D18)","v":0},"m²",null,null,{"$f":"MAX(0,F15-F18-H18)","v":0},"m²",null,null,{"$f":"MAX(0,J15-J18-L18)","v":0},"m²",null,null,{"$f":"MAX(0,N15-N18-P18)","v":0},"m²",null,null,{"$f":"MAX(0,R15-R18-T18)","v":0},"m²"]
[null,"Glasvlak type 1",null,"Glasvlak type 2",null,"Glasvlak type 1",null,"Glasvlak type 2",null,"Glasvlak type 1",null,"Glasvlak type 2",null,"Glasvlak type 1",null,"Glasvlak type 2",null,"Glasvlak type 1",null,"Glasvlak type 2"]
["Totaal oppervlak van raamtype Aw,k (inclusief kozijn)",0,"m²",0,"m²",0,"m²",0,"m²",0,"m²",0,"m²",0,"m²",0,"m²",0,"m²",0,"m²"]
["Warmtedoorgangscoefficient (U-waarde) van het raam Uw;wi;k",1.6,"W/m².K",1.6,"W/m².K",1.6,"W/m².K",1.6,"W/m².K",1.6,"W/m².K",1.6,"W/m².K",1.6,"W/m².K",1.6,"W/m².K",1.6,"W/m².K",1.6,"W/m².K"]
["Zontoetredingsfactor (g_waarde) van het glas Ggl;n;wi;k;C;juli",1,null,1,null,1,null,1,null,1,null,1,null,1,null,1,null,1,null,1]
["Beschaduwing situatie bij het raamtype","Minimale belemmering",null,"Minimale belemmering",null,"Minimale belemmering",null,"Minimale belemmering",null,"Minimale belemmering",null,"Minimale belemmering",null,"Minimale belemmering",null,"Minimale belemmering",null,"Minimale belemmering",null,"Minimale belemmering"]
[]
[null,"Overstek",null,"Overstek",null,"Overstek",null,"Overstek",null,"Overstek",null,"Overstek",null,"Overstek",null,"Overstek"]
["Hoogte verschil midden raam onderzijde overstek",0,"m",0,"m",0,"m",0,"m",0,"m",0,"m",0,"m",0,"m",0,null,null,"m"]
["Horizontale afstand glas tot eindpunt overstek",0,"m",0,"m",0,"m",0,"m",0,"m",0,"m",0,"m",0,"m",0,null,null,"m"]
["Overstekhoek",{"$f":"IFERROR(180/PI()*ATAN(B24/B25),0)","v":0},"°",{"$f":"IFERROR(180/PI()*ATAN(D24/D25),0)","v":0},"°",{"$f":"IFERROR(180/PI()*ATAN(F24/F25),0)","v":0},"°",{"$f":"IFERROR(180/PI()*ATAN(H24/H25),0)","v":0},"°",{"$f":"IFERROR(180/PI()*ATAN(J24/J25),0)","v":0},"°",{"$f":"IFERROR(180/PI()*ATAN(L24/L25),0)","v":0},"°",{"$f":"IFERROR(180/PI()*ATAN(N24/N25),0)","v":0},"°",{"$f":"IFERROR(180/PI()*ATAN(P24/P25),0)","v":0},"°",null,null,null,"°"]
["Relatieve hoogte van overstek",{"$f":"IFERROR(B24/B25,1)","v":1},null,{"$f":"IFERROR(D24/D25,1)","v":1},null,{"$f":"IFERROR(F24/F25,1)","v":1},null,{"$f":"IFERROR(H24/H25,1)","v":1},null,{"$f":"IFERROR(J24/J25,1)","v":1},null,{"$f":"IFERROR(L24/L25,1)","v":1},null,{"$f":"IFERROR(N24/N25,1)","v":1},null,{"$f":"IFERROR(P24/P25,1)","v":1}]
[]
[null,"Zijbelemmering",null,"Zijbelemmering",null,"Zijbelemmering",null,"Zijbelemmering",null,"Zijbelemmering",null,"Zijbelemmering",null,"Zijbelemmering",null,"Zijbelemmering"]
["Positie zijbelemmering irt zichtveld (naar buitengericht)","Links",null,"Links",null,"Links",null,"Links",null,"Links",null,"Links",null,"Links",null,"Links"]
["Horizontale afstand midden raam verste punt belemmering",0,"m",0,"m",null,"m",null,"m",null,"m",1,"m",null,"m",null,"m",null,null,null,"m"]
["Horizontale breedte glas tot eindpunt belemmering",0,"m",0,"m",null,"m",null,"m",null,"m",null,"m",null,"m",null,"m",null,null,null,"m"]
["Relatieve breedte van de zijbelemmering bb",{"$f":"IFERROR(B31/B32,999)","v":999},null,{"$f":"IFERROR(D31/D32,999)","v":999},null,{"$f":"IFERROR(F31/F32,999)","v":999},null,{"$f":"IFERROR(H31/H32,999)","v":999},null,{"$f":"IFERROR(J31/J32,999)","v":999},null,{"$f":"IFERROR(L31/L32,999)","v":999},null,{"$f":"IFERROR(N31/N32,999)","v":999},null,{"$f":"IFERROR(P31/P32,999)","v":999}]
[]
["De beschaduwingsreductiefactor Fsh;obst;wi;k;juli",{"$f":"IFERROR(o_Beschaduwingreductie(B21,B8,B27,B30,B33,B11),1)","v":1},null,{"$f":"IFERROR(o_Beschaduwingreductie(D21,B8,D27,D30,D33,B11),1)","v":1},null,{"$f":"IFERROR(o_Beschaduwingreductie(F21,F8,F27,F30,F33,F11),1)","v":1},null,{"$f":"IFERROR(o_Beschaduwingreductie(H21,F8,H27,H30,H33,F11),1)","v":1},null,{"$f":"IFERROR(o_Beschaduwingreductie(J21,J8,J27,J30,J33,J11),1)","v":1},null,{"$f":"IFERROR(o_Beschaduwingreductie(L21,J8,L27,L30,L33,J11),1)","v":1},null,{"$f":"IFERROR(o_Beschaduwingreductie(N21,N8,N27,N30,N33,N11),1)","v":1},null,{"$f":"IFERROR(o_Beschaduwingreductie(P21,N8,P27,P30,P33,N11),1)","v":1},null,{"$f":"o_Beschaduwingreductie(R21,R8,R27,R30,R33,R11)","v":1},null,{"$f":"o_Beschaduwingreductie(T21,R8,T27,T30,T33,R11)","v":1}]
[]
["Type zonwering","Geen zonwering",null,"Geen zonwering",null,"Geen zonwering",null,"Geen zonwering",null,"Geen zonwering",null,"Geen zonwering",null,"Geen zonwering",null,"Geen zonwering",null,"Geen zonwering",null,"Geen zonwering"]
["De reductiefactor voor zonwering Fc;wi;k",{"$f":"o_Zonweringreductie(B37,B8)","v":1},null,{"$f":"o_Zonweringreductie(D37,B8)","v":1},null,{"$f":"o_Zonweringreductie(F37,F8)","v":1},null,{"$f":"o_Zonweringreductie(H37,F8)","v":1},null,{"$f":"o_Zonweringreductie(J37,J8)","v":1},null,{"$f":"o_Zonweringreductie(L37,J8)","v":1},null,{"$f":"o_Zonweringreductie(N37,N8)","v":1},null,{"$f":"o_Zonweringreductie(P37,N8)","v":1},null,{"$f":"o_Zonweringreductie(R37,R8)","v":1},null,{"$f":"o_Zonweringreductie(T37,R8)","v":1}]
["Totaal opvallende zonnestraling van het raam Isol;wi;k;juli",{"$f":"IF(B10=\"Nee\",0,o_Isol_Bij_Tijdstip($B$52,B8,B11))","v":102.18873424043244},"W/m²",{"$f":"IF(B10=\"Nee\",0,o_Isol_Bij_Tijdstip($B$52,B8,B11))","v":102.18873424043244},"W/m²",{"$f":"IF(F10=\"Nee\",0,o_Isol_Bij_Tijdstip($B$52,F8,F11))","v":84.062269883674873},"W/m²",{"$f":"IF(F10=\"Nee\",0,o_Isol_Bij_Tijdstip($B$52,F8,F11))","v":84.062269883674873},"W/m²",{"$f":"IF(J10=\"Nee\",0,o_Isol_Bij_Tijdstip($B$52,J8,J11))","v":84.062269883674873},"W/m²",{"$f":"IF(J10=\"Nee\",0,o_Isol_Bij_Tijdstip($B$52,J8,J11))","v":84.062269883674873},"W/m²",{"$f":"IF(N10=\"Nee\",0,o_Isol_Bij_Tijdstip($B$52,N8,N11))","v":741.75809294382429},"W/m²",{"$f":"IF(N10=\"Nee\",0,o_Isol_Bij_Tijdstip($B$52,N8,N11))","v":741.75809294382429},"W/m²",{"$f":"IF(R10=\"Nee\",0,o_Isol_Bij_Tijdstip($B$52,R8,R11))","v":408.30602418254711},"W/m²",{"$f":"IF(R10=\"Nee\",0,o_Isol_Bij_Tijdstip($B$52,R8,R11))","v":408.30602418254711},"W/m²"]
[]
["Tijdstip maximale koellastbijdrage tmax;zi",{"$f":"VALUE(o_Tijdstip_Isol_Max_Orientatie(B8,B11))","v":"15:00:00"},null,null,null,{"$f":"VALUE(o_Tijdstip_Isol_Max_Orientatie(F8,F11))","v":"09:00:00"},null,null,null,{"$f":"VALUE(o_Tijdstip_Isol_Max_Orientatie(J8,J11))","v":"14:00:00"},null,null,null,{"$f":"VALUE(o_Tijdstip_Isol_Max_Orientatie(N8,N11))","v":"18:00:00"},null,null,null,{"$f":"o_Tijdstip_Isol_Max_Orientatie(R8,R11)","v":"16:00:00"}]
["Buitenluchttemperatuur op tijdstip max koellast Θe",{"$f":"o_maxTemp(VALUE(B41))","v":29.8},null,null,"°C",{"$f":"o_maxTemp(VALUE(F41))","v":24.7},null,null,"°C",{"$f":"o_maxTemp(VALUE(J41))","v":29.9},null,null,"°C",{"$f":"o_maxTemp(VALUE(N41))","v":30.1},null,null,"°C",{"$f":"o_maxTemp(VALUE(R41))","v":30.4}]
[]
["Glasopppervlak",{"$f":"IF(B10=\"Ja\",B18+D18,0)","v":0},"m²",null,null,{"$f":"IF(F10=\"Ja\",F18+H18,0)","v":0},"m²",null,null,{"$f":"IF(J10=\"Ja\",J18+L18,0)","v":0},"m²",null,null,{"$f":"IF(N10=\"Ja\",N18+P18,0)","v":0},"m²",null,null,{"$f":"IF(R10=\"Ja\",R18+T18,0)","v":0},"m²"]
["Uitwendigescheidingsconstructie niet op Noord?",{"$f":"IF(B10=\"Ja\",IF(B8=\"Noord\",FALSE,TRUE),FALSE)","v":false},null,null,null,{"$f":"IF(F10=\"Ja\",IF(F8=\"Noord\",FALSE,TRUE),FALSE)","v":true},null,null,null,{"$f":"IF(J10=\"Ja\",IF(J8=\"Noord\",FALSE,TRUE),FALSE)","v":true},null,null,null,{"$f":"IF(N10=\"Ja\",IF(N8=\"Noord\",FALSE,TRUE),FALSE)","v":true},null,null,null,{"$f":"IF(R10=\"Ja\",IF(R8=\"Noord\",FALSE,TRUE),FALSE)","v":true}]
["De enige uitwendigescheidingscontructie?",{"$f":"IF(AND(B45=TRUE,COUNTIF($B$45:$R$45,TRUE)=1),TRUE,FALSE)","v":false},null,null,null,{"$f":"IF(AND(F45=TRUE,COUNTIF($B$45:$R$45,TRUE)=1),TRUE,FALSE)","v":false},null,null,null,{"$f":"IF(AND(J45=TRUE,COUNTIF($B$45:$R$45,TRUE)=1),TRUE,FALSE)","v":false},null,null,null,{"$f":"IF(AND(N45=TRUE,COUNTIF($B$45:$R$45,TRUE)=1),TRUE,FALSE)","v":false},null,null,null,{"$f":"IF(AND(R45=TRUE,COUNTIF($B$45:$R$45,TRUE)=1),TRUE,FALSE)","v":false}]
["Totaal glasoppervlak",{"$f":"IF(B8<>\"Noord\",B44,0)","v":0},"m²",null,null,{"$f":"IF(F8<>\"Noord\",F44,0)","v":0},"m²",null,null,{"$f":"IF(J8<>\"Noord\",J44,0)","v":0},"m²",null,null,{"$f":"IF(N8<>\"Noord\",N44,0)","v":0},"m²",null,null,{"$f":"R44","v":0},"m²"]
["Grootste glasoppervlak ",{"$f":"IF(AND(B45,B47=MAX($B$47:$R$47)),TRUE,FALSE)","v":false},null,null,null,{"$f":"IF(AND(F45,F47=MAX($B$47:$R$47)),TRUE,FALSE)","v":true},null,null,null,{"$f":"IF(AND(J45,J47=MAX($B$47:$R$47)),TRUE,FALSE)","v":true},null,null,null,{"$f":"IF(AND(N45,N47=MAX($B$47:$R$47)),TRUE,FALSE)","v":true},null,null,null,{"$f":"IF(AND(R45,R47=MAX($B$47:$R$47)),TRUE,FALSE)","v":true}]
["Dakvlak maatgevend?",{"$f":"IF(AND(B11<90,B15>3*(B18+D18),Invoerblad!$B$25<65),TRUE,FALSE)","v":false},null,null,null,{"$f":"IF(AND(F11<90,F15>3*(F18+H18),Invoerblad!$B$25<65),TRUE,FALSE)","v":false},null,null,null,{"$f":"IF(AND(J11<90,J15>3*(J18+L18),Invoerblad!$B$25<65),TRUE,FALSE)","v":false},null,null,null,{"$f":"IF(AND(N11<90,N15>3*(N18+P18),Invoerblad!$B$25<65),TRUE,FALSE)","v":false},null,null,null,{"$f":"IF(AND(R11<90,R15>3*(R18+T18),Invoerblad!$B$25<65),TRUE,FALSE)","v":false}]
["is er een maatgevend dakoppervlak",{"$f":"IF(COUNTIF($B$49:$R$49,TRUE)>0,TRUE,FALSE)","v":false},null,null,null,{"$f":"IF(COUNTIF($B$49:$R$49,TRUE)>0,TRUE,FALSE)","v":false},null,null,null,{"$f":"IF(COUNTIF($B$49:$R$49,TRUE)>0,TRUE,FALSE)","v":false},null,null,null,{"$f":"IF(COUNTIF($B$49:$R$49,TRUE)>0,TRUE,FALSE)","v":false},null,null,null,{"$f":"IF(COUNTIF($B$49:$R$49,TRUE)>0,TRUE,FALSE)","v":false}]
["Maatgevende tijdstip",{"$f":"IF(OR(B46,AND(B45,B50,B49),AND(B45,B48,NOT(B50))),B41)","v":false},null,null,null,{"$f":"IF(OR(F46,AND(F45,F50,F49),AND(F45,F48,NOT(F50))),F41)","v":"09:00:00"},null,null,null,{"$f":"IF(OR(J46,AND(J45,J50,J49),AND(J45,J48,NOT(J50))),J41)","v":"14:00:00"},null,null,null,{"$f":"IF(OR(N46,AND(N45,N50,N49),AND(N45,N48,NOT(N50))),N41)","v":"18:00:00"},null,null,null,{"$f":"IF(OR(R46,AND(R45,R50,R49),AND(R45,R48,NOT(R50))),R41)","v":"16:00:00"}]
["Maatgevende tijdstip tmax;zi",{"$f":"IFERROR(B84,\"geen glas ingevoerd\")","v":"Geen glas aanwezig"}]
["Buitenluchttemperatuur op tijdstip max koellast Θe",{"$f":"o_maxTemp(VALUE(B52))","v":""},"°C"]
[]
["Koellastbijdrage transmissie transparante delen Ptr;gl;vr;zi",{"$f":"IF(B10=\"Nee\",0,B16*Invoerblad!$B$16)","v":0},null,null,"W",{"$f":"IF(F10=\"Nee\",0,F16*Invoerblad!$B$16)","v":0},null,null,"W",{"$f":"IF(J10=\"Nee\",0,J16*Invoerblad!$B$16)","v":0},null,null,"W",{"$f":"IF(N10=\"Nee\",0,N16*Invoerblad!$B$16)","v":0},null,null,"W",{"$f":"IF(R10=\"Nee\",0,R16*Invoerblad!$B$16)","v":0},null,null,"W"]
["Koellastbijdrage zoninstraling transparante delen Psol;vr;zi",{"$f":"(0.75*B18*FLOOR(B20,0.05)*0.9*B35*B38*B39)+(0.75*D18*FLOOR(D20,0.05)*0.9*D35*D38*D39)","v":0},null,null,"W",{"$f":"(0.75*F18*FLOOR(F20,0.05)*0.9*F35*F38*F39)+(0.75*H18*FLOOR(H20,0.05)*0.9*H35*H38*H39)","v":0},null,null,"W",{"$f":"(0.75*J18*FLOOR(J20,0.05)*0.9*J35*J38*J39)+(0.75*L18*FLOOR(L20,0.05)*0.9*L35*L38*L39)","v":0},null,null,"W",{"$f":"(0.75*N18*FLOOR(N20,0.05)*0.9*N35*N38*N39)+(0.75*P18*FLOOR(P20,0.05)*0.9*P35*P38*P39)","v":0},null,null,"W",{"$f":"(0.75*R18*FLOOR(R20,0.05)*0.9*R35*R38*R39)+(0.75*T18*FLOOR(T20,0.05)*0.9*T35*T38*T39)","v":0},null,null,"W"]
["Koellastbijdrage transmissie transparante delen Ptr;gl;vr;zi",{"$f":"IF(B10=\"Nee\",0,IFERROR(B18*B19*($B$53-24),0)+IFERROR(D18*D19*($B$53-24),0))","v":0},null,null,"W",{"$f":"IF(F10=\"Nee\",0,IFERROR(F18*F19*($B$53-24),0)+IFERROR(H18*H19*($B$53-24),0))","v":0},null,null,"W",{"$f":"IF(J10=\"Nee\",0,IFERROR(J18*J19*($B$53-24),0)+IFERROR(L18*L19*($B$53-24),0))","v":0},null,null,"W",{"$f":"IF(N10=\"Nee\",0,IFERROR(N18*N19*($B$53-24),0)+IFERROR(P18*P19*($B$53-24),0))","v":0},null,null,"W",{"$f":"IF(R10=\"Nee\",0,IFERROR(R18*R19*($B$53-24),0)+IFERROR(T18*T19*($B$53-24),0))","v":0},null,null,"W"]
["Totaal koellastbijdrage per gevel",{"$f":"SUM(B55:D57)","v":0},null,null,"W",{"$f":"SUM(F55:H57)","v":0},null,null,"W",{"$f":"SUM(J55:L57)","v":0},null,null,"W",{"$f":"SUM(N55:P57)","v":0},null,null,"W",{"$f":"SUM(R55:R57)","v":0},null,null,"W"]
[]
["Koellast door interne warmtelast Pint;calc;woon/overig;zi",{"$f":"IF(B5=0,0,IF(B4=\"Woonvertrek\",2*Invoerblad!$B$40*B5,Invoerblad!$B$40*B5))","v":0},null,null,"W"]
["Koellast door buitenluchttoetreding Pv;calc;vr;zi",{"$f":"IFERROR(MAX((SUM(Invoerblad!$B$28:$B$30)/3600*1.205*1005*(B53-24))/SUM(Invoerblad!$B$47:$T$47)*B5,0),0)","v":0},{"$f":"IFERROR(MAX(SUM(C57:C59)/3600*1.205*1005*(C60-24),0),0)","v":0},{"$f":"IFERROR(MAX(SUM(D57:D59)/3600*1.205*1005*(D60-24),0),0)","v":0},"W"]
[]
["Totaal koellastbijdrage",{"$f":"IFERROR(SUM(B58:T58)+B60+B61,0)","v":0},null,null,"W"]
["Koelbehoefte verblijfsruimte",{"$f":"IFERROR(B63/B5,0)","v":0},null,null,"W/m²"]
[]
[]
["Onderstaande tabellen worden verborgen in de uiteindelijke versie. De tabellen dienen om vast te stellen welk tijdstip tot de hoogste zonbelasting leidt"]
[]
["Isol max voor de orientatie",{"$f":"o_Isol_Max_Orientatie(B8,B11)","v":143.73988086183414},"W/m²",null,null,{"$f":"o_Isol_Max_Orientatie(F8,F11)","v":845.32772366250799},"W/m²",null,null,{"$f":"o_Isol_Max_Orientatie(J8,J11)","v":740.05836254715712},"W/m²",null,null,{"$f":"o_Isol_Max_Orientatie(N8,N11)","v":741.75809294382429},"W/m²",null,null,{"$f":"o_Isol_Max_Orientatie(R8,R11)","v":914.16092603772574},"W/m²"]
["Tijdstip bij Isol max bij orientatie",{"$f":"VALUE(o_Tijdstip_Isol_Max_Orientatie(B8,B11))","v":"15:00:00"},null,null,null,{"$f":"VALUE(o_Tijdstip_Isol_Max_Orientatie(F8,F11))","v":"09:00:00"},null,null,null,{"$f":"VALUE(o_Tijdstip_Isol_Max_Orientatie(J8,J11))","v":"14:00:00"},null,null,null,{"$f":"VALUE(o_Tijdstip_Isol_Max_Orientatie(N8,N11))","v":"18:00:00"},null,null,null,{"$f":"VALUE(o_Tijdstip_Isol_Max_Orientatie(R8,R11))","v":"16:00:00"}]
[]
["Koellastbijdrage zoninstraling transparante delen Psol;vr;zi"]
["09:00:00",{"$f":"(0.75*B$18*FLOOR(B$20,0.05)*0.9*B$35*B$38*o_Isol_Bij_Tijdstip($A73,B$8,B$11))+(0.75*D$18*FLOOR(D$20,0.05)*0.9*D$35*D$38*o_Isol_Bij_Tijdstip($A73,B$8,B$11))","v":0},"W",null,null,{"$f":"(0.75*F$18*FLOOR(F$20,0.05)*0.9*F$35*F$38*o_Isol_Bij_Tijdstip($A73,F$8,F$11))+(0.75*H$18*FLOOR(H$20,0.05)*0.9*H$35*H$38*o_Isol_Bij_Tijdstip($A73,F$8,F$11))","v":0},"W",null,null,{"$f":"(0.75*J$18*FLOOR(J$20,0.05)*0.9*J$35*J$38*o_Isol_Bij_Tijdstip($A73,J$8,J$11))+(0.75*L$18*FLOOR(L$20,0.05)*0.9*L$35*L$38*o_Isol_Bij_Tijdstip($A73,J$8,J$11))","v":0},"W",null,null,{"$f":"(0.75*N$18*FLOOR(N$20,0.05)*0.9*N$35*N$38*o_Isol_Bij_Tijdstip($A73,N$8,N$11))+(0.75*P$18*FLOOR(P$20,0.05)*0.9*P$35*P$38*o_Isol_Bij_Tijdstip($A73,N$8,N$11))","v":0},"W",null,null,{"$f":"(0.75*R$18*FLOOR(R$20,0.05)*0.9*R$35*R$38*o_Isol_Bij_Tijdstip($A73,R$8,R$11))+(0.75*T$18*FLOOR(T$20,0.05)*0.9*T$35*T$38*o_Isol_Bij_Tijdstip($A73,R$8,R$11))","v":0},"W",{"$f":"B73+F73+J73+N73+R73","v":0},"W"]
["10:00:00",{"$f":"(0.75*B$18*FLOOR(B$20,0.05)*0.9*B$35*B$38*o_Isol_Bij_Tijdstip($A74,B$8,B$11))+(0.75*D$18*FLOOR(D$20,0.05)*0.9*D$35*D$38*o_Isol_Bij_Tijdstip($A74,B$8,B$11))","v":0},"W",null,null,{"$f":"(0.75*F$18*FLOOR(F$20,0.05)*0.9*F$35*F$38*o_Isol_Bij_Tijdstip($A74,F$8,F$11))+(0.75*H$18*FLOOR(H$20,0.05)*0.9*H$35*H$38*o_Isol_Bij_Tijdstip($A74,F$8,F$11))","v":0},"W",null,null,{"$f":"(0.75*J$18*FLOOR(J$20,0.05)*0.9*J$35*J$38*o_Isol_Bij_Tijdstip($A74,J$8,J$11))+(0.75*L$18*FLOOR(L$20,0.05)*0.9*L$35*L$38*o_Isol_Bij_Tijdstip($A74,J$8,J$11))","v":0},"W",null,null,{"$f":"(0.75*N$18*FLOOR(N$20,0.05)*0.9*N$35*N$38*o_Isol_Bij_Tijdstip($A74,N$8,N$11))+(0.75*P$18*FLOOR(P$20,0.05)*0.9*P$35*P$38*o_Isol_Bij_Tijdstip($A74,N$8,N$11))","v":0},"W",null,null,{"$f":"(0.75*R$18*FLOOR(R$20,0.05)*0.9*R$35*R$38*o_Isol_Bij_Tijdstip($A74,R$8,R$11))+(0.75*T$18*FLOOR(T$20,0.05)*0.9*T$35*T$38*o_Isol_Bij_Tijdstip($A74,R$8,R$11))","v":0},"W",0,"W"]
["11:00:00",{"$f":"(0.75*B$18*FLOOR(B$20,0.05)*0.9*B$35*B$38*o_Isol_Bij_Tijdstip($A75,B$8,B$11))+(0.75*D$18*FLOOR(D$20,0.05)*0.9*D$35*D$38*o_Isol_Bij_Tijdstip($A75,B$8,B$11))","v":0},"W",null,null,{"$f":"(0.75*F$18*FLOOR(F$20,0.05)*0.9*F$35*F$38*o_Isol_Bij_Tijdstip($A75,F$8,F$11))+(0.75*H$18*FLOOR(H$20,0.05)*0.9*H$35*H$38*o_Isol_Bij_Tijdstip($A75,F$8,F$11))","v":0},"W",null,null,{"$f":"(0.75*J$18*FLOOR(J$20,0.05)*0.9*J$35*J$38*o_Isol_Bij_Tijdstip($A75,J$8,J$11))+(0.75*L$18*FLOOR(L$20,0.05)*0.9*L$35*L$38*o_Isol_Bij_Tijdstip($A75,J$8,J$11))","v":0},"W",null,null,{"$f":"(0.75*N$18*FLOOR(N$20,0.05)*0.9*N$35*N$38*o_Isol_Bij_Tijdstip($A75,N$8,N$11))+(0.75*P$18*FLOOR(P$20,0.05)*0.9*P$35*P$38*o_Isol_Bij_Tijdstip($A75,N$8,N$11))","v":0},"W",null,null,{"$f":"(0.75*R$18*FLOOR(R$20,0.05)*0.9*R$35*R$38*o_Isol_Bij_Tijdstip($A75,R$8,R$11))+(0.75*T$18*FLOOR(T$20,0.05)*0.9*T$35*T$38*o_Isol_Bij_Tijdstip($A75,R$8,R$11))","v":0},"W",0,"W"]
["12:00:00",{"$f":"(0.75*B$18*FLOOR(B$20,0.05)*0.9*B$35*B$38*o_Isol_Bij_Tijdstip($A76,B$8,B$11))+(0.75*D$18*FLOOR(D$20,0.05)*0.9*D$35*D$38*o_Isol_Bij_Tijdstip($A76,B$8,B$11))","v":0},"W",null,null,{"$f":"(0.75*F$18*FLOOR(F$20,0.05)*0.9*F$35*F$38*o_Isol_Bij_Tijdstip($A76,F$8,F$11))+(0.75*H$18*FLOOR(H$20,0.05)*0.9*H$35*H$38*o_Isol_Bij_Tijdstip($A76,F$8,F$11))","v":0},"W",null,null,{"$f":"(0.75*J$18*FLOOR(J$20,0.05)*0.9*J$35*J$38*o_Isol_Bij_Tijdstip($A76,J$8,J$11))+(0.75*L$18*FLOOR(L$20,0.05)*0.9*L$35*L$38*o_Isol_Bij_Tijdstip($A76,J$8,J$11))","v":0},"W",null,null,{"$f":"(0.75*N$18*FLOOR(N$20,0.05)*0.9*N$35*N$38*o_Isol_Bij_Tijdstip($A76,N$8,N$11))+(0.75*P$18*FLOOR(P$20,0.05)*0.9*P$35*P$38*o_Isol_Bij_Tijdstip($A76,N$8,N$11))","v":0},"W",null,null,{"$f":"(0.75*R$18*FLOOR(R$20,0.05)*0.9*R$35*R$38*o_Isol_Bij_Tijdstip($A76,R$8,R$11))+(0.75*T$18*FLOOR(T$20,0.05)*0.9*T$35*T$38*o_Isol_Bij_Tijdstip($A76,R$8,R$11))","v":0},"W",0,"W"]
["13:00:00",{"$f":"(0.75*B$18*FLOOR(B$20,0.05)*0.9*B$35*B$38*o_Isol_Bij_Tijdstip($A77,B$8,B$11))+(0.75*D$18*FLOOR(D$20,0.05)*0.9*D$35*D$38*o_Isol_Bij_Tijdstip($A77,B$8,B$11))","v":0},"W",null,null,{"$f":"(0.75*F$18*FLOOR(F$20,0.05)*0.9*F$35*F$38*o_Isol_Bij_Tijdstip($A77,F$8,F$11))+(0.75*H$18*FLOOR(H$20,0.05)*0.9*H$35*H$38*o_Isol_Bij_Tijdstip($A77,F$8,F$11))","v":0},"W",null,null,{"$f":"(0.75*J$18*FLOOR(J$20,0.05)*0.9*J$35*J$38*o_Isol_Bij_Tijdstip($A77,J$8,J$11))+(0.75*L$18*FLOOR(L$20,0.05)*0.9*L$35*L$38*o_Isol_Bij_Tijdstip($A77,J$8,J$11))","v":0},"W",null,null,{"$f":"(0.75*N$18*FLOOR(N$20,0.05)*0.9*N$35*N$38*o_Isol_Bij_Tijdstip($A77,N$8,N$11))+(0.75*P$18*FLOOR(P$20,0.05)*0.9*P$35*P$38*o_Isol_Bij_Tijdstip($A77,N$8,N$11))","v":0},"W",null,null,{"$f":"(0.75*R$18*FLOOR(R$20,0.05)*0.9*R$35*R$38*o_Isol_Bij_Tijdstip($A77,R$8,R$11))+(0.75*T$18*FLOOR(T$20,0.05)*0.9*T$35*T$38*o_Isol_Bij_Tijdstip($A77,R$8,R$11))","v":0},"W",0,"W"]
["14:00:00",{"$f":"(0.75*B$18*FLOOR(B$20,0.05)*0.9*B$35*B$38*o_Isol_Bij_Tijdstip($A78,B$8,B$11))+(0.75*D$18*FLOOR(D$20,0.05)*0.9*D$35*D$38*o_Isol_Bij_Tijdstip($A78,B$8,B$11))","v":0},"W",null,null,{"$f":"(0.75*F$18*FLOOR(F$20,0.05)*0.9*F$35*F$38*o_Isol_Bij_Tijdstip($A78,F$8,F$11))+(0.75*H$18*FLOOR(H$20,0.05)*0.9*H$35*H$38*o_Isol_Bij_Tijdstip($A78,F$8,F$11))","v":0},"W",null,null,{"$f":"(0.75*J$18*FLOOR(J$20,0.05)*0.9*J$35*J$38*o_Isol_Bij_Tijdstip($A78,J$8,J$11))+(0.75*L$18*FLOOR(L$20,0.05)*0.9*L$35*L$38*o_Isol_Bij_Tijdstip($A78,J$8,J$11))","v":0},"W",null,null,{"$f":"(0.75*N$18*FLOOR(N$20,0.05)*0.9*N$35*N$38*o_Isol_Bij_Tijdstip($A78,N$8,N$11))+(0.75*P$18*FLOOR(P$20,0.05)*0.9*P$35*P$38*o_Isol_Bij_Tijdstip($A78,N$8,N$11))","v":0},"W",null,null,{"$f":"(0.75*R$18*FLOOR(R$20,0.05)*0.9*R$35*R$38*o_Isol_Bij_Tijdstip($A78,R$8,R$11))+(0.75*T$18*FLOOR(T$20,0.05)*0.9*T$35*T$38*o_Isol_Bij_Tijdstip($A78,R$8,R$11))","v":0},"W",0,"W"]
["15:00:00",{"$f":"(0.75*B$18*FLOOR(B$20,0.05)*0.9*B$35*B$38*o_Isol_Bij_Tijdstip($A79,B$8,B$11))+(0.75*D$18*FLOOR(D$20,0.05)*0.9*D$35*D$38*o_Isol_Bij_Tijdstip($A79,B$8,B$11))","v":0},"W",null,null,{"$f":"(0.75*F$18*FLOOR(F$20,0.05)*0.9*F$35*F$38*o_Isol_Bij_Tijdstip($A79,F$8,F$11))+(0.75*H$18*FLOOR(H$20,0.05)*0.9*H$35*H$38*o_Isol_Bij_Tijdstip($A79,F$8,F$11))","v":0},"W",null,null,{"$f":"(0.75*J$18*FLOOR(J$20,0.05)*0.9*J$35*J$38*o_Isol_Bij_Tijdstip($A79,J$8,J$11))+(0.75*L$18*FLOOR(L$20,0.05)*0.9*L$35*L$38*o_Isol_Bij_Tijdstip($A79,J$8,J$11))","v":0},"W",null,null,{"$f":"(0.75*N$18*FLOOR(N$20,0.05)*0.9*N$35*N$38*o_Isol_Bij_Tijdstip($A79,N$8,N$11))+(0.75*P$18*FLOOR(P$20,0.05)*0.9*P$35*P$38*o_Isol_Bij_Tijdstip($A79,N$8,N$11))","v":0},"W",null,null,{"$f":"(0.75*R$18*FLOOR(R$20,0.05)*0.9*R$35*R$38*o_Isol_Bij_Tijdstip($A79,R$8,R$11))+(0.75*T$18*FLOOR(T$20,0.05)*0.9*T$35*T$38*o_Isol_Bij_Tijdstip($A79,R$8,R$11))","v":0},"W",0,"W"]
["16:00:00",{"$f":"(0.75*B$18*FLOOR(B$20,0.05)*0.9*B$35*B$38*o_Isol_Bij_Tijdstip($A80,B$8,B$11))+(0.75*D$18*FLOOR(D$20,0.05)*0.9*D$35*D$38*o_Isol_Bij_Tijdstip($A80,B$8,B$11))","v":0},"W",null,null,{"$f":"(0.75*F$18*FLOOR(F$20,0.05)*0.9*F$35*F$38*o_Isol_Bij_Tijdstip($A80,F$8,F$11))+(0.75*H$18*FLOOR(H$20,0.05)*0.9*H$35*H$38*o_Isol_Bij_Tijdstip($A80,F$8,F$11))","v":0},"W",null,null,{"$f":"(0.75*J$18*FLOOR(J$20,0.05)*0.9*J$35*J$38*o_Isol_Bij_Tijdstip($A80,J$8,J$11))+(0.75*L$18*FLOOR(L$20,0.05)*0.9*L$35*L$38*o_Isol_Bij_Tijdstip($A80,J$8,J$11))","v":0},"W",null,null,{"$f":"(0.75*N$18*FLOOR(N$20,0.05)*0.9*N$35*N$38*o_Isol_Bij_Tijdstip($A80,N$8,N$11))+(0.75*P$18*FLOOR(P$20,0.05)*0.9*P$35*P$38*o_Isol_Bij_Tijdstip($A80,N$8,N$11))","v":0},"W",null,null,{"$f":"(0.75*R$18*FLOOR(R$20,0.05)*0.9*R$35*R$38*o_Isol_Bij_Tijdstip($A80,R$8,R$11))+(0.75*T$18*FLOOR(T$20,0.05)*0.9*T$35*T$38*o_Isol_Bij_Tijdstip($A80,R$8,R$11))","v":0},"W",0,"W"]
["17:00:00",{"$f":"(0.75*B$18*FLOOR(B$20,0.05)*0.9*B$35*B$38*o_Isol_Bij_Tijdstip($A81,B$8,B$11))+(0.75*D$18*FLOOR(D$20,0.05)*0.9*D$35*D$38*o_Isol_Bij_Tijdstip($A81,B$8,B$11))","v":0},"W",null,null,{"$f":"(0.75*F$18*FLOOR(F$20,0.05)*0.9*F$35*F$38*o_Isol_Bij_Tijdstip($A81,F$8,F$11))+(0.75*H$18*FLOOR(H$20,0.05)*0.9*H$35*H$38*o_Isol_Bij_Tijdstip($A81,F$8,F$11))","v":0},"W",null,null,{"$f":"(0.75*J$18*FLOOR(J$20,0.05)*0.9*J$35*J$38*o_Isol_Bij_Tijdstip($A81,J$8,J$11))+(0.75*L$18*FLOOR(L$20,0.05)*0.9*L$35*L$38*o_Isol_Bij_Tijdstip($A81,J$8,J$11))","v":0},"W",null,null,{"$f":"(0.75*N$18*FLOOR(N$20,0.05)*0.9*N$35*N$38*o_Isol_Bij_Tijdstip($A81,N$8,N$11))+(0.75*P$18*FLOOR(P$20,0.05)*0.9*P$35*P$38*o_Isol_Bij_Tijdstip($A81,N$8,N$11))","v":0},"W",null,null,{"$f":"(0.75*R$18*FLOOR(R$20,0.05)*0.9*R$35*R$38*o_Isol_Bij_Tijdstip($A81,R$8,R$11))+(0.75*T$18*FLOOR(T$20,0.05)*0.9*T$35*T$38*o_Isol_Bij_Tijdstip($A81,R$8,R$11))","v":0},"W",0,"W"]
["18:00:00",{"$f":"(0.75*B$18*FLOOR(B$20,0.05)*0.9*B$35*B$38*o_Isol_Bij_Tijdstip($A82,B$8,B$11))+(0.75*D$18*FLOOR(D$20,0.05)*0.9*D$35*D$38*o_Isol_Bij_Tijdstip($A82,B$8,B$11))","v":0},"W",null,null,{"$f":"(0.75*F$18*FLOOR(F$20,0.05)*0.9*F$35*F$38*o_Isol_Bij_Tijdstip($A82,F$8,F$11))+(0.75*H$18*FLOOR(H$20,0.05)*0.9*H$35*H$38*o_Isol_Bij_Tijdstip($A82,F$8,F$11))","v":0},"W",null,null,{"$f":"(0.75*J$18*FLOOR(J$20,0.05)*0.9*J$35*J$38*o_Isol_Bij_Tijdstip($A82,J$8,J$11))+(0.75*L$18*FLOOR(L$20,0.05)*0.9*L$35*L$38*o_Isol_Bij_Tijdstip($A82,J$8,J$11))","v":0},"W",null,null,{"$f":"(0.75*N$18*FLOOR(N$20,0.05)*0.9*N$35*N$38*o_Isol_Bij_Tijdstip($A82,N$8,N$11))+(0.75*P$18*FLOOR(P$20,0.05)*0.9*P$35*P$38*o_Isol_Bij_Tijdstip($A82,N$8,N$11))","v":0},"W",null,null,{"$f":"(0.75*R$18*FLOOR(R$20,0.05)*0.9*R$35*R$38*o_Isol_Bij_Tijdstip($A82,R$8,R$11))+(0.75*T$18*FLOOR(T$20,0.05)*0.9*T$35*T$38*o_Isol_Bij_Tijdstip($A82,R$8,R$11))","v":0},"W",0,"W"]
[]
["Maatgevende tijdstip",{"$f":"IF(MAX(T73:T82)=0,\"Geen glas aanwezig\",_xlfn.XLOOKUP(MAX(T73:T82),T73:T82,A73:A82,\"nvt\"))","v":"Geen glas aanwezig"}]

{"sheet":"Ruimte 10","index":12,"n_rows":84,"n_cols":21,"rows_kept":84,"cut":false,"hidden":false,"merged":[[66,0,67,20],[0,0,0,20],[6,1,6,3],[6,5,6,7],[6,9,6,11],[6,13,6,15],[6,17,6,20],[41,1,41,3],[41,5,41,7],[41,9,41,11],[41,13,41,15],[41,17,41,19],[40,1,40,3],[40,5,40,7],[40,9,40,11],[40,13,40,15],[40,17,40,19],[55,1,55,3],[55,5,55,7],[55,9,55,11],[55,13,55,15],[55,17,55,19],[54,1,54,3],[54,5,54,7],[54,9,54,11],[54,13,54,15],[54,17,54,19],[56,5,56,7],[56,9,56,11],[56,13,56,15],[56,17,56,19],[57,1,57,3],[57,5,57,7],[57,9,57,11],[57,13,57,15],[57,17,57,19],[59,1,59,3],[60,1,60,3],[62,1,62,3],[63,1,63,3],[56,1,56,3]]}
["RUIMTE 10"]
[]
["Ruimtenaam",0]
["Type verblijfsruimte","Andere verblijfsruimte"]
["Vloeroppervlak verblijfsruimte Avr  (gebruiksoppervlak)",0,"m²"]
[]
[null,"Voorzijde woning",null,null,null,"Linker zijde woning",null,null,null,"Achterzijde woning",null,null,null,"Rechter zijde woning",null,null,null,"Platdak"]
["Orientatie gevel / dakvlak (Helling > 15°C)",{"$f":"Invoerblad!$B$17","v":"Noord"},null,null,null,{"$f":"o_Orientatie(F9)","v":"Oost"},null,null,null,{"$f":"o_Orientatie(J9)","v":"Zuid"},null,null,null,{"$f":"o_Orientatie(N9)","v":"West"},null,null,null,"Horizontaal"]
["Orientatiehoek gevel Ƴ",{"$f":"o_OrientatiehOEK(B8)","v":0},null,null,null,{"$f":"IF(B9+90>360,B9+90-360,B9+90)","v":90},null,null,null,{"$f":"IF(F9+90>360,F9+90-360,F9+90)","v":180},null,null,null,{"$f":"IF(J9+90>360,J9+90-360,J9+90)","v":270}]
["Grenst aan buitenlucht ja of nee","Ja",null,null,null,"Ja",null,null,null,"Ja",null,null,null,"Ja",null,null,null,"Ja"]
["Hellingshoek constructie ≥ 15° = hellenddak 90° = gevel",90,"°",null,null,90,"°",null,null,90,"°",null,null,90,"°",null,null,10,"°"]
["Type constructie",{"$f":"o_TypeConstructie(B10,B11)","v":"Buitengevel"},null,null,null,{"$f":"o_TypeConstructie(F10,F11)","v":"Buitengevel"},null,null,null,{"$f":"o_TypeConstructie(J10,J11)","v":"Buitengevel"},null,null,null,{"$f":"o_TypeConstructie(N10,N11)","v":"Buitengevel"},null,null,null,{"$f":"o_TypeConstructie(R10,R11)","v":"Platdak <15°"}]
["Gevel lengte (binnenwerks)",0,"m",null,null,0,"m",null,null,0,"m",null,null,0,"m",null,null,0,"m"]
["Gevel hoogte / Dak breedte (binnenwerks)",0,"m",null,null,0,"m",null,null,0,"m",null,null,0,"m",null,null,0,"m"]
["Constructie oppervlak (binnenwerks)",{"$f":"B13*B14","v":0},"m²",null,null,{"$f":"F13*F14","v":0},"m²",null,null,{"$f":"J13*J14","v":0},"m²",null,null,{"$f":"N13*N14","v":0},"m²",null,null,{"$f":"R13*R14","v":0},"m²"]
["Gesloten constructie oppervlak",{"$f":"MAX(0,B15-B18-D18)","v":0},"m²",null,null,{"$f":"MAX(0,F15-F18-H18)","v":0},"m²",null,null,{"$f":"MAX(0,J15-J18-L18)","v":0},"m²",null,null,{"$f":"MAX(0,N15-N18-P18)","v":0},"m²",null,null,{"$f":"MAX(0,R15-R18-T18)","v":0},"m²"]
[null,"Glasvlak type 1",null,"Glasvlak type 2",null,"Glasvlak type 1",null,"Glasvlak type 2",null,"Glasvlak type 1",null,"Glasvlak type 2",null,"Glasvlak type 1",null,"Glasvlak type 2",null,"Glasvlak type 1",null,"Glasvlak type 2"]
["Totaal oppervlak van raamtype Aw,k (inclusief kozijn)",0,"m²",0,"m²",0,"m²",0,"m²",0,"m²",0,"m²",0,"m²",0,"m²",0,"m²",0,"m²"]
["Warmtedoorgangscoefficient (U-waarde) van het raam Uw;wi;k",1.6,"W/m².K",1.6,"W/m².K",1.6,"W/m².K",1.6,"W/m².K",1.6,"W/m².K",1.6,"W/m².K",1.6,"W/m².K",1.6,"W/m².K",1.6,"W/m².K",1.6,"W/m².K"]
["Zontoetredingsfactor (g_waarde) van het glas Ggl;n;wi;k;C;juli",1,null,1,null,1,null,1,null,1,null,1,null,1,null,1,null,1,null,1]
["Beschaduwing situatie bij het raamtype","Minimale belemmering",null,"Minimale belemmering",null,"Minimale belemmering",null,"Minimale belemmering",null,"Minimale belemmering",null,"Minimale belemmering",null,"Minimale belemmering",null,"Minimale belemmering",null,"Minimale belemmering",null,"Minimale belemmering"]
[]
[null,"Overstek",null,"Overstek",null,"Overstek",null,"Overstek",null,"Overstek",null,"Overstek",null,"Overstek",null,"Overstek"]
["Hoogte verschil midden raam onderzijde overstek",0,"m",0,"m",0,"m",0,"m",0,"m",0,"m",0,"m",0,"m",0,null,null,"m"]
["Horizontale afstand glas tot eindpunt overstek",0,"m",0,"m",0,"m",0,"m",0,"m",0,"m",0,"m",0,"m",0,null,null,"m"]
["Overstekhoek",{"$f":"IFERROR(180/PI()*ATAN(B24/B25),0)","v":0},"°",{"$f":"IFERROR(180/PI()*ATAN(D24/D25),0)","v":0},"°",{"$f":"IFERROR(180/PI()*ATAN(F24/F25),0)","v":0},"°",{"$f":"IFERROR(180/PI()*ATAN(H24/H25),0)","v":0},"°",{"$f":"IFERROR(180/PI()*ATAN(J24/J25),0)","v":0},"°",{"$f":"IFERROR(180/PI()*ATAN(L24/L25),0)","v":0},"°",{"$f":"IFERROR(180/PI()*ATAN(N24/N25),0)","v":0},"°",{"$f":"IFERROR(180/PI()*ATAN(P24/P25),0)","v":0},"°",null,null,null,"°"]
["Relatieve hoogte van overstek",{"$f":"IFERROR(B24/B25,1)","v":1},null,{"$f":"IFERROR(D24/D25,1)","v":1},null,{"$f":"IFERROR(F24/F25,1)","v":1},null,{"$f":"IFERROR(H24/H25,1)","v":1},null,{"$f":"IFERROR(J24/J25,1)","v":1},null,{"$f":"IFERROR(L24/L25,1)","v":1},null,{"$f":"IFERROR(N24/N25,1)","v":1},null,{"$f":"IFERROR(P24/P25,1)","v":1}]
[]
[null,"Zijbelemmering",null,"Zijbelemmering",null,"Zijbelemmering",null,"Zijbelemmering",null,"Zijbelemmering",null,"Zijbelemmering",null,"Zijbelemmering",null,"Zijbelemmering"]
["Positie zijbelemmering irt zichtveld (naar buitengericht)","Links",null,"Links",null,"Links",null,"Links",null,"Links",null,"Links",null,"Links",null,"Links"]
["Horizontale afstand midden raam verste punt belemmering",0,"m",0,"m",null,"m",null,"m",null,"m",1,"m",null,"m",null,"m",null,null,null,"m"]
["Horizontale breedte glas tot eindpunt belemmering",0,"m",0,"m",null,"m",null,"m",null,"m",null,"m",null,"m",null,"m",null,null,null,"m"]
["Relatieve breedte van de zijbelemmering bb",{"$f":"IFERROR(B31/B32,999)","v":999},null,{"$f":"IFERROR(D31/D32,999)","v":999},null,{"$f":"IFERROR(F31/F32,999)","v":999},null,{"$f":"IFERROR(H31/H32,999)","v":999},null,{"$f":"IFERROR(J31/J32,999)","v":999},null,{"$f":"IFERROR(L31/L32,999)","v":999},null,{"$f":"IFERROR(N31/N32,999)","v":999},null,{"$f":"IFERROR(P31/P32,999)","v":999}]
[]
["De beschaduwingsreductiefactor Fsh;obst;wi;k;juli",{"$f":"IFERROR(o_Beschaduwingreductie(B21,B8,B27,B30,B33,B11),1)","v":1},null,{"$f":"IFERROR(o_Beschaduwingreductie(D21,B8,D27,D30,D33,B11),1)","v":1},null,{"$f":"IFERROR(o_Beschaduwingreductie(F21,F8,F27,F30,F33,F11),1)","v":1},null,{"$f":"IFERROR(o_Beschaduwingreductie(H21,F8,H27,H30,H33,F11),1)","v":1},null,{"$f":"IFERROR(o_Beschaduwingreductie(J21,J8,J27,J30,J33,J11),1)","v":1},null,{"$f":"IFERROR(o_Beschaduwingreductie(L21,J8,L27,L30,L33,J11),1)","v":1},null,{"$f":"IFERROR(o_Beschaduwingreductie(N21,N8,N27,N30,N33,N11),1)","v":1},null,{"$f":"IFERROR(o_Beschaduwingreductie(P21,N8,P27,P30,P33,N11),1)","v":1},null,{"$f":"o_Beschaduwingreductie(R21,R8,R27,R30,R33,R11)","v":1},null,{"$f":"o_Beschaduwingreductie(T21,R8,T27,T30,T33,R11)","v":1}]
[]
["Type zonwering","Geen zonwering",null,"Geen zonwering",null,"Geen zonwering",null,"Geen zonwering",null,"Geen zonwering",null,"Geen zonwering",null,"Geen zonwering",null,"Geen zonwering",null,"Geen zonwering",null,"Geen zonwering"]
["De reductiefactor voor zonwering Fc;wi;k",{"$f":"o_Zonweringreductie(B37,B8)","v":1},null,{"$f":"o_Zonweringreductie(D37,B8)","v":1},null,{"$f":"o_Zonweringreductie(F37,F8)","v":1},null,{"$f":"o_Zonweringreductie(H37,F8)","v":1},null,{"$f":"o_Zonweringreductie(J37,J8)","v":1},null,{"$f":"o_Zonweringreductie(L37,J8)","v":1},null,{"$f":"o_Zonweringreductie(N37,N8)","v":1},null,{"$f":"o_Zonweringreductie(P37,N8)","v":1},null,{"$f":"o_Zonweringreductie(R37,R8)","v":1},null,{"$f":"o_Zonweringreductie(T37,R8)","v":1}]
["Totaal opvallende zonnestraling van het raam Isol;wi;k;juli",{"$f":"IF(B10=\"Nee\",0,o_Isol_Bij_Tijdstip($B$52,B8,B11))","v":102.18873424043244},"W/m²",{"$f":"IF(B10=\"Nee\",0,o_Isol_Bij_Tijdstip($B$52,B8,B11))","v":102.18873424043244},"W/m²",{"$f":"IF(F10=\"Nee\",0,o_Isol_Bij_Tijdstip($B$52,F8,F11))","v":84.062269883674873},"W/m²",{"$f":"IF(F10=\"Nee\",0,o_Isol_Bij_Tijdstip($B$52,F8,F11))","v":84.062269883674873},"W/m²",{"$f":"IF(J10=\"Nee\",0,o_Isol_Bij_Tijdstip($B$52,J8,J11))","v":84.062269883674873},"W/m²",{"$f":"IF(J10=\"Nee\",0,o_Isol_Bij_Tijdstip($B$52,J8,J11))","v":84.062269883674873},"W/m²",{"$f":"IF(N10=\"Nee\",0,o_Isol_Bij_Tijdstip($B$52,N8,N11))","v":741.75809294382429},"W/m²",{"$f":"IF(N10=\"Nee\",0,o_Isol_Bij_Tijdstip($B$52,N8,N11))","v":741.75809294382429},"W/m²",{"$f":"IF(R10=\"Nee\",0,o_Isol_Bij_Tijdstip($B$52,R8,R11))","v":408.30602418254711},"W/m²",{"$f":"IF(R10=\"Nee\",0,o_Isol_Bij_Tijdstip($B$52,R8,R11))","v":408.30602418254711},"W/m²"]
[]
["Tijdstip maximale koellastbijdrage tmax;zi",{"$f":"VALUE(o_Tijdstip_Isol_Max_Orientatie(B8,B11))","v":"15:00:00"},null,null,null,{"$f":"VALUE(o_Tijdstip_Isol_Max_Orientatie(F8,F11))","v":"09:00:00"},null,null,null,{"$f":"VALUE(o_Tijdstip_Isol_Max_Orientatie(J8,J11))","v":"14:00:00"},null,null,null,{"$f":"VALUE(o_Tijdstip_Isol_Max_Orientatie(N8,N11))","v":"18:00:00"},null,null,null,{"$f":"o_Tijdstip_Isol_Max_Orientatie(R8,R11)","v":"16:00:00"}]
["Buitenluchttemperatuur op tijdstip max koellast Θe",{"$f":"o_maxTemp(VALUE(B41))","v":29.8},null,null,"°C",{"$f":"o_maxTemp(VALUE(F41))","v":24.7},null,null,"°C",{"$f":"o_maxTemp(VALUE(J41))","v":29.9},null,null,"°C",{"$f":"o_maxTemp(VALUE(N41))","v":30.1},null,null,"°C",{"$f":"o_maxTemp(VALUE(R41))","v":30.4}]
[]
["Glasopppervlak",{"$f":"IF(B10=\"Ja\",B18+D18,0)","v":0},"m²",null,null,{"$f":"IF(F10=\"Ja\",F18+H18,0)","v":0},"m²",null,null,{"$f":"IF(J10=\"Ja\",J18+L18,0)","v":0},"m²",null,null,{"$f":"IF(N10=\"Ja\",N18+P18,0)","v":0},"m²",null,null,{"$f":"IF(R10=\"Ja\",R18+T18,0)","v":0},"m²"]
["Uitwendigescheidingsconstructie niet op Noord?",{"$f":"IF(B10=\"Ja\",IF(B8=\"Noord\",FALSE,TRUE),FALSE)","v":false},null,null,null,{"$f":"IF(F10=\"Ja\",IF(F8=\"Noord\",FALSE,TRUE),FALSE)","v":true},null,null,null,{"$f":"IF(J10=\"Ja\",IF(J8=\"Noord\",FALSE,TRUE),FALSE)","v":true},null,null,null,{"$f":"IF(N10=\"Ja\",IF(N8=\"Noord\",FALSE,TRUE),FALSE)","v":true},null,null,null,{"$f":"IF(R10=\"Ja\",IF(R8=\"Noord\",FALSE,TRUE),FALSE)","v":true}]
["De enige uitwendigescheidingscontructie?",{"$f":"IF(AND(B45=TRUE,COUNTIF($B$45:$R$45,TRUE)=1),TRUE,FALSE)","v":false},null,null,null,{"$f":"IF(AND(F45=TRUE,COUNTIF($B$45:$R$45,TRUE)=1),TRUE,FALSE)","v":false},null,null,null,{"$f":"IF(AND(J45=TRUE,COUNTIF($B$45:$R$45,TRUE)=1),TRUE,FALSE)","v":false},null,null,null,{"$f":"IF(AND(N45=TRUE,COUNTIF($B$45:$R$45,TRUE)=1),TRUE,FALSE)","v":false},null,null,null,{"$f":"IF(AND(R45=TRUE,COUNTIF($B$45:$R$45,TRUE)=1),TRUE,FALSE)","v":false}]
["Totaal glasoppervlak",{"$f":"IF(B8<>\"Noord\",B44,0)","v":0},"m²",null,null,{"$f":"IF(F8<>\"Noord\",F44,0)","v":0},"m²",null,null,{"$f":"IF(J8<>\"Noord\",J44,0)","v":0},"m²",null,null,{"$f":"IF(N8<>\"Noord\",N44,0)","v":0},"m²",null,null,{"$f":"R44","v":0},"m²"]
["Grootste glasoppervlak ",{"$f":"IF(AND(B45,B47=MAX($B$47:$R$47)),TRUE,FALSE)","v":false},null,null,null,{"$f":"IF(AND(F45,F47=MAX($B$47:$R$47)),TRUE,FALSE)","v":true},null,null,null,{"$f":"IF(AND(J45,J47=MAX($B$47:$R$47)),TRUE,FALSE)","v":true},null,null,null,{"$f":"IF(AND(N45,N47=MAX($B$47:$R$47)),TRUE,FALSE)","v":true},null,null,null,{"$f":"IF(AND(R45,R47=MAX($B$47:$R$47)),TRUE,FALSE)","v":true}]
["Dakvlak maatgevend?",{"$f":"IF(AND(B11<90,B15>3*(B18+D18),Invoerblad!$B$25<65),TRUE,FALSE)","v":false},null,null,null,{"$f":"IF(AND(F11<90,F15>3*(F18+H18),Invoerblad!$B$25<65),TRUE,FALSE)","v":false},null,null,null,{"$f":"IF(AND(J11<90,J15>3*(J18+L18),Invoerblad!$B$25<65),TRUE,FALSE)","v":false},null,null,null,{"$f":"IF(AND(N11<90,N15>3*(N18+P18),Invoerblad!$B$25<65),TRUE,FALSE)","v":false},null,null,null,{"$f":"IF(AND(R11<90,R15>3*(R18+T18),Invoerblad!$B$25<65),TRUE,FALSE)","v":false}]
["is er een maatgevend dakoppervlak",{"$f":"IF(COUNTIF($B$49:$R$49,TRUE)>0,TRUE,FALSE)","v":false},null,null,null,{"$f":"IF(COUNTIF($B$49:$R$49,TRUE)>0,TRUE,FALSE)","v":false},null,null,null,{"$f":"IF(COUNTIF($B$49:$R$49,TRUE)>0,TRUE,FALSE)","v":false},null,null,null,{"$f":"IF(COUNTIF($B$49:$R$49,TRUE)>0,TRUE,FALSE)","v":false},null,null,null,{"$f":"IF(COUNTIF($B$49:$R$49,TRUE)>0,TRUE,FALSE)","v":false}]
["Maatgevende tijdstip",{"$f":"IF(OR(B46,AND(B45,B50,B49),AND(B45,B48,NOT(B50))),B41)","v":false},null,null,null,{"$f":"IF(OR(F46,AND(F45,F50,F49),AND(F45,F48,NOT(F50))),F41)","v":"09:00:00"},null,null,null,{"$f":"IF(OR(J46,AND(J45,J50,J49),AND(J45,J48,NOT(J50))),J41)","v":"14:00:00"},null,null,null,{"$f":"IF(OR(N46,AND(N45,N50,N49),AND(N45,N48,NOT(N50))),N41)","v":"18:00:00"},null,null,null,{"$f":"IF(OR(R46,AND(R45,R50,R49),AND(R45,R48,NOT(R50))),R41)","v":"16:00:00"}]
["Maatgevende tijdstip tmax;zi",{"$f":"IFERROR(B84,\"geen glas ingevoerd\")","v":"Geen glas aanwezig"}]
["Buitenluchttemperatuur op tijdstip max koellast Θe",{"$f":"o_maxTemp(VALUE(B52))","v":""},"°C"]
[]
["Koellastbijdrage transmissie transparante delen Ptr;gl;vr;zi",{"$f":"IF(B10=\"Nee\",0,B16*Invoerblad!$B$16)","v":0},null,null,"W",{"$f":"IF(F10=\"Nee\",0,F16*Invoerblad!$B$16)","v":0},null,null,"W",{"$f":"IF(J10=\"Nee\",0,J16*Invoerblad!$B$16)","v":0},null,null,"W",{"$f":"IF(N10=\"Nee\",0,N16*Invoerblad!$B$16)","v":0},null,null,"W",{"$f":"IF(R10=\"Nee\",0,R16*Invoerblad!$B$16)","v":0},null,null,"W"]
["Koellastbijdrage zoninstraling transparante delen Psol;vr;zi",{"$f":"(0.75*B18*FLOOR(B20,0.05)*0.9*B35*B38*B39)+(0.75*D18*FLOOR(D20,0.05)*0.9*D35*D38*D39)","v":0},null,null,"W",{"$f":"(0.75*F18*FLOOR(F20,0.05)*0.9*F35*F38*F39)+(0.75*H18*FLOOR(H20,0.05)*0.9*H35*H38*H39)","v":0},null,null,"W",{"$f":"(0.75*J18*FLOOR(J20,0.05)*0.9*J35*J38*J39)+(0.75*L18*FLOOR(L20,0.05)*0.9*L35*L38*L39)","v":0},null,null,"W",{"$f":"(0.75*N18*FLOOR(N20,0.05)*0.9*N35*N38*N39)+(0.75*P18*FLOOR(P20,0.05)*0.9*P35*P38*P39)","v":0},null,null,"W",{"$f":"(0.75*R18*FLOOR(R20,0.05)*0.9*R35*R38*R39)+(0.75*T18*FLOOR(T20,0.05)*0.9*T35*T38*T39)","v":0},null,null,"W"]
["Koellastbijdrage transmissie transparante delen Ptr;gl;vr;zi",{"$f":"IF(B10=\"Nee\",0,IFERROR(B18*B19*($B$53-24),0)+IFERROR(D18*D19*($B$53-24),0))","v":0},null,null,"W",{"$f":"IF(F10=\"Nee\",0,IFERROR(F18*F19*($B$53-24),0)+IFERROR(H18*H19*($B$53-24),0))","v":0},null,null,"W",{"$f":"IF(J10=\"Nee\",0,IFERROR(J18*J19*($B$53-24),0)+IFERROR(L18*L19*($B$53-24),0))","v":0},null,null,"W",{"$f":"IF(N10=\"Nee\",0,IFERROR(N18*N19*($B$53-24),0)+IFERROR(P18*P19*($B$53-24),0))","v":0},null,null,"W",{"$f":"IF(R10=\"Nee\",0,IFERROR(R18*R19*($B$53-24),0)+IFERROR(T18*T19*($B$53-24),0))","v":0},null,null,"W"]
["Totaal koellastbijdrage per gevel",{"$f":"SUM(B55:D57)","v":0},null,null,"W",{"$f":"SUM(F55:H57)","v":0},null,null,"W",{"$f":"SUM(J55:L57)","v":0},null,null,"W",{"$f":"SUM(N55:P57)","v":0},null,null,"W",{"$f":"SUM(R55:R57)","v":0},null,null,"W"]
[]
["Koellast door interne warmtelast Pint;calc;woon/overig;zi",{"$f":"IF(B5=0,0,IF(B4=\"Woonvertrek\",2*Invoerblad!$B$40*B5,Invoerblad!$B$40*B5))","v":0},null,null,"W"]
["Koellast door buitenluchttoetreding Pv;calc;vr;zi",{"$f":"IFERROR(MAX((SUM(Invoerblad!$B$28:$B$30)/3600*1.205*1005*(B53-24))/SUM(Invoerblad!$B$47:$T$47)*B5,0),0)","v":0},{"$f":"IFERROR(MAX(SUM(C57:C59)/3600*1.205*1005*(C60-24),0),0)","v":0},{"$f":"IFERROR(MAX(SUM(D57:D59)/3600*1.205*1005*(D60-24),0),0)","v":0},"W"]
[]
["Totaal koellastbijdrage",{"$f":"IFERROR(SUM(B58:T58)+B60+B61,0)","v":0},null,null,"W"]
["Koelbehoefte verblijfsruimte",{"$f":"IFERROR(B63/B5,0)","v":0},null,null,"W/m²"]
[]
[]
["Onderstaande tabellen worden verborgen in de uiteindelijke versie. De tabellen dienen om vast te stellen welk tijdstip tot de hoogste zonbelasting leidt"]
[]
["Isol max voor de orientatie",{"$f":"o_Isol_Max_Orientatie(B8,B11)","v":143.73988086183414},"W/m²",null,null,{"$f":"o_Isol_Max_Orientatie(F8,F11)","v":845.32772366250799},"W/m²",null,null,{"$f":"o_Isol_Max_Orientatie(J8,J11)","v":740.05836254715712},"W/m²",null,null,{"$f":"o_Isol_Max_Orientatie(N8,N11)","v":741.75809294382429},"W/m²",null,null,{"$f":"o_Isol_Max_Orientatie(R8,R11)","v":914.16092603772574},"W/m²"]
["Tijdstip bij Isol max bij orientatie",{"$f":"VALUE(o_Tijdstip_Isol_Max_Orientatie(B8,B11))","v":"15:00:00"},null,null,null,{"$f":"VALUE(o_Tijdstip_Isol_Max_Orientatie(F8,F11))","v":"09:00:00"},null,null,null,{"$f":"VALUE(o_Tijdstip_Isol_Max_Orientatie(J8,J11))","v":"14:00:00"},null,null,null,{"$f":"VALUE(o_Tijdstip_Isol_Max_Orientatie(N8,N11))","v":"18:00:00"},null,null,null,{"$f":"VALUE(o_Tijdstip_Isol_Max_Orientatie(R8,R11))","v":"16:00:00"}]
[]
["Koellastbijdrage zoninstraling transparante delen Psol;vr;zi"]
["09:00:00",{"$f":"(0.75*B$18*FLOOR(B$20,0.05)*0.9*B$35*B$38*o_Isol_Bij_Tijdstip($A73,B$8,B$11))+(0.75*D$18*FLOOR(D$20,0.05)*0.9*D$35*D$38*o_Isol_Bij_Tijdstip($A73,B$8,B$11))","v":0},"W",null,null,{"$f":"(0.75*F$18*FLOOR(F$20,0.05)*0.9*F$35*F$38*o_Isol_Bij_Tijdstip($A73,F$8,F$11))+(0.75*H$18*FLOOR(H$20,0.05)*0.9*H$35*H$38*o_Isol_Bij_Tijdstip($A73,F$8,F$11))","v":0},"W",null,null,{"$f":"(0.75*J$18*FLOOR(J$20,0.05)*0.9*J$35*J$38*o_Isol_Bij_Tijdstip($A73,J$8,J$11))+(0.75*L$18*FLOOR(L$20,0.05)*0.9*L$35*L$38*o_Isol_Bij_Tijdstip($A73,J$8,J$11))","v":0},"W",null,null,{"$f":"(0.75*N$18*FLOOR(N$20,0.05)*0.9*N$35*N$38*o_Isol_Bij_Tijdstip($A73,N$8,N$11))+(0.75*P$18*FLOOR(P$20,0.05)*0.9*P$35*P$38*o_Isol_Bij_Tijdstip($A73,N$8,N$11))","v":0},"W",null,null,{"$f":"(0.75*R$18*FLOOR(R$20,0.05)*0.9*R$35*R$38*o_Isol_Bij_Tijdstip($A73,R$8,R$11))+(0.75*T$18*FLOOR(T$20,0.05)*0.9*T$35*T$38*o_Isol_Bij_Tijdstip($A73,R$8,R$11))","v":0},"W",{"$f":"B73+F73+J73+N73+R73","v":0},"W"]
["10:00:00",{"$f":"(0.75*B$18*FLOOR(B$20,0.05)*0.9*B$35*B$38*o_Isol_Bij_Tijdstip($A74,B$8,B$11))+(0.75*D$18*FLOOR(D$20,0.05)*0.9*D$35*D$38*o_Isol_Bij_Tijdstip($A74,B$8,B$11))","v":0},"W",null,null,{"$f":"(0.75*F$18*FLOOR(F$20,0.05)*0.9*F$35*F$38*o_Isol_Bij_Tijdstip($A74,F$8,F$11))+(0.75*H$18*FLOOR(H$20,0.05)*0.9*H$35*H$38*o_Isol_Bij_Tijdstip($A74,F$8,F$11))","v":0},"W",null,null,{"$f":"(0.75*J$18*FLOOR(J$20,0.05)*0.9*J$35*J$38*o_Isol_Bij_Tijdstip($A74,J$8,J$11))+(0.75*L$18*FLOOR(L$20,0.05)*0.9*L$35*L$38*o_Isol_Bij_Tijdstip($A74,J$8,J$11))","v":0},"W",null,null,{"$f":"(0.75*N$18*FLOOR(N$20,0.05)*0.9*N$35*N$38*o_Isol_Bij_Tijdstip($A74,N$8,N$11))+(0.75*P$18*FLOOR(P$20,0.05)*0.9*P$35*P$38*o_Isol_Bij_Tijdstip($A74,N$8,N$11))","v":0},"W",null,null,{"$f":"(0.75*R$18*FLOOR(R$20,0.05)*0.9*R$35*R$38*o_Isol_Bij_Tijdstip($A74,R$8,R$11))+(0.75*T$18*FLOOR(T$20,0.05)*0.9*T$35*T$38*o_Isol_Bij_Tijdstip($A74,R$8,R$11))","v":0},"W",0,"W"]
["11:00:00",{"$f":"(0.75*B$18*FLOOR(B$20,0.05)*0.9*B$35*B$38*o_Isol_Bij_Tijdstip($A75,B$8,B$11))+(0.75*D$18*FLOOR(D$20,0.05)*0.9*D$35*D$38*o_Isol_Bij_Tijdstip($A75,B$8,B$11))","v":0},"W",null,null,{"$f":"(0.75*F$18*FLOOR(F$20,0.05)*0.9*F$35*F$38*o_Isol_Bij_Tijdstip($A75,F$8,F$11))+(0.75*H$18*FLOOR(H$20,0.05)*0.9*H$35*H$38*o_Isol_Bij_Tijdstip($A75,F$8,F$11))","v":0},"W",null,null,{"$f":"(0.75*J$18*FLOOR(J$20,0.05)*0.9*J$35*J$38*o_Isol_Bij_Tijdstip($A75,J$8,J$11))+(0.75*L$18*FLOOR(L$20,0.05)*0.9*L$35*L$38*o_Isol_Bij_Tijdstip($A75,J$8,J$11))","v":0},"W",null,null,{"$f":"(0.75*N$18*FLOOR(N$20,0.05)*0.9*N$35*N$38*o_Isol_Bij_Tijdstip($A75,N$8,N$11))+(0.75*P$18*FLOOR(P$20,0.05)*0.9*P$35*P$38*o_Isol_Bij_Tijdstip($A75,N$8,N$11))","v":0},"W",null,null,{"$f":"(0.75*R$18*FLOOR(R$20,0.05)*0.9*R$35*R$38*o_Isol_Bij_Tijdstip($A75,R$8,R$11))+(0.75*T$18*FLOOR(T$20,0.05)*0.9*T$35*T$38*o_Isol_Bij_Tijdstip($A75,R$8,R$11))","v":0},"W",0,"W"]
["12:00:00",{"$f":"(0.75*B$18*FLOOR(B$20,0.05)*0.9*B$35*B$38*o_Isol_Bij_Tijdstip($A76,B$8,B$11))+(0.75*D$18*FLOOR(D$20,0.05)*0.9*D$35*D$38*o_Isol_Bij_Tijdstip($A76,B$8,B$11))","v":0},"W",null,null,{"$f":"(0.75*F$18*FLOOR(F$20,0.05)*0.9*F$35*F$38*o_Isol_Bij_Tijdstip($A76,F$8,F$11))+(0.75*H$18*FLOOR(H$20,0.05)*0.9*H$35*H$38*o_Isol_Bij_Tijdstip($A76,F$8,F$11))","v":0},"W",null,null,{"$f":"(0.75*J$18*FLOOR(J$20,0.05)*0.9*J$35*J$38*o_Isol_Bij_Tijdstip($A76,J$8,J$11))+(0.75*L$18*FLOOR(L$20,0.05)*0.9*L$35*L$38*o_Isol_Bij_Tijdstip($A76,J$8,J$11))","v":0},"W",null,null,{"$f":"(0.75*N$18*FLOOR(N$20,0.05)*0.9*N$35*N$38*o_Isol_Bij_Tijdstip($A76,N$8,N$11))+(0.75*P$18*FLOOR(P$20,0.05)*0.9*P$35*P$38*o_Isol_Bij_Tijdstip($A76,N$8,N$11))","v":0},"W",null,null,{"$f":"(0.75*R$18*FLOOR(R$20,0.05)*0.9*R$35*R$38*o_Isol_Bij_Tijdstip($A76,R$8,R$11))+(0.75*T$18*FLOOR(T$20,0.05)*0.9*T$35*T$38*o_Isol_Bij_Tijdstip($A76,R$8,R$11))","v":0},"W",0,"W"]
["13:00:00",{"$f":"(0.75*B$18*FLOOR(B$20,0.05)*0.9*B$35*B$38*o_Isol_Bij_Tijdstip($A77,B$8,B$11))+(0.75*D$18*FLOOR(D$20,0.05)*0.9*D$35*D$38*o_Isol_Bij_Tijdstip($A77,B$8,B$11))","v":0},"W",null,null,{"$f":"(0.75*F$18*FLOOR(F$20,0.05)*0.9*F$35*F$38*o_Isol_Bij_Tijdstip($A77,F$8,F$11))+(0.75*H$18*FLOOR(H$20,0.05)*0.9*H$35*H$38*o_Isol_Bij_Tijdstip($A77,F$8,F$11))","v":0},"W",null,null,{"$f":"(0.75*J$18*FLOOR(J$20,0.05)*0.9*J$35*J$38*o_Isol_Bij_Tijdstip($A77,J$8,J$11))+(0.75*L$18*FLOOR(L$20,0.05)*0.9*L$35*L$38*o_Isol_Bij_Tijdstip($A77,J$8,J$11))","v":0},"W",null,null,{"$f":"(0.75*N$18*FLOOR(N$20,0.05)*0.9*N$35*N$38*o_Isol_Bij_Tijdstip($A77,N$8,N$11))+(0.75*P$18*FLOOR(P$20,0.05)*0.9*P$35*P$38*o_Isol_Bij_Tijdstip($A77,N$8,N$11))","v":0},"W",null,null,{"$f":"(0.75*R$18*FLOOR(R$20,0.05)*0.9*R$35*R$38*o_Isol_Bij_Tijdstip($A77,R$8,R$11))+(0.75*T$18*FLOOR(T$20,0.05)*0.9*T$35*T$38*o_Isol_Bij_Tijdstip($A77,R$8,R$11))","v":0},"W",0,"W"]
["14:00:00",{"$f":"(0.75*B$18*FLOOR(B$20,0.05)*0.9*B$35*B$38*o_Isol_Bij_Tijdstip($A78,B$8,B$11))+(0.75*D$18*FLOOR(D$20,0.05)*0.9*D$35*D$38*o_Isol_Bij_Tijdstip($A78,B$8,B$11))","v":0},"W",null,null,{"$f":"(0.75*F$18*FLOOR(F$20,0.05)*0.9*F$35*F$38*o_Isol_Bij_Tijdstip($A78,F$8,F$11))+(0.75*H$18*FLOOR(H$20,0.05)*0.9*H$35*H$38*o_Isol_Bij_Tijdstip($A78,F$8,F$11))","v":0},"W",null,null,{"$f":"(0.75*J$18*FLOOR(J$20,0.05)*0.9*J$35*J$38*o_Isol_Bij_Tijdstip($A78,J$8,J$11))+(0.75*L$18*FLOOR(L$20,0.05)*0.9*L$35*L$38*o_Isol_Bij_Tijdstip($A78,J$8,J$11))","v":0},"W",null,null,{"$f":"(0.75*N$18*FLOOR(N$20,0.05)*0.9*N$35*N$38*o_Isol_Bij_Tijdstip($A78,N$8,N$11))+(0.75*P$18*FLOOR(P$20,0.05)*0.9*P$35*P$38*o_Isol_Bij_Tijdstip($A78,N$8,N$11))","v":0},"W",null,null,{"$f":"(0.75*R$18*FLOOR(R$20,0.05)*0.9*R$35*R$38*o_Isol_Bij_Tijdstip($A78,R$8,R$11))+(0.75*T$18*FLOOR(T$20,0.05)*0.9*T$35*T$38*o_Isol_Bij_Tijdstip($A78,R$8,R$11))","v":0},"W",0,"W"]
["15:00:00",{"$f":"(0.75*B$18*FLOOR(B$20,0.05)*0.9*B$35*B$38*o_Isol_Bij_Tijdstip($A79,B$8,B$11))+(0.75*D$18*FLOOR(D$20,0.05)*0.9*D$35*D$38*o_Isol_Bij_Tijdstip($A79,B$8,B$11))","v":0},"W",null,null,{"$f":"(0.75*F$18*FLOOR(F$20,0.05)*0.9*F$35*F$38*o_Isol_Bij_Tijdstip($A79,F$8,F$11))+(0.75*H$18*FLOOR(H$20,0.05)*0.9*H$35*H$38*o_Isol_Bij_Tijdstip($A79,F$8,F$11))","v":0},"W",null,null,{"$f":"(0.75*J$18*FLOOR(J$20,0.05)*0.9*J$35*J$38*o_Isol_Bij_Tijdstip($A79,J$8,J$11))+(0.75*L$18*FLOOR(L$20,0.05)*0.9*L$35*L$38*o_Isol_Bij_Tijdstip($A79,J$8,J$11))","v":0},"W",null,null,{"$f":"(0.75*N$18*FLOOR(N$20,0.05)*0.9*N$35*N$38*o_Isol_Bij_Tijdstip($A79,N$8,N$11))+(0.75*P$18*FLOOR(P$20,0.05)*0.9*P$35*P$38*o_Isol_Bij_Tijdstip($A79,N$8,N$11))","v":0},"W",null,null,{"$f":"(0.75*R$18*FLOOR(R$20,0.05)*0.9*R$35*R$38*o_Isol_Bij_Tijdstip($A79,R$8,R$11))+(0.75*T$18*FLOOR(T$20,0.05)*0.9*T$35*T$38*o_Isol_Bij_Tijdstip($A79,R$8,R$11))","v":0},"W",0,"W"]
["16:00:00",{"$f":"(0.75*B$18*FLOOR(B$20,0.05)*0.9*B$35*B$38*o_Isol_Bij_Tijdstip($A80,B$8,B$11))+(0.75*D$18*FLOOR(D$20,0.05)*0.9*D$35*D$38*o_Isol_Bij_Tijdstip($A80,B$8,B$11))","v":0},"W",null,null,{"$f":"(0.75*F$18*FLOOR(F$20,0.05)*0.9*F$35*F$38*o_Isol_Bij_Tijdstip($A80,F$8,F$11))+(0.75*H$18*FLOOR(H$20,0.05)*0.9*H$35*H$38*o_Isol_Bij_Tijdstip($A80,F$8,F$11))","v":0},"W",null,null,{"$f":"(0.75*J$18*FLOOR(J$20,0.05)*0.9*J$35*J$38*o_Isol_Bij_Tijdstip($A80,J$8,J$11))+(0.75*L$18*FLOOR(L$20,0.05)*0.9*L$35*L$38*o_Isol_Bij_Tijdstip($A80,J$8,J$11))","v":0},"W",null,null,{"$f":"(0.75*N$18*FLOOR(N$20,0.05)*0.9*N$35*N$38*o_Isol_Bij_Tijdstip($A80,N$8,N$11))+(0.75*P$18*FLOOR(P$20,0.05)*0.9*P$35*P$38*o_Isol_Bij_Tijdstip($A80,N$8,N$11))","v":0},"W",null,null,{"$f":"(0.75*R$18*FLOOR(R$20,0.05)*0.9*R$35*R$38*o_Isol_Bij_Tijdstip($A80,R$8,R$11))+(0.75*T$18*FLOOR(T$20,0.05)*0.9*T$35*T$38*o_Isol_Bij_Tijdstip($A80,R$8,R$11))","v":0},"W",0,"W"]
["17:00:00",{"$f":"(0.75*B$18*FLOOR(B$20,0.05)*0.9*B$35*B$38*o_Isol_Bij_Tijdstip($A81,B$8,B$11))+(0.75*D$18*FLOOR(D$20,0.05)*0.9*D$35*D$38*o_Isol_Bij_Tijdstip($A81,B$8,B$11))","v":0},"W",null,null,{"$f":"(0.75*F$18*FLOOR(F$20,0.05)*0.9*F$35*F$38*o_Isol_Bij_Tijdstip($A81,F$8,F$11))+(0.75*H$18*FLOOR(H$20,0.05)*0.9*H$35*H$38*o_Isol_Bij_Tijdstip($A81,F$8,F$11))","v":0},"W",null,null,{"$f":"(0.75*J$18*FLOOR(J$20,0.05)*0.9*J$35*J$38*o_Isol_Bij_Tijdstip($A81,J$8,J$11))+(0.75*L$18*FLOOR(L$20,0.05)*0.9*L$35*L$38*o_Isol_Bij_Tijdstip($A81,J$8,J$11))","v":0},"W",null,null,{"$f":"(0.75*N$18*FLOOR(N$20,0.05)*0.9*N$35*N$38*o_Isol_Bij_Tijdstip($A81,N$8,N$11))+(0.75*P$18*FLOOR(P$20,0.05)*0.9*P$35*P$38*o_Isol_Bij_Tijdstip($A81,N$8,N$11))","v":0},"W",null,null,{"$f":"(0.75*R$18*FLOOR(R$20,0.05)*0.9*R$35*R$38*o_Isol_Bij_Tijdstip($A81,R$8,R$11))+(0.75*T$18*FLOOR(T$20,0.05)*0.9*T$35*T$38*o_Isol_Bij_Tijdstip($A81,R$8,R$11))","v":0},"W",0,"W"]
["18:00:00",{"$f":"(0.75*B$18*FLOOR(B$20,0.05)*0.9*B$35*B$38*o_Isol_Bij_Tijdstip($A82,B$8,B$11))+(0.75*D$18*FLOOR(D$20,0.05)*0.9*D$35*D$38*o_Isol_Bij_Tijdstip($A82,B$8,B$11))","v":0},"W",null,null,{"$f":"(0.75*F$18*FLOOR(F$20,0.05)*0.9*F$35*F$38*o_Isol_Bij_Tijdstip($A82,F$8,F$11))+(0.75*H$18*FLOOR(H$20,0.05)*0.9*H$35*H$38*o_Isol_Bij_Tijdstip($A82,F$8,F$11))","v":0},"W",null,null,{"$f":"(0.75*J$18*FLOOR(J$20,0.05)*0.9*J$35*J$38*o_Isol_Bij_Tijdstip($A82,J$8,J$11))+(0.75*L$18*FLOOR(L$20,0.05)*0.9*L$35*L$38*o_Isol_Bij_Tijdstip($A82,J$8,J$11))","v":0},"W",null,null,{"$f":"(0.75*N$18*FLOOR(N$20,0.05)*0.9*N$35*N$38*o_Isol_Bij_Tijdstip($A82,N$8,N$11))+(0.75*P$18*FLOOR(P$20,0.05)*0.9*P$35*P$38*o_Isol_Bij_Tijdstip($A82,N$8,N$11))","v":0},"W",null,null,{"$f":"(0.75*R$18*FLOOR(R$20,0.05)*0.9*R$35*R$38*o_Isol_Bij_Tijdstip($A82,R$8,R$11))+(0.75*T$18*FLOOR(T$20,0.05)*0.9*T$35*T$38*o_Isol_Bij_Tijdstip($A82,R$8,R$11))","v":0},"W",0,"W"]
[]
["Maatgevende tijdstip",{"$f":"IF(MAX(T73:T82)=0,\"Geen glas aanwezig\",_xlfn.XLOOKUP(MAX(T73:T82),T73:T82,A73:A82,\"nvt\"))","v":"Geen glas aanwezig"}]

{"sheet":"Tabellen","index":13,"n_rows":113,"n_cols":8,"rows_kept":113,"cut":false,"hidden":true,"merged":[[32,3,33,3],[32,4,33,4],[101,0,101,1],[109,0,109,1],[70,0,70,6],[82,0,82,1],[0,0,0,1],[38,3,38,4],[52,0,52,1],[34,3,36,3],[34,4,36,4],[16,0,16,1],[7,0,7,1],[26,2,27,2],[26,0,27,0],[26,1,27,1],[29,3,31,3],[29,4,31,4]]}
["Factor voor thermsiche isolatie van ondoorzichtige delen Tabel AA.4 NTA8800",null,null,"Ja of nee"]
["Bouwjaar","fiso",null,"Ja"]
["≤1974",17,null,"Nee"]
["1975 - 1991",10]
["1992 - 2014",3.2]
[">2015",2.2000000000000002]
[]
["Massa van de vloeren tabel 7.11 NTA8800"]
["Vloeren"]
["Houten vloeren","Licht"]
["Houtskeletbouw (hsb) vloeren","Licht"]
["Staalframebouw (sfb) vloeren","Licht"]
["Vloeren van elk type die aan de binnenzijde zijn geïsoleerd","Licht"]
["Staal-beton vloeren","Zwaar"]
["Niet-massieve betonnen vloeren","Zwaar"]
["Massieve betonnen vloeren","Zeer Zwaar"]
["Massa van de wanden  tabel 7.12 NTA8800"]
["Wanden"]
["Houtskeletbouw (hsb)","Licht"]
["Staalframebouw (sfb)","Licht"]
["Staalskeletbouw","Licht"]
["Wanden van elk type die aan de binnenzijde zijn geïsoleerd","Licht"]
["Dragend metselwerk","Zwaar"]
["Betonnen kolom-ligger skeletbouw","Zwaar"]
["Betonnen wand-vloer skeletbouw","Zeer Zwaar"]
[]
["Type bouwwijze vloeren","Type bouwwijze wanden","Zoek waarde","Specifieke interne warmtecapaciteit","Massa van de constructie","Specifieke werkzame massa"]
[null,null,null,"[kJ/m²K]","[kg/m²]","[kg/m²]"]
["Licht","Licht",{"$f":"A29&B29","v":"LichtLicht"},80,"<250 ",50]
["Licht","Zwaar","LichtZwaar",180,"250 tot 500",65]
["Zwaar","Licht","ZwaarLicht",null,null,65]
["Zeer zwaar","Licht","Zeer zwaarLicht",null,null,65]
["Zwaar","Zwaar","ZwaarZwaar",360,"500 tot 750",85]
["Licht","Zeer zwaar","LichtZeer zwaar",null,null,85]
["Zwaar","Zeer zwaar","ZwaarZeer zwaar",450,">750",100]
["Zeer zwaar","Zwaar","Zeer zwaarZwaar",null,null,100]
["Zeer zwaar","Zeer zwaar","Zeer zwaarZeer zwaar",null,null,100]
[]
[null,null,null,"Tijdstip maximale koellast Tabel AA.2 NTA8800"]
["Orientatie","Graden","Orientatie","SWM = 50","SWM > 50"]
["-",{"$f":"Invoerblad!B33*B4","v":0},"-","nvt","nvt"]
["Noord",0,"Oost","nvt","nvt"]
["Noord-Oost",45,"ZuidOost","09:00:00","11:00:00"]
["Oost",90,"Zuid","09:00:00","11:00:00"]
["Zuid-Oost",135,"ZuidWest","11:00:00","13:00:00"]
["Zuid",180,"West","13:00:00","15:00:00"]
["Zuid-West",225,"NoordWest","15:00:00","16:30:00"]
["West",270,"Noord","17:00:00","18:00:00"]
["Noord-West",315,"NoordOost","17:00:00","18:00:00"]
["Horizontaal",null,"Horizontaal","13:00:00","16:00:00","dakvlak <15° helling"]
[]
[]
["Buitenluchttemperatuur voor aandeel ventilatie bij tijdstip"]
["nvt","nvt"]
["09:00:00",24.7,7,"17:40:00",{"$f":"FORECAST(D55,B55:B67,A55:A67)","v":28.282783882783882},{"$f":"Linterp(D55)","v":{"$error":"#NAME?"}}]
["10:00:00",26.9,8,null,{"$f":"_xlfn.FORECAST.LINEAR(D55,B55:B67,A55:A69)","v":{"$error":"#N/A"}}]
["11:00:00",28.2,9]
["12:00:00",28.9,10,"UREN",7.5]
["13:00:00",29.7,11,null,{"$f":"_xlfn.FORECAST.LINEAR(E58,B55:B67,C55:C69)","v":{"$error":"#N/A"}}]
["14:00:00",29.9,12]
["15:00:00",29.8,13]
["16:00:00",30.4,14]
["17:00:00",30.6,15]
["18:00:00",30.1,16]
["19:00:00",29.5,17]
["20:00:00",25.9,18]
["21:00:00",23.4,19]
[null,null,20]
[null,null,21]
[]
["Maandgemiddelde totale opvallende zonnestraling isol;mi over alla uren tabel 17,2 NTA8800"]
[null,"Helling 0° (platdak","Helling 30°","Helling 45°","Helling 60°","Helling 90° (gevel)","Helling 180° (vloer boven buitenlucht)"]
[null,0,30,45,60,90,180]
["Noord",0,0,0,0,0,0,"geen koellast op noord verwacht"]
["NoordOost",191,156.9,132.69999999999999,112.3,81.2,38.200000000000003]
["Oost",191,175,160.4,143.19999999999999,104.9,38.200000000000003]
["ZuidOost",191,190,179.1,161.80000000000001,113.2,38.200000000000003]
["Zuid",191,196.1,185,165.9,109.7,38.200000000000003]
["ZuidWest",191,193.2,182.5,165.4,117.1,38.200000000000003]
["West",191,180.2,166.8,150.6,112.7,38.200000000000003]
["NoordWest",191,162.1,139,119.2,88.5,38.200000000000003]
[]
["type zonwering tabel 7,5"]
["Type zonwering","Fc"]
["Geen zonwering",1]
["Screen (zwart, antraciet, donkerbruin)",0.12]
["Screen (overige kleuren)",0.2]
["Screen (wit)",0.25]
["Screen (onbekende kleur)",0.2]
["Jaloezieën (zwart, antraciet, donkerbruin)",0.05]
["Jaloezieën (overige kleuren)",0.1]
["Jaloezieën (wit)",0.2]
["Jaloezieën (onbekende kleur)",0.1]
["Rolluiken (overige kleuren)",0.11]
["Rolluiken (wit)",0.04]
["Rolluiken (onbekende kleur)",0.11]
["Gemetalisseerde weefsels (binnen toegepast)",0.45]
["Uitvalschermen"]
["Knikarmschermen"]
[]
[]
["Tabel 8.23 ISSO 82.1 Mogelijke beschaduwingssituaties bij ramen in gevels"]
["Minimale belemmering","tabel 17,5"]
["Constante overstek","tabel 17,9"]
["Zijbelemmering","tabel 17,11"]
["Volledige belemmering","tabel 17,14"]
["Constante overstek en één of meer zij)belemmering(en)","tabel 17,9"]
["Overige belemmering"]
[]
["Tabel 8.24 ISSO 82.1 Mogelijke beschaduwingssituaties bij ramen platte en hellende daken"]
["Minimale belemmering"]
["Volledige belemmering"]
["Overige belemmering"]

{"sheet":"Tabel AA","index":14,"n_rows":84,"n_cols":11,"rows_kept":84,"cut":false,"hidden":true,"merged":[[68,1,68,10],[83,0,83,10],[51,1,51,10],[52,1,52,10],[64,2,64,9],[65,1,66,1],[65,10,66,10],[67,1,67,10],[49,1,50,1],[49,10,50,10],[16,2,16,9],[17,1,18,1],[17,10,18,10],[19,1,19,10],[20,1,20,10],[32,2,32,9],[33,1,34,1],[33,10,34,10],[35,1,35,10],[36,1,36,10],[48,2,48,9],[15,2,15,9],[0,2,0,9],[1,1,2,1],[1,10,2,10],[3,1,3,10],[4,1,4,10]]}
["β","0°","30°"]
["γ","–","180°","225°","270°","315°","360°","45°","90°","135°"]
[null,null,"Z","ZW","W","NW","N","NO","O","ZO"]
["Tijdstip","Isol;mi"]
[null,"W/m2"]
["09:00:00",576.14921007246005,576.72033027220755,305.28404759691568,162.25325482819457,231.41345053298542,472.25153004379928,743.6878127190912,886.71860548781206,817.55840978302138]
["10:00:00",748.25970598425579,813.81981451302056,534.82577796392036,338.66081419503905,340.23569851976077,538.62788505983224,817.62192160893255,1013.7868853778139,1012.2120010530921]
["11:00:00",824.29524320907808,940.3058843442891,710.17531532850739,499.4491974523051,431.56803262132973,546.29568656388335,776.42625557966494,987.15237345586729,1055.0335382868427]
["12:00:00",893.0204327386607,1043.9513770510921,877.61556067823017,668.05836959603414,538.03556424764395,563.7127405883499,730.0485569612116,939.60574804340786,1069.6285533917981]
["13:00:00",914.16092603772574,1078.2061384506394,992.90759973595345,807.53064630888844,630.66658333561361,565.91998020946426,651.21851892415043,836.59547235121545,1013.4595353244902]
["14:00:00",875.08681990532841,1085.9846555013817,1081.6422036028864,904.87792309204758,659.2379321489924,488.61480600695836,492.95725790545367,669.72153841629233,915.36152935934763]
["15:00:00",904.02678788476021,1038.5926546061153,1139.8607301771449,1049.2655490653372,819.87653968034192,586.06667266056024,484.79859708953057,575.39377820133825,804.78278758633348]
["16:00:00",691.20297004054351,754.47599774012417,911.88977594312473,900.65044095383553,727.34184277692759,493.48580774856441,336.07202954556396,347.31136453485328,520.61996271176122]
["17:00:00",538.56640305581038,552.17356793462113,747.76478609679998,792.12766731111378,659.27503742816407,427.0301652364497,231.438947074271,187.07606585995723,319.92869574290683]
["18:00:00",408.30602418254711,363.00893931918449,598.19408678671334,700.92008302763816,611.01143265231281,381.13540367594214,145.95025620841341,59.246355235548428,133.13291034281394]
[]
["β",null,"45°"]
["γ",null,"180°","225°","270°","315°","360°","45°","90°","135°"]
[null,null,"Z","ZW","W","NW","N","NO","O","ZO"]
["Tijdstip","Isol;mi"]
[null,"W/m2"]
["09:00:00",null,527.23176065499331,143.3628883754584,99.345331095849431,99.345331095849431,379.49056652713284,763.35943880666775,965.63552577716871,867.82823903507597]
["10:00:00",null,774.7044633307105,380.14731302175795,102.72816079737919,104.9553835685693,385.5243044423915,780.08145475134427,1057.5006069757228,1055.2733842045327]
["11:00:00",null,914.03535856590497,588.58158674714912,290.56985290039199,194.57138896674311,356.82079315154954,682.27456497030551,980.2862988170624,1076.2847627507115]
["12:00:00",null,1025.4577089180825,790.22334149518076,493.86471977392875,309.98470503243863,346.29771605691047,581.5320834798124,877.89070520106429,1061.7707199425545]
["13:00:00",null,1062.9512634023904,942.32091310147473,680.15831141351407,430.03475486029976,338.46923060171116,459.09958090262666,721.26218259058737,971.38573914380174]
["14:00:00",null,1094.6729899496304,1088.5318355808256,838.54939273927539,491.16198608640246,249.86444704184251,256.00560141064727,505.98804425219765,853.37545090507058]
["15:00:00",null,1012.8279597053474,1156.0426456133209,1027.9217117993555,703.51666366776612,372.85957871174094,229.64489280376728,357.76582661773273,682.17087474932225]
["16:00:00",null,718.695028728848,941.31172876792186,925.41690879401449,680.3215387763621,349.59916239645361,126.98246235737989,142.87728233128729,387.97265234893962]
["17:00:00",null,510.29179650409867,786.89954991012667,849.63813818935591,661.75614721195552,333.3122991668269,76.705654203759821,76.705654203759821,181.84794845897017]
["18:00:00",null,308.67521819637091,641.27724341366638,786.55374050587,659.40370777042403,334.30990992757,66.071354658110238,66.071354658110238,66.071354658110238]
[]
["β",null,"60°"]
["γ",null,"180°","225°","270°","315°","360°","45°","90°","135°"]
[null,null,"Z","ZW","W","NW","N","NO","O","ZO"]
["Tijdstip","Isol;mi"]
[null,"W/m2"]
["09:00:00",null,448.31201668255738,107.51238597710773,107.51238597710773,107.51238597710773,267.36674688119115,737.50817949242435,985.24477961470461,865.45580679259979]
["10:00:00",null,690.11959324719749,206.88774693542734,110.33121569610441,110.33121569610441,213.47318960136482,696.70503591313502,1036.4727198257453,1033.7449401592835]
["11:00:00",null,832.67591777270638,434.07807986263651,102.54370496625131,102.54370496625131,150.23023651678133,548.82807442685112,913.81641707018207,1031.3900434343889]
["12:00:00",null,944.55879699443619,656.45671191819235,293.49300987240917,102.57894407165882,112.76107888336739,400.86316395961137,763.82686600539455,989.03297101144437]
["13:00:00",null,982.73149461809328,834.99009175287597,513.90778986487021,207.57024676209699,100.24696132107735,243.16724339532553,564.24954528333149,870.5870883861046]
["14:00:00",null,1036.5608098744672,1029.0394625568497,722.87474774871976,297.41380306458916,108.62216767972956,108.62216767972956,315.57194176610034,741.03288645023076]
["15:00:00",null,925.94433773559786,1101.3457898093461,944.43033320279085,547.11691425008507,142.14634526090032,107.60602985698145,123.66034979370771,520.9737687464135]
["16:00:00",null,640.19447536854091,912.84313702751604,893.37603778278049,593.19674035183709,188.14620602610515,91.281954432504648,91.281954432504648,235.1439410428091]
["17:00:00",null,439.02636890130452,777.80029627248689,854.63906050582125,624.53155562940913,222.27163719601953,86.629002948662759,86.629002948662759,86.629002948662759]
["18:00:00",null,237.69274179199107,645.04536639132971,822.97201113874098,667.24566064873113,269.08869901948157,72.780651177397573,72.780651177397573,72.780651177397573]
[]
["β",null,"90°"]
["γ",null,"180°","225°","270°","315°","360°","45°","90°","135°"]
[null,null,"Z","ZW","W","NW","N","NO","O","ZO"]
["Tijdstip","Isol;mi"]
[null,"W/m2"]
["09:00:00",null,225.33117323129869,120.86237300289034,120.86237300289034,120.86237300289034,120.86237300289034,559.26613812506594,845.32772366250799,707.00733225292629]
["10:00:00",null,410.30441657851486,135.11248712532637,135.11248712532637,135.11248712532637,135.11248712532637,417.90863077033879,810.23855830810135,807.08878965865779]
["11:00:00",null,530.24470611857396,136.23450833816793,136.23450833816793,136.23450833816793,136.23450833816793,202.4854485893255,623.93768434173035,759.70001400368119]
["12:00:00",null,621.47485412852029,288.80322138279655,141.23621766577807,141.23621766577807,141.23621766577807,141.23621766577807,412.78359611315193,672.82920680993209]
["13:00:00",null,653.31934825266717,482.72227082329505,141.03319001149194,141.03319001149194,141.03319001149194,141.03319001149194,170.09801605381892,523.82614200036835]
["14:00:00",null,740.05836254715712,731.37345875016672,377.84489772848895,142.68851305273367,142.68851305273367,142.68851305273367,142.68851305273367,398.81211026308904]
["15:00:00",null,596.26586280738934,798.80201394944879,617.6116517258331,158.83363295584252,143.73988086183414,143.73988086183414,143.73988086183414,143.73988086183414]
["16:00:00",null,378.9800445550585,693.80760096105951,671.3289309824811,324.71173462866517,117.98985456349874,117.98985456349874,117.98985456349874,117.98985456349874]
["17:00:00",null,229.44250656268125,620.62494288703886,709.35070531566646,443.64544554976732,104.29910386450985,104.29910386450985,104.29910386450985,104.29910386450985]
["18:00:00",null,84.062269883674873,536.30610046197478,741.75809294382429,561.94079219317393,102.18873424043244,84.062269883674873,84.062269883674873,84.062269883674873]
[]
["β",null,"135°",null,null,null,null,null,null,null,"180°"]
["γ",null,"180°","225°","270°","315°","360°","45°","90°","135°","–"]
[null,null,"Z","ZW","W","NW","N","NO","O","ZO"]
["Tijdstip","Isol;mi"]
[null,"W/m2"]
["09:00:00",null,127.44195285705561,127.44195285705561,127.44195285705561,127.44195285705561,127.44195285705561,127.44195285705561,285.70048254794784,187.89319580585507,115.22984201449204]
["10:00:00",null,156.8347741344553,156.8347741344553,156.8347741344553,156.8347741344553,156.8347741344553,156.8347741344553,156.8347741344553,156.8347741344553,149.65194119685117]
["11:00:00",null,169.13627092036432,169.13627092036432,169.13627092036432,169.13627092036432,169.13627092036432,169.13627092036432,169.13627092036432,169.13627092036432,164.85904864181566]
["12:00:00",null,180.70906950537477,180.70906950537477,180.70906950537477,180.70906950537477,180.70906950537477,180.70906950537477,180.70906950537477,180.70906950537477,178.60408654773215]
["13:00:00",null,183.58273508441093,183.58273508441093,183.58273508441093,183.58273508441093,183.58273508441093,183.58273508441093,183.58273508441093,183.58273508441093,182.83218520754517]
["14:00:00",null,177.24485891011341,177.24485891011341,177.24485891011341,177.24485891011341,177.24485891011341,177.24485891011341,177.24485891011341,177.24485891011341,175.0173639810657]
["15:00:00",null,181.4489915384589,181.4489915384589,181.4489915384589,181.4489915384589,181.4489915384589,181.4489915384589,181.4489915384589,181.4489915384589,180.80535757695208]
["16:00:00",null,143.14364972909053,143.14364972909053,143.14364972909053,143.14364972909053,143.14364972909053,143.14364972909053,143.14364972909053,143.14364972909053,138.2405940081087]
["17:00:00",null,117.142883259454,137.14399170241506,199.88257998164428,117.142883259454,117.142883259454,117.142883259454,117.142883259454,117.142883259454,107.71328061116208]
["18:00:00",null,90.519797262932428,154.88326721076817,300.15976430297172,173.00973156752588,90.519797262932428,90.519797262932428,90.519797262932428,90.519797262932428,81.661204836509413]
[]
[]
[]
[]
["Tabel AA.xxx geeft de totale opvallende zonnestraling voor verschillende oriëntaties (γ) en hellingshoeken (β). Voor tussenliggende oriëntaties moet de waarde behorend bij de dichtstbijzijnde oriëntatie worden genomen. Indien de oriëntatie precies tussen twee aangegeven oriëntaties in ligt, moet de hoogste, naastliggende waarde worden genomen. Voor tussenliggende hellingshoeken moet lineair geïnterpoleerd worden tussen de tabelwaarden."]