{"text_format":"1","workbook":"xlsx","n_sheets":15,"sheets":["Software wijzigingen","Toelichting","Projectgegevens en Resultaten","Ruimte 1","Ruimte 2","Ruimte 3","Ruimte 4","Ruimte 5","Ruimte 6","Ruimte 7","Ruimte 8","Ruimte 9","Ruimte 10","Tabellen","Tabel AA"],"not_rendered":{"charts":0,"images":4,"macros":1,"external_links":0,"defined_names":40,"comments":11,"pivot_tables":0},"unopened":[],"bounds":{"document_bytes":16777216,"sheet_cells":100000,"rows_first":2000,"rows_last":500,"rows_between":2000,"halvings":0,"cell_chars":16384,"cell_head_chars":4096},"cells_cut":0,"cells_raw":0,"read":"whole","date_system":"1900"}

{"sheet":"Software wijzigingen","index":0,"n_rows":10,"n_cols":2,"rows_kept":10,"cut":false,"hidden":false,"merged":[[0,0,0,1],[2,0,2,1],[6,0,6,1]]}
["SOFTWARE WIJZIGINGEN REKENTOOL"]
[]
["Versie 2025.02"]
[]
[1,"Nieuwe opzet overeenkomstig 2025-versie van bijlage AA van NTA8800."]
[]
["Versie 2025.03"]
[]
[1,"Berekening geveloppervlak formules gecorrigeerd"]
[2,"Ruimte naam ruimte 4 correct weergegeven op resultaten overzicht"]

{"sheet":"Toelichting","index":1,"n_rows":26,"n_cols":4,"rows_kept":26,"cut":false,"hidden":false,"merged":[[0,0,0,4],[9,1,9,3],[24,1,24,3],[2,1,2,3],[3,1,3,3],[10,1,10,3],[12,1,12,3],[13,1,13,3],[16,1,16,3],[15,1,15,3],[6,1,6,3],[7,1,7,3],[18,1,18,3],[4,1,4,3]]}
["TOELICHTING REKENTOOL VEREENVOUDIGDE BEPALINGSMETHODE KOELBEHOEFTE (BIJLAGE AA - NTA 8800)"]
[]
[null,"Achtergrond"]
[null,"De berekeningen in deze tool volgen de 2025-versie van bijlage AA van NTA 8800. Deze bijlage is te downloaden op de website https://www.gebouwenergieprestatie.nl/. Een beschrijving van de berekening, en een nadere toelichting op de invoervelden is beschreven in de bijlage AA."]
[null,"Meer informatie over de eisen en de bepalingsmethoden met betrekking tot het risico op oververhitting is te lezen op https://www.rvo.nl/onderwerpen/wetten-en-regels-gebouwen/beng/indicatoren. Hier is ook de laatste versie van deze rekentool te downloaden."]
[]
[null,"Uitgangspunten"]
[null,"Met deze rekentool kunnen de meeste situaties worden doorgerekend. Toch kunnen zich situaties voordoen die niet direct in de rekentool ingevoerd kunnen worden. Voorbeelden hiervan zijn:\n- een woning met meer dan tien (verblijfs)ruimten;\n- een woning die opgesplitst is in meerdere rekenzones.\nIn dat geval is het aan de adviseur om daarmee pragmatisch om te gaan.\n\nOpgemerkt wordt dat:\n- uitsluitend de verblijfsruimten (zoals bijvoorbeeld keuken, woonkamer en slaapkamers) worden ingevoerd. Dus niet het toilet, de hal en de badkamer.\n- mocht een woning toch uit meerdere (gekoelde) rekenzones bestaan dan kan de volgende pragmatische aanpak worden gevolgd: voer alle (verblijfs)ruimten van de (gekoelde) rekenzones van de woning in. De luchtstromen van de verschillende gekoelde rekenzones worden bij elkaar opgeteld en ingevuld bij ‘Luchtstromen koeling’ in het tabblad ‘Invoerblad’. \nOnder ‘Bezetting’ wordt de gebruiksoppervlakte van de gezamenlijke gekoelde rekenzones ingevuld."]
[]
[null,"Invoer raamoppervlakken"]
[null,"In de rekenbladen van de ruimten kunnen twee verschillende typen ramen per oriëntatie worden ingevoerd, het is niet noodzakelijk elk raam apart in te voeren. Doorgaans zijn alle typen ramen in een woning gelijk en kan het raamoppervlak  (glas + kozijn) met dezelfde U- en gGL-waarden per gevel, per ruimte bij elkaar worden opgeteld.\nMocht er sprake zijn van een (verblijfs)ruimte met meer dan twee verschillende raam(typen) in één oriëntatie, dan kan er ook voor gekozen worden in die ruimte twee gevels met dezelfde oriëntatie op te geven. Op die manier kunnen er dan dus in totaal vier raam(typen) worden ingevoerd."]
[]
[null,"Woonvertrek"]
[null,"Een woonvertrek is een verblijfsruimte die bedoeld is, of in gebruik is als woonkamer, keuken en/of eetkamer. In bijlage AA wordt hier onderscheid in gemaakt omdat het aannemelijk is dat de bewoners samen komen in deze ruimten. Daarom is aangenomen dat de interne warmtelast van deze ruimten twee keer zo hoog is als in de andere verblijfsruimten."]
[]
[null,"Andere verblijfsruimten"]
[null,"Een andere verblijfsruimten is een verblijfsruimte anders dan de woonkamer, keuken en/of eetkamer. Bijvoorbeeld een slaapkamer."]
[]
[null,"Verklaring gebruike kleuren"]
[null,"Invoerveld"]
[null,"Titel veld"]
[null,"Resultaat veld/ toelichting"]
[null,"(sub) Totaal veld"]
[]
[null,"Versie rekentool"]
[null,"Versie 2025.03","2025-03-19","Kleine fouten opgelost, opmaak bijgewerkt"]

{"sheet":"Projectgegevens en Resultaten","index":2,"n_rows":91,"n_cols":22,"rows_kept":91,"cut":false,"hidden":false,"merged":[[62,5,62,13],[63,5,63,13],[56,5,56,13],[72,0,73,20],[59,5,59,13],[60,5,60,13],[58,5,58,13],[65,0,65,20],[19,4,19,15],[27,4,27,15],[28,4,32,15],[57,5,57,13],[61,5,61,13],[55,5,55,13],[54,5,54,13],[52,0,52,20],[34,0,34,20],[20,4,25,15],[10,0,10,20],[2,0,2,20],[0,0,0,20],[1,0,1,20],[4,1,4,5],[6,1,6,5],[5,1,5,2],[7,1,7,2],[8,1,8,5]]}
["REKENTOOL VEREENVOUDIGDE BEPALINGSMETHODE KOELBEHOEFTE (2025-versie BIJLAGE AA NTA 8800)"]
["DISCLAIMER: De rekentool is gebaseerd op de 2025-versie van Bijlage AA van NTA8800 - Energieprestatie van gebouwen - Bepalingsmethode.\nvoor meer informatie en de actuele versie van de rekentool: zie https://www.gebouwenergieprestatie.nl en/of https://www.rvo.nl/onderwerpen/wetten-en-regels-gebouwen/beng/indicatoren\n\n  De bepalingsmethode in bijlage AA is afgeleid van een reguliere koellastberekening. Deze methode is uitsluitend bedoeld om te toetsen of een woning of bouwplan volgens \nde eisen van de bouwregelgeving het risico op oververhitting in woningen en appartementen in voldoende mate beperkt. \nDeze methode is niet bedoeld en niet geschikt als vervanging voor een dimensioneringsmethode voor de daadwerkelijk te installeren koelcapaciteit.\n\nDe rekentool is ontwikkeld door Nieman Raadgevende Ingenieurs in opdracht van de Rijksdienst voor Ondernemend Nederland (RVO).\nAan de rekentool kunnen geen rechten worden ontleend. Hoewel dit instrument met de grootst mogelijke zorg is samengesteld kan RVO\n geen enkele aansprakelijkheid aanvaarden voor schade als gevolg van eventuele onjuistheden en/of uitvoering of gebruik van het instrument."]
["PROJECTGEGEVENS"]
[]
["Project"]
["Projectnummer"]
["Opdrachtgever"]
["Datum"]
["Omschrijving"]
[]
["BENG GEGEVENS"]
[]
["Algemeen"]
["Bouwjaar"]
["Is meer dan 50% van de gebouwschil aantoonbaar nageisoleerd?","Nee"]
["Factor thermische isolatie ondoorzichtige delen f;iso",{"$f":"o_F_Iso(B14,B15)","v":{"$error":"#NAME?"}}]
["Orientatie voorzijde woning "]
["Orientatiehoek voorzijde woning Ƴ",{"$f":"o_OrientatiehOEK(B17)","v":{"$error":"#NAME?"}}]
[]
["Luchtstromen koeling",null,null,null,"Toelichting"]
["Infiltratie in maand juli q;v;eff;lea;in",null,"m³/h",null,"Haal de luchtstromen uit de NTA8800 software. Deze waarden zijn terug te vinden in de resultatenoverzichten die vanuit de software beschikbaar zijn. \n\nBij een BENG-berekening op woongebouw-niveau worden de luchtvolumestromen niet per appartement gegeven. In dat geval moet, naar inzicht van de adviseur, het debiet worden bepaald. Dat kan bijvoorbeeld door het totale debiet uit de BENG-berekening van het woongebouw naar rato van de gebruiksoppervlakte over de individuele appartementen te verdelen of door een aparte BENG-berekening op te stellen van het appartement waarvoor de bijlage AA berekening wordt gemaakt."]
["Natuurlijke toevoer in maand juli q;v;eff;vent;in",null,"m³/h"]
["Mechanische toevoer in maand juli q;v;mech;in",null,"m³/h"]
[]
[]
[]
[]
["Bezetting",null,null,null,"Toelichting"]
["Gebruiksoppervlak rekenzone A;g",null,"m²",null,"Haal het gebruiksoppervlak A;g uit de NTA8800 software. Uitgangspunt in deze rekentool is dat er één rekenzone per woning is."]
["Aantal woonfuncties in de rekenzone",1,"stuks"]
["Gemiddelde bezetting per woonfunctie Np;woon;zi",{"$f":"IF(B29/B30<=30,1,IF(B29/B30<=100,2.28-1.28/70*(100-B29/B30),1.28+0.01*(B29/B30)))","v":1},"personen"]
["Interne warmtelast Pint;zi",{"$f":"180*B31*B30","v":180},"W"]
["Rekenwaarde internewarmtelast qint;calc;zi",{"$f":"IFERROR(B32/(SUMIF(B39:T39,\"Woonvertrek\",B40:T40)*2+SUMIF(B39:T39,\"Andere verblijfsruimte\",B40:T40)),0)","v":0},"W/m²"]
[]
["RESULTATEN OP RUIMTENIVEAU"]
[]
[null,"Ruimte 1",null,"Ruimte 2",null,"Ruimte 3",null,"Ruimte 4",null,"Ruimte 5",null,"Ruimte 6",null,"Ruimte 7",null,"Ruimte 8",null,"Ruimte 9",null,"Ruimte 10"]
["Ruimtenaam",{"$f":"IF('Ruimte 1'!$B$3=0,\"\",'Ruimte 1'!$B$3)","v":1},null,{"$f":"IF('Ruimte 2'!$B$3=0,\"\",'Ruimte 2'!$B$3)","v":2},null,{"$f":"IF('Ruimte 3'!$B$3=0,\"\",'Ruimte 3'!$B$3)","v":3},null,{"$f":"IF('Ruimte 4'!$B$3=0,\"\",'Ruimte 4'!$B$3)","v":4},null,{"$f":"IF('Ruimte 5'!$B$3=0,\"\",'Ruimte 5'!$B$3)","v":5},null,{"$f":"IF('Ruimte 6'!$B$3=0,\"\",'Ruimte 6'!$B$3)","v":6},null,{"$f":"IF('Ruimte 7'!$B$3=0,\"\",'Ruimte 7'!$B$3)","v":7},null,{"$f":"IF('Ruimte 8'!$B$3=0,\"\",'Ruimte 8'!$B$3)","v":8},null,{"$f":"IF('Ruimte 9'!$B$3=0,\"\",'Ruimte 9'!$B$3)","v":9},null,{"$f":"IF('Ruimte 10'!$B$3=0,\"\",'Ruimte 10'!$B$3)","v":10}]
["Type verblijfsruimte",{"$f":"'Ruimte 1'!$B$4","v":"Andere verblijfsruimte"},null,{"$f":"'Ruimte 2'!$B$4","v":"Andere verblijfsruimte"},null,{"$f":"'Ruimte 3'!$B$4","v":"Andere verblijfsruimte"},null,{"$f":"'Ruimte 4'!$B$4","v":"Andere verblijfsruimte"},null,{"$f":"'Ruimte 5'!$B$4","v":"Andere verblijfsruimte"},null,{"$f":"'Ruimte 6'!$B$4","v":"Andere verblijfsruimte"},null,{"$f":"'Ruimte 7'!$B$4","v":"Andere verblijfsruimte"},null,{"$f":"'Ruimte 8'!$B$4","v":"Andere verblijfsruimte"},null,{"$f":"'Ruimte 9'!$B$4","v":"Andere verblijfsruimte"},null,{"$f":"'Ruimte 10'!$B$4","v":"Andere verblijfsruimte"}]
["Vloeroppervlak (gebruiksoppervlak)",{"$f":"'Ruimte 1'!$B$5","v":0},"m²",{"$f":"'Ruimte 2'!$B$5","v":0},"m²",{"$f":"'Ruimte 3'!$B$5","v":0},"m²",{"$f":"'Ruimte 4'!$B$5","v":0},"m²",{"$f":"'Ruimte 5'!$B$5","v":0},"m²",{"$f":"'Ruimte 6'!$B$5","v":0},"m²",{"$f":"'Ruimte 7'!$B$5","v":0},"m²",{"$f":"'Ruimte 8'!$B$5","v":0},"m²",{"$f":"'Ruimte 9'!$B$5","v":0},"m²",{"$f":"'Ruimte 10'!$B$5","v":0},"m²"]
[]
["Buitenluchttemperatuur bij tijdstip max koellast  tmax,zi",{"$f":"'Ruimte 1'!$B$53","v":{"$error":"#NAME?"}},"°C",{"$f":"'Ruimte 2'!$B$53","v":{"$error":"#NAME?"}},"°C",{"$f":"'Ruimte 3'!$B$53","v":{"$error":"#NAME?"}},"°C",{"$f":"'Ruimte 4'!$B$53","v":{"$error":"#NAME?"}},"°C",{"$f":"'Ruimte 5'!$B$53","v":{"$error":"#NAME?"}},"°C",{"$f":"'Ruimte 6'!$B$53","v":{"$error":"#NAME?"}},"°C",{"$f":"'Ruimte 7'!$B$53","v":{"$error":"#NAME?"}},"°C",{"$f":"'Ruimte 8'!$B$53","v":{"$error":"#NAME?"}},"°C",{"$f":"'Ruimte 9'!$B$53","v":{"$error":"#NAME?"}},"°C",{"$f":"'Ruimte 10'!$B$53","v":{"$error":"#NAME?"}},"°C"]
["Koellast door interne warmtelast Pint;calc;woon/overig;zi",{"$f":"'Ruimte 1'!$B$60","v":0},"W",{"$f":"'Ruimte 2'!$B$60","v":0},"W",{"$f":"'Ruimte 3'!$B$60","v":0},"W",{"$f":"'Ruimte 4'!$B$60","v":0},"W",{"$f":"'Ruimte 5'!$B$60","v":0},"W",{"$f":"'Ruimte 6'!$B$60","v":0},"W",{"$f":"'Ruimte 7'!$B$60","v":0},"W",{"$f":"'Ruimte 8'!$B$60","v":0},"W",{"$f":"'Ruimte 9'!$B$60","v":0},"W",{"$f":"'Ruimte 10'!$B$60","v":0},"W"]
["Koellast door buitenluchttoetreding Pv;calc;vr;zi",{"$f":"'Ruimte 1'!$B$61","v":0},"W",{"$f":"'Ruimte 2'!$B$61","v":0},"W",{"$f":"'Ruimte 3'!$B$61","v":0},"W",{"$f":"'Ruimte 4'!$B$61","v":0},"W",{"$f":"'Ruimte 5'!$B$61","v":0},"W",{"$f":"'Ruimte 6'!$B$61","v":0},"W",{"$f":"'Ruimte 7'!$B$61","v":0},"W",{"$f":"'Ruimte 8'!$B$61","v":0},"W",{"$f":"'Ruimte 9'!$B$61","v":0},"W",{"$f":"'Ruimte 10'!$B$61","v":0},"W"]
["Koellast door transmissie ondoorzichtige delen Ptr;ntr;vr;zi",{"$f":"SUM('Ruimte 1'!$B$55:$T$55)","v":0},"W",{"$f":"SUM('Ruimte 2'!$B$55:$T$55)","v":0},"W",{"$f":"SUM('Ruimte 3'!$B$55:$T$55)","v":0},"W",{"$f":"SUM('Ruimte 4'!$B$55:$T$55)","v":0},"W",{"$f":"SUM('Ruimte 5'!$B$55:$T$55)","v":0},"W",{"$f":"SUM('Ruimte 6'!$B$55:$T$55)","v":0},"W",{"$f":"SUM('Ruimte 7'!$B$55:$T$55)","v":0},"W",{"$f":"SUM('Ruimte 8'!$B$55:$T$55)","v":0},"W",{"$f":"SUM('Ruimte 9'!$B$55:$T$55)","v":0},"W",{"$f":"SUM('Ruimte 10'!$B$55:$T$55)","v":0},"W"]
["Koellastbijdrage zoninstraling transparante delen Psol;vr;zi",{"$f":"SUM('Ruimte 1'!$B$56:$T$56)","v":{"$error":"#NAME?"}},"W",{"$f":"SUM('Ruimte 2'!$B$56:$T$56)","v":{"$error":"#NAME?"}},"W",{"$f":"SUM('Ruimte 3'!$B$56:$T$56)","v":{"$error":"#NAME?"}},"W",{"$f":"SUM('Ruimte 4'!$B$56:$T$56)","v":{"$error":"#NAME?"}},"W",{"$f":"SUM('Ruimte 5'!$B$56:$T$56)","v":{"$error":"#NAME?"}},"W",{"$f":"SUM('Ruimte 6'!$B$56:$T$56)","v":{"$error":"#NAME?"}},"W",{"$f":"SUM('Ruimte 7'!$B$56:$T$56)","v":{"$error":"#NAME?"}},"W",{"$f":"SUM('Ruimte 8'!$B$56:$T$56)","v":{"$error":"#NAME?"}},"W",{"$f":"SUM('Ruimte 9'!$B$56:$T$56)","v":{"$error":"#NAME?"}},"W",{"$f":"SUM('Ruimte 10'!$B$56:$T$56)","v":{"$error":"#NAME?"}},"W"]
["Koellastbijdrage transmissie transparante delen Ptr;gl;vr;zi",{"$f":"SUM('Ruimte 1'!$B$57:$T$57)","v":0},"W",{"$f":"SUM('Ruimte 2'!$B$57:$T$57)","v":0},"W",{"$f":"SUM('Ruimte 3'!$B$57:$T$57)","v":0},"W",{"$f":"SUM('Ruimte 4'!$B$57:$T$57)","v":0},"W",{"$f":"SUM('Ruimte 5'!$B$57:$T$57)","v":0},"W",{"$f":"SUM('Ruimte 6'!$B$57:$T$57)","v":0},"W",{"$f":"SUM('Ruimte 7'!$B$57:$T$57)","v":0},"W",{"$f":"SUM('Ruimte 8'!$B$57:$T$57)","v":0},"W",{"$f":"SUM('Ruimte 9'!$B$57:$T$57)","v":0},"W",{"$f":"SUM('Ruimte 10'!$B$57:$T$57)","v":0},"W"]
[]
["Koelbehoefte verblijfsruimte",{"$f":"IFERROR(SUM(B43:B47)/B40,0)","v":0},"W/m²",{"$f":"IFERROR(SUM(D43:D47)/D40,0)","v":0},"W/m²",{"$f":"IFERROR(SUM(F43:F47)/F40,0)","v":0},"W/m²",{"$f":"IFERROR(SUM(H43:H47)/H40,0)","v":0},"W/m²",{"$f":"IFERROR(SUM(J43:J47)/J40,0)","v":0},"W/m²",{"$f":"IFERROR(SUM(L43:L47)/L40,0)","v":0},"W/m²",{"$f":"IFERROR(SUM(N43:N47)/N40,0)","v":0},"W/m²",{"$f":"IFERROR(SUM(P43:P47)/P40,0)","v":0},"W/m²",{"$f":"IFERROR(SUM(R43:R47)/R40,0)","v":0},"W/m²",{"$f":"IFERROR(SUM(T43:T47)/T40,0)","v":0},"W/m²"]
["Vaste aftrek van 35W/m² ",35,"W/m²",35,"W/m²",35,"W/m²",35,"W/m²",35,"W/m²",35,"W/m²",35,"W/m²",35,"W/m²",35,"W/m²",35,"W/m²"]
["Minimaal te installeren koelcapaciteit",{"$f":"MAX(0,B49-B50)","v":0},"W/m²",{"$f":"MAX(0,D49-D50)","v":0},"W/m²",{"$f":"MAX(0,F49-F50)","v":0},"W/m²",{"$f":"MAX(0,H49-H50)","v":0},"W/m²",{"$f":"MAX(0,J49-J50)","v":0},"W/m²",{"$f":"MAX(0,L49-L50)","v":0},"W/m²",{"$f":"MAX(0,N49-N50)","v":0},"W/m²",{"$f":"MAX(0,P49-P50)","v":0},"W/m²",{"$f":"MAX(0,R49-R50)","v":0},"W/m²",{"$f":"MAX(0,T49-T50)","v":0},"W/m²"]
[]
["BENODIGDE KOELCAPACITEIT VERBLIJFSRUIMTE AFGIFTE"]
[]
[{"$f":"\"Benodigde koelcapaciteit \" &B37&IF(B38=\"\",\"\",\" - \" &B38)","v":"Benodigde koelcapaciteit Ruimte 1 - 1"},{"$f":"B40*B51","v":0},"W",{"$f":"B51","v":0},"W/m²",{"$f":"IF(D55<=0,\"De ruimte moet actief gekoeld worden, aan de minimaal benodigde koelcapaciteit in de ruimte wordt geen eis gesteld.\", \"De berekende koelcapaciteit moet minimaal gerealiseerd worden om het risico op oververhitting voldoende te beperken\")","v":"De ruimte moet actief gekoeld worden, aan de minimaal benodigde koelcapaciteit in de ruimte wordt geen eis gesteld."}]
[{"$f":"\"Benodigde koelcapaciteit \" &D37&IF(D38=\"\",\"\",\" - \" &D38)","v":"Benodigde koelcapaciteit Ruimte 2 - 2"},{"$f":"D40*D51","v":0},"W",{"$f":"D51","v":0},"W/m²",{"$f":"IF(D56<=0,\"De ruimte moet actief gekoeld worden, aan de minimaal benodigde koelcapaciteit in de ruimte wordt geen eis gesteld.\", \"De berekende koelcapaciteit moet minimaal gerealiseerd worden om het risico op oververhitting voldoende te beperken\")","v":"De ruimte moet actief gekoeld worden, aan de minimaal benodigde koelcapaciteit in de ruimte wordt geen eis gesteld."}]
[{"$f":"\"Benodigde koelcapaciteit \" &F37&IF(F38=\"\",\"\",\" - \" &F38)","v":"Benodigde koelcapaciteit Ruimte 3 - 3"},{"$f":"F40*F51","v":0},"W",{"$f":"F51","v":0},"W/m²","De ruimte moet actief gekoeld worden, aan de minimaal benodigde koelcapaciteit in de ruimte wordt geen eis gesteld."]
[{"$f":"\"Benodigde koelcapaciteit \" &H37&IF(H38=\"\",\"\",\" - \" &H38)","v":"Benodigde koelcapaciteit Ruimte 4 - 4"},{"$f":"H40*H51","v":0},"W",{"$f":"H51","v":0},"W/m²","De ruimte moet actief gekoeld worden, aan de minimaal benodigde koelcapaciteit in de ruimte wordt geen eis gesteld."]
[{"$f":"\"Benodigde koelcapaciteit \" &J37&IF(J38=\"\",\"\",\" - \" &J38)","v":"Benodigde koelcapaciteit Ruimte 5 - 5"},{"$f":"J40*J51","v":0},"W",{"$f":"J51","v":0},"W/m²","De ruimte moet actief gekoeld worden, aan de minimaal benodigde koelcapaciteit in de ruimte wordt geen eis gesteld."]
[{"$f":"\"Benodigde koelcapaciteit \" &L37&IF(L38=\"\",\"\",\" - \" &L38)","v":"Benodigde koelcapaciteit Ruimte 6 - 6"},{"$f":"L40*L51","v":0},"W",{"$f":"L51","v":0},"W/m²","De ruimte moet actief gekoeld worden, aan de minimaal benodigde koelcapaciteit in de ruimte wordt geen eis gesteld."]
[{"$f":"\"Benodigde koelcapaciteit \" &N37&IF(N38=\"\",\"\",\" - \" &N38)","v":"Benodigde koelcapaciteit Ruimte 7 - 7"},{"$f":"N40*N51","v":0},"W",{"$f":"N51","v":0},"W/m²",{"$f":"IF(D61<=0,\"De ruimte moet actief gekoeld worden, aan de minimaal benodigde koelcapaciteit in de ruimte wordt geen eis gesteld.\", \"De berekende koelcapaciteit moet minimaal gerealiseerd worden om het risico op oververhitting voldoende te beperken\")","v":"De ruimte moet actief gekoeld worden, aan de minimaal benodigde koelcapaciteit in de ruimte wordt geen eis gesteld."}]
[{"$f":"\"Benodigde koelcapaciteit \" &P37&IF(P38=\"\",\"\",\" - \" &P38)","v":"Benodigde koelcapaciteit Ruimte 8 - 8"},{"$f":"P40*P51","v":0},"W",{"$f":"P51","v":0},"W/m²","De ruimte moet actief gekoeld worden, aan de minimaal benodigde koelcapaciteit in de ruimte wordt geen eis gesteld."]
[{"$f":"\"Benodigde koelcapaciteit \" &R37&IF(R38=\"\",\"\",\" - \" &R38)","v":"Benodigde koelcapaciteit Ruimte 9 - 9"},{"$f":"R40*R51","v":0},"W",{"$f":"R51","v":0},"W/m²","De ruimte moet actief gekoeld worden, aan de minimaal benodigde koelcapaciteit in de ruimte wordt geen eis gesteld."]
[{"$f":"\"Benodigde koelcapaciteit \" &T37&IF(T38=\"\",\"\",\" - \" &T38)","v":"Benodigde koelcapaciteit Ruimte 10 - 10"},{"$f":"T40*T51","v":0},"W",{"$f":"T51","v":0},"W/m²","De ruimte moet actief gekoeld worden, aan de minimaal benodigde koelcapaciteit in de ruimte wordt geen eis gesteld."]
[]
["BENODIGDE KOELCAPACITEIT OPWEKKER"]
[]
["Minimaal op te stellen koelvermogen opwekker",{"$f":"MAX(0,SUM(B43:T47)-(35*SUM(B40:T40)))","v":{"$error":"#NAME?"}},"W",null,null,{"$f":"IF(B68<=0,\"De woning moet actief gekoeld worden, aan de minimaal benodigde koelcapaciteit van de opwekker wordt geen eis gesteld.\", \"De minimaal berekende koelcapaciteit van de opwekker moet gerealiseerd worden om het risico op oververhitting voldoende te beperken\")","v":{"$error":"#NAME?"}}]
[]
[]
[]
[]
["Onderstaande tabellen worden verwijderd in de uiteindelijke versie. De tabellen dienen om vast te stellen welk tijdstip tot de hoogste belasting van de opwekker leidt"]
[]
[null,"Ruimte 1",null,"Ruimte 2",null,"Ruimte 3",null,"Ruimte 4",null,"Ruimte 5",null,"Ruimte 6",null,"Ruimte 7",null,"Ruimte 8",null,"Ruimte 9",null,"Ruimte 10"]
[]
["09:00:00",{"$f":"'Ruimte 1'!$T77","v":0},"W",{"$f":"'Ruimte 2'!$T77","v":{"$error":"#NAME?"}},"W",{"$f":"'Ruimte 3'!$T77","v":{"$error":"#NAME?"}},"W",{"$f":"'Ruimte 4'!$T77","v":{"$error":"#NAME?"}},"W",{"$f":"'Ruimte 5'!$T77","v":{"$error":"#NAME?"}},"W",{"$f":"'Ruimte 6'!$T77","v":{"$error":"#NAME?"}},"W",{"$f":"'Ruimte 7'!$T77","v":{"$error":"#NAME?"}},"W",{"$f":"'Ruimte 8'!$T77","v":{"$error":"#NAME?"}},"W",{"$f":"'Ruimte 9'!$T77","v":{"$error":"#NAME?"}},"W",{"$f":"'Ruimte 10'!$T77","v":{"$error":"#NAME?"}},"W",{"$f":"SUM(B77:T77)","v":{"$error":"#NAME?"}}]
["10:00:00",{"$f":"'Ruimte 1'!$T78","v":0},"W",{"$f":"'Ruimte 2'!$T78","v":{"$error":"#NAME?"}},"W",{"$f":"'Ruimte 3'!$T78","v":{"$error":"#NAME?"}},"W",{"$f":"'Ruimte 4'!$T78","v":{"$error":"#NAME?"}},"W",{"$f":"'Ruimte 5'!$T78","v":{"$error":"#NAME?"}},"W",{"$f":"'Ruimte 6'!$T78","v":{"$error":"#NAME?"}},"W",{"$f":"'Ruimte 7'!$T78","v":{"$error":"#NAME?"}},"W",{"$f":"'Ruimte 8'!$T78","v":{"$error":"#NAME?"}},"W",{"$f":"'Ruimte 9'!$T78","v":{"$error":"#NAME?"}},"W",{"$f":"'Ruimte 10'!$T78","v":{"$error":"#NAME?"}},"W",{"$error":"#NAME?"}]
["11:00:00",{"$f":"'Ruimte 1'!$T79","v":0},"W",{"$f":"'Ruimte 2'!$T79","v":{"$error":"#NAME?"}},"W",{"$f":"'Ruimte 3'!$T79","v":{"$error":"#NAME?"}},"W",{"$f":"'Ruimte 4'!$T79","v":{"$error":"#NAME?"}},"W",{"$f":"'Ruimte 5'!$T79","v":{"$error":"#NAME?"}},"W",{"$f":"'Ruimte 6'!$T79","v":{"$error":"#NAME?"}},"W",{"$f":"'Ruimte 7'!$T79","v":{"$error":"#NAME?"}},"W",{"$f":"'Ruimte 8'!$T79","v":{"$error":"#NAME?"}},"W",{"$f":"'Ruimte 9'!$T79","v":{"$error":"#NAME?"}},"W",{"$f":"'Ruimte 10'!$T79","v":{"$error":"#NAME?"}},"W",{"$error":"#NAME?"}]
["12:00:00",{"$f":"'Ruimte 1'!$T80","v":0},"W",{"$f":"'Ruimte 2'!$T80","v":{"$error":"#NAME?"}},"W",{"$f":"'Ruimte 3'!$T80","v":{"$error":"#NAME?"}},"W",{"$f":"'Ruimte 4'!$T80","v":{"$error":"#NAME?"}},"W",{"$f":"'Ruimte 5'!$T80","v":{"$error":"#NAME?"}},"W",{"$f":"'Ruimte 6'!$T80","v":{"$error":"#NAME?"}},"W",{"$f":"'Ruimte 7'!$T80","v":{"$error":"#NAME?"}},"W",{"$f":"'Ruimte 8'!$T80","v":{"$error":"#NAME?"}},"W",{"$f":"'Ruimte 9'!$T80","v":{"$error":"#NAME?"}},"W",{"$f":"'Ruimte 10'!$T80","v":{"$error":"#NAME?"}},"W",{"$error":"#NAME?"}]
["13:00:00",{"$f":"'Ruimte 1'!$T81","v":0},"W",{"$f":"'Ruimte 2'!$T81","v":{"$error":"#NAME?"}},"W",{"$f":"'Ruimte 3'!$T81","v":{"$error":"#NAME?"}},"W",{"$f":"'Ruimte 4'!$T81","v":{"$error":"#NAME?"}},"W",{"$f":"'Ruimte 5'!$T81","v":{"$error":"#NAME?"}},"W",{"$f":"'Ruimte 6'!$T81","v":{"$error":"#NAME?"}},"W",{"$f":"'Ruimte 7'!$T81","v":{"$error":"#NAME?"}},"W",{"$f":"'Ruimte 8'!$T81","v":{"$error":"#NAME?"}},"W",{"$f":"'Ruimte 9'!$T81","v":{"$error":"#NAME?"}},"W",{"$f":"'Ruimte 10'!$T81","v":{"$error":"#NAME?"}},"W",{"$error":"#NAME?"}]
["14:00:00",{"$f":"'Ruimte 1'!$T82","v":0},"W",{"$f":"'Ruimte 2'!$T82","v":{"$error":"#NAME?"}},"W",{"$f":"'Ruimte 3'!$T82","v":{"$error":"#NAME?"}},"W",{"$f":"'Ruimte 4'!$T82","v":{"$error":"#NAME?"}},"W",{"$f":"'Ruimte 5'!$T82","v":{"$error":"#NAME?"}},"W",{"$f":"'Ruimte 6'!$T82","v":{"$error":"#NAME?"}},"W",{"$f":"'Ruimte 7'!$T82","v":{"$error":"#NAME?"}},"W",{"$f":"'Ruimte 8'!$T82","v":{"$error":"#NAME?"}},"W",{"$f":"'Ruimte 9'!$T82","v":{"$error":"#NAME?"}},"W",{"$f":"'Ruimte 10'!$T82","v":{"$error":"#NAME?"}},"W",{"$error":"#NAME?"}]
["15:00:00",{"$f":"'Ruimte 1'!$T83","v":0},"W",{"$f":"'Ruimte 2'!$T83","v":{"$error":"#NAME?"}},"W",{"$f":"'Ruimte 3'!$T83","v":{"$error":"#NAME?"}},"W",{"$f":"'Ruimte 4'!$T83","v":{"$error":"#NAME?"}},"W",{"$f":"'Ruimte 5'!$T83","v":{"$error":"#NAME?"}},"W",{"$f":"'Ruimte 6'!$T83","v":{"$error":"#NAME?"}},"W",{"$f":"'Ruimte 7'!$T83","v":{"$error":"#NAME?"}},"W",{"$f":"'Ruimte 8'!$T83","v":{"$error":"#NAME?"}},"W",{"$f":"'Ruimte 9'!$T83","v":{"$error":"#NAME?"}},"W",{"$f":"'Ruimte 10'!$T83","v":{"$error":"#NAME?"}},"W",{"$error":"#NAME?"}]
["16:00:00",{"$f":"'Ruimte 1'!$T84","v":0},"W",{"$f":"'Ruimte 2'!$T84","v":{"$error":"#NAME?"}},"W",{"$f":"'Ruimte 3'!$T84","v":{"$error":"#NAME?"}},"W",{"$f":"'Ruimte 4'!$T84","v":{"$error":"#NAME?"}},"W",{"$f":"'Ruimte 5'!$T84","v":{"$error":"#NAME?"}},"W",{"$f":"'Ruimte 6'!$T84","v":{"$error":"#NAME?"}},"W",{"$f":"'Ruimte 7'!$T84","v":{"$error":"#NAME?"}},"W",{"$f":"'Ruimte 8'!$T84","v":{"$error":"#NAME?"}},"W",{"$f":"'Ruimte 9'!$T84","v":{"$error":"#NAME?"}},"W",{"$f":"'Ruimte 10'!$T84","v":{"$error":"#NAME?"}},"W",{"$error":"#NAME?"}]
["17:00:00",{"$f":"'Ruimte 1'!$T85","v":0},"W",{"$f":"'Ruimte 2'!$T85","v":{"$error":"#NAME?"}},"W",{"$f":"'Ruimte 3'!$T85","v":{"$error":"#NAME?"}},"W",{"$f":"'Ruimte 4'!$T85","v":{"$error":"#NAME?"}},"W",{"$f":"'Ruimte 5'!$T85","v":{"$error":"#NAME?"}},"W",{"$f":"'Ruimte 6'!$T85","v":{"$error":"#NAME?"}},"W",{"$f":"'Ruimte 7'!$T85","v":{"$error":"#NAME?"}},"W",{"$f":"'Ruimte 8'!$T85","v":{"$error":"#NAME?"}},"W",{"$f":"'Ruimte 9'!$T85","v":{"$error":"#NAME?"}},"W",{"$f":"'Ruimte 10'!$T85","v":{"$error":"#NAME?"}},"W",{"$error":"#NAME?"}]
["18:00:00",{"$f":"'Ruimte 1'!$T86","v":0},"W",{"$f":"'Ruimte 2'!$T86","v":{"$error":"#NAME?"}},"W",{"$f":"'Ruimte 3'!$T86","v":{"$error":"#NAME?"}},"W",{"$f":"'Ruimte 4'!$T86","v":{"$error":"#NAME?"}},"W",{"$f":"'Ruimte 5'!$T86","v":{"$error":"#NAME?"}},"W",{"$f":"'Ruimte 6'!$T86","v":{"$error":"#NAME?"}},"W",{"$f":"'Ruimte 7'!$T86","v":{"$error":"#NAME?"}},"W",{"$f":"'Ruimte 8'!$T86","v":{"$error":"#NAME?"}},"W",{"$f":"'Ruimte 9'!$T86","v":{"$error":"#NAME?"}},"W",{"$f":"'Ruimte 10'!$T86","v":{"$error":"#NAME?"}},"W",{"$error":"#NAME?"}]
[]
[]
["Maatgevende tijdstip",{"$f":"IF(MAX(V77:V86)=0,\"Geen glas aanwezig\",_xlfn.XLOOKUP(MAX(V77:V86),V77:V86,A77:A86,\"nvt\"))","v":{"$error":"#NAME?"}}]
["Minimaal op te stellen koelvermogen opwekker",{"$f":"MAX(V77:V86)","v":{"$error":"#NAME?"}},"W",null,null,"Aftrek 35W/m²",null,"Totaal met afrek"]
["som VAN ALLE RUIMTEN (INCLUSIES AFTREK 35W/m²",{"$f":"SUM(B43:T47)","v":{"$error":"#NAME?"}},null,"AFTREK",null,{"$f":"35*SUM(B40:T40)","v":0},null,{"$f":"B91-F91","v":{"$error":"#NAME?"}}]

{"sheet":"Ruimte 1","index":3,"n_rows":88,"n_cols":21,"rows_kept":88,"cut":false,"hidden":false,"merged":[[70,0,71,20],[6,1,6,3],[6,5,6,7],[6,9,6,11],[40,9,40,11],[40,13,40,15],[41,13,41,15],[40,1,40,3],[41,1,41,3],[59,1,59,3],[60,1,60,3],[62,1,62,3],[63,1,63,3],[54,9,54,11],[55,9,55,11],[56,9,56,11],[57,9,57,11],[57,5,57,7],[54,1,54,3],[55,1,55,3],[55,5,55,7],[56,1,56,3],[54,5,54,7],[56,5,56,7],[57,1,57,3],[55,17,55,19],[56,17,56,19],[57,17,57,19],[6,17,6,20],[0,0,0,20],[40,17,40,19],[41,17,41,19],[54,17,54,19],[54,13,54,15],[55,13,55,15],[56,13,56,15],[57,13,57,15],[6,13,6,15],[41,5,41,7],[40,5,40,7],[41,9,41,11]]}
["RUIMTE 1"]
[]
["Ruimtenaam",1]
["Type verblijfsruimte","Andere verblijfsruimte"]
["Vloeroppervlak verblijfsruimte Avr  (gebruiksoppervlak)",0,"m²"]
[]
[null,"Voorzijde woning",null,null,null,"Linker zijde woning",null,null,null,"Achterzijde woning",null,null,null,"Rechter zijde woning",null,null,null,"Platdak"]
["Orientatie gevel / dakvlak (Helling > 15°C)",{"$f":"'Projectgegevens en Resultaten'!$B$17","v":0},null,null,null,{"$f":"o_Orientatie(F9)","v":{"$error":"#NAME?"}},null,null,null,{"$f":"o_Orientatie(J9)","v":{"$error":"#NAME?"}},null,null,null,{"$f":"o_Orientatie(N9)","v":{"$error":"#NAME?"}},null,null,null,"Horizontaal"]
["Orientatiehoek gevel Ƴ",{"$f":"o_OrientatiehOEK(B8)","v":{"$error":"#NAME?"}},null,null,null,{"$f":"IF(B9+90>360,B9+90-360,B9+90)","v":{"$error":"#NAME?"}},null,null,null,{"$f":"IF(F9+90>360,F9+90-360,F9+90)","v":{"$error":"#NAME?"}},null,null,null,{"$f":"IF(J9+90>360,J9+90-360,J9+90)","v":{"$error":"#NAME?"}}]
["Grenst aan buitenlucht ja of nee","Nee",null,null,null,"Nee",null,null,null,"Nee",null,null,null,"Nee",null,null,null,"Nee"]
["Hellingshoek constructie ≥ 15° = hellenddak 90° = gevel",90,"°",null,null,90,"°",null,null,90,"°",null,null,90,"°",null,null,0,"°"]
["Type constructie",{"$f":"o_TypeConstructie(B10,B11)","v":"Woningscheidend"},null,null,null,{"$f":"o_TypeConstructie(F10,F11)","v":"Woningscheidend"},null,null,null,{"$f":"o_TypeConstructie(J10,J11)","v":"Woningscheidend"},null,null,null,{"$f":"o_TypeConstructie(N10,N11)","v":"Woningscheidend"},null,null,null,{"$f":"o_TypeConstructie(R10,R11)","v":"Woningscheidend"}]
["Gevel lengte (binnenwerks)",null,"m",null,null,null,"m",null,null,null,"m",null,null,null,"m",null,null,null,"m"]
["Gevel hoogte / Dak breedte (binnenwerks)",null,"m",null,null,null,"m",null,null,null,"m",null,null,null,"m",null,null,null,"m"]
["Constructie oppervlak (binnenwerks)",{"$f":"B13*B14","v":0},"m²",null,null,{"$f":"F13*F14","v":0},"m²",null,null,{"$f":"J13*J14","v":0},"m²",null,null,{"$f":"N13*N14","v":0},"m²",null,null,{"$f":"R13*R14","v":0},"m²"]
["Gesloten constructie oppervlak",{"$f":"MAX(0,B15-B18-D18)","v":0},"m²",null,null,{"$f":"MAX(0,F15-F18-H18)","v":0},"m²",null,null,{"$f":"MAX(0,J15-J18-L18)","v":0},"m²",null,null,{"$f":"MAX(0,N15-N18-P18)","v":0},"m²",null,null,{"$f":"MAX(0,R15-R18-T18)","v":0},"m²"]
[null,"Glasvlak type 1",null,"Glasvlak type 2",null,"Glasvlak type 1",null,"Glasvlak type 2",null,"Glasvlak type 1",null,"Glasvlak type 2",null,"Glasvlak type 1",null,"Glasvlak type 2",null,"Glasvlak type 1",null,"Glasvlak type 2"]
["Totaal oppervlak van raamtype Aw,k (inclusief kozijn)",null,"m²",null,"m²",null,"m²",null,"m²",null,"m²",null,"m²",null,"m²",null,"m²",null,"m²",null,"m²"]
["Warmtedoorgangscoefficient (U-waarde) van het raam Uw;wi;k",null,"W/m².K",null,"W/m².K",null,"W/m².K",null,"W/m².K",null,"W/m².K",null,"W/m².K",null,"W/m².K",null,"W/m².K",null,"W/m².K",null,"W/m².K"]
["Zontoetredingsfactor (g_waarde) van het glas Ggl;n;wi;k;C;juli",1,null,1,null,1,null,1,null,1,null,1,null,1,null,1,null,1,null,1]
["Beschaduwing situatie bij het raamtype","Minimale belemmering",null,"Minimale belemmering",null,"Minimale belemmering",null,"Minimale belemmering",null,"Minimale belemmering",null,"Minimale belemmering",null,"Minimale belemmering",null,"Minimale belemmering",null,"Minimale belemmering",null,"Minimale belemmering"]
[]
[null,"Overstek",null,"Overstek",null,"Overstek",null,"Overstek",null,"Overstek",null,"Overstek",null,"Overstek",null,"Overstek"]
["Hoogte verschil midden raam onderzijde overstek",0,"m",0,"m",0,"m",0,"m",0,"m",0,"m",0,"m",0,"m",0,null,0,"m"]
["Horizontale afstand glas tot eindpunt overstek",0,"m",0,"m",0,"m",0,"m",0,"m",0,"m",0,"m",0,"m",0,null,0,"m"]
["Overstekhoek",{"$f":"IFERROR(180/PI()*ATAN(B24/B25),0)","v":0},"°",{"$f":"IFERROR(180/PI()*ATAN(D24/D25),0)","v":0},"°",{"$f":"IFERROR(180/PI()*ATAN(F24/F25),0)","v":0},"°",{"$f":"IFERROR(180/PI()*ATAN(H24/H25),0)","v":0},"°",{"$f":"IFERROR(180/PI()*ATAN(J24/J25),0)","v":0},"°",{"$f":"IFERROR(180/PI()*ATAN(L24/L25),0)","v":0},"°",{"$f":"IFERROR(180/PI()*ATAN(N24/N25),0)","v":0},"°",{"$f":"IFERROR(180/PI()*ATAN(P24/P25),0)","v":0},"°",null,null,null,"°"]
["Relatieve hoogte van overstek",{"$f":"IFERROR(B24/B25,1)","v":1},null,{"$f":"IFERROR(D24/D25,1)","v":1},null,{"$f":"IFERROR(F24/F25,1)","v":1},null,{"$f":"IFERROR(H24/H25,1)","v":1},null,{"$f":"IFERROR(J24/J25,1)","v":1},null,{"$f":"IFERROR(L24/L25,1)","v":1},null,{"$f":"IFERROR(N24/N25,1)","v":1},null,{"$f":"IFERROR(P24/P25,1)","v":1}]
[]
[null,"Zijbelemmering",null,"Zijbelemmering",null,"Zijbelemmering",null,"Zijbelemmering",null,"Zijbelemmering",null,"Zijbelemmering",null,"Zijbelemmering",null,"Zijbelemmering"]
["Positie zijbelemmering irt zichtveld (naar buitengericht)","Links",null,"Links",null,"Links",null,"Links",null,"Links",null,"Links",null,"Links",null,"Links",null,"Links",null,"Links"]
["Horizontale afstand midden raam verste punt belemmering",0,"m",0,"m",0,"m",0,"m",0,"m",0,"m",0,"m",0,"m",0,null,0,"m"]
["Horizontale breedte glas tot eindpunt belemmering",0,"m",0,"m",0,"m",0,"m",0,"m",0,"m",0,"m",0,"m",0,null,0,"m"]
["Relatieve breedte van de zijbelemmering bb",{"$f":"IFERROR(B31/B32,999)","v":999},null,{"$f":"IFERROR(D31/D32,999)","v":999},null,{"$f":"IFERROR(F31/F32,999)","v":999},null,{"$f":"IFERROR(H31/H32,999)","v":999},null,{"$f":"IFERROR(J31/J32,999)","v":999},null,{"$f":"IFERROR(L31/L32,999)","v":999},null,{"$f":"IFERROR(N31/N32,999)","v":999},null,{"$f":"IFERROR(P31/P32,999)","v":999}]
[]
["De beschaduwingsreductiefactor Fsh;obst;wi;k;juli",{"$f":"IFERROR(o_Beschaduwingreductie(B21,B8,B27,B30,B33,B11),1)","v":1},null,{"$f":"IFERROR(o_Beschaduwingreductie(D21,B8,D27,D30,D33,B11),1)","v":1},null,{"$f":"IFERROR(o_Beschaduwingreductie(F21,F8,F27,F30,F33,F11),1)","v":1},null,{"$f":"IFERROR(o_Beschaduwingreductie(H21,F8,H27,H30,H33,F11),1)","v":1},null,{"$f":"IFERROR(o_Beschaduwingreductie(J21,J8,J27,J30,J33,J11),1)","v":1},null,{"$f":"IFERROR(o_Beschaduwingreductie(L21,J8,L27,L30,L33,J11),1)","v":1},null,{"$f":"IFERROR(o_Beschaduwingreductie(N21,N8,N27,N30,N33,N11),1)","v":1},null,{"$f":"IFERROR(o_Beschaduwingreductie(P21,N8,P27,P30,P33,N11),1)","v":1},null,{"$f":"o_Beschaduwingreductie(R21,R8,R27,R30,R33,R11)","v":1},null,{"$f":"o_Beschaduwingreductie(T21,R8,T27,T30,T33,R11)","v":1}]
[]
["Type zonwering","Geen zonwering",null,"Geen zonwering",null,"Geen zonwering",null,"Geen zonwering",null,"Geen zonwering",null,"Geen zonwering",null,"Geen zonwering",null,"Geen zonwering",null,"Geen zonwering",null,"Geen zonwering"]
["De reductiefactor voor zonwering Fc;wi;k",{"$f":"o_Zonweringreductie(B37,B8)","v":{"$error":"#NAME?"}},null,{"$f":"o_Zonweringreductie(D37,B8)","v":{"$error":"#NAME?"}},null,{"$f":"o_Zonweringreductie(F37,F8)","v":{"$error":"#NAME?"}},null,{"$f":"o_Zonweringreductie(H37,F8)","v":{"$error":"#NAME?"}},null,{"$f":"o_Zonweringreductie(J37,J8)","v":{"$error":"#NAME?"}},null,{"$f":"o_Zonweringreductie(L37,J8)","v":{"$error":"#NAME?"}},null,{"$f":"o_Zonweringreductie(N37,N8)","v":{"$error":"#NAME?"}},null,{"$f":"o_Zonweringreductie(P37,N8)","v":{"$error":"#NAME?"}},null,{"$f":"o_Zonweringreductie(R37,R8)","v":1},null,{"$f":"o_Zonweringreductie(T37,R8)","v":1}]
["Totaal opvallende zonnestraling van het raam Isol;wi;k;juli",{"$f":"IF(B10=\"Nee\",0,o_Isol_Bij_Tijdstip($B$52,B8,B11))","v":0},"W/m²",{"$f":"IF(B10=\"Nee\",0,o_Isol_Bij_Tijdstip($B$52,B8,B11))","v":0},"W/m²",{"$f":"IF(F10=\"Nee\",0,o_Isol_Bij_Tijdstip($B$52,F8,F11))","v":0},"W/m²",{"$f":"IF(F10=\"Nee\",0,o_Isol_Bij_Tijdstip($B$52,F8,F11))","v":0},"W/m²",{"$f":"IF(J10=\"Nee\",0,o_Isol_Bij_Tijdstip($B$52,J8,J11))","v":0},"W/m²",{"$f":"IF(J10=\"Nee\",0,o_Isol_Bij_Tijdstip($B$52,J8,J11))","v":0},"W/m²",{"$f":"IF(N10=\"Nee\",0,o_Isol_Bij_Tijdstip($B$52,N8,N11))","v":0},"W/m²",{"$f":"IF(N10=\"Nee\",0,o_Isol_Bij_Tijdstip($B$52,N8,N11))","v":0},"W/m²",{"$f":"IF(R10=\"Nee\",0,o_Isol_Bij_Tijdstip($B$52,R8,R11))","v":0},"W/m²",{"$f":"IF(R10=\"Nee\",0,o_Isol_Bij_Tijdstip($B$52,R8,R11))","v":0},"W/m²"]
[]
["Tijdstip maximale koellastbijdrage tmax;zi",{"$f":"VALUE(o_Tijdstip_Isol_Max_Orientatie(B8,B11))","v":{"$error":"#NAME?"}},null,null,null,{"$f":"VALUE(o_Tijdstip_Isol_Max_Orientatie(F8,F11))","v":{"$error":"#NAME?"}},null,null,null,{"$f":"VALUE(o_Tijdstip_Isol_Max_Orientatie(J8,J11))","v":{"$error":"#NAME?"}},null,null,null,{"$f":"VALUE(o_Tijdstip_Isol_Max_Orientatie(N8,N11))","v":{"$error":"#NAME?"}},null,null,null,{"$f":"o_Tijdstip_Isol_Max_Orientatie(R8,R11)","v":"12:00:00 PM"}]
["Buitenluchttemperatuur op tijdstip max koellast Θe",{"$f":"o_maxTemp(VALUE(B41))","v":{"$error":"#NAME?"}},null,null,"°C",{"$f":"o_maxTemp(VALUE(F41))","v":{"$error":"#NAME?"}},null,null,"°C",{"$f":"o_maxTemp(VALUE(J41))","v":{"$error":"#NAME?"}},null,null,"°C",{"$f":"o_maxTemp(VALUE(N41))","v":{"$error":"#NAME?"}},null,null,"°C",{"$f":"o_maxTemp(VALUE(R41))","v":29.5}]
[]
["Glasopppervlak",{"$f":"IF(B10=\"Ja\",B18+D18,0)","v":0},"m²",null,null,{"$f":"IF(F10=\"Ja\",F18+H18,0)","v":0},"m²",null,null,{"$f":"IF(J10=\"Ja\",J18+L18,0)","v":0},"m²",null,null,{"$f":"IF(N10=\"Ja\",N18+P18,0)","v":0},"m²",null,null,{"$f":"IF(R10=\"Ja\",R18+T18,0)","v":0},"m²"]
["Uitwendigescheidingsconstructie niet op Noord?",{"$f":"IF(B10=\"Ja\",IF(B8=\"Noord\",FALSE,TRUE),FALSE)","v":false},null,null,null,{"$f":"IF(F10=\"Ja\",IF(F8=\"Noord\",FALSE,TRUE),FALSE)","v":false},null,null,null,{"$f":"IF(J10=\"Ja\",IF(J8=\"Noord\",FALSE,TRUE),FALSE)","v":false},null,null,null,{"$f":"IF(N10=\"Ja\",IF(N8=\"Noord\",FALSE,TRUE),FALSE)","v":false},null,null,null,{"$f":"IF(R10=\"Ja\",IF(R8=\"Noord\",FALSE,TRUE),FALSE)","v":false}]
["De enige uitwendigescheidingscontructie?",{"$f":"IF(AND(B45=TRUE,COUNTIF($B$45:$R$45,TRUE)=1),TRUE,FALSE)","v":false},null,null,null,{"$f":"IF(AND(F45=TRUE,COUNTIF($B$45:$R$45,TRUE)=1),TRUE,FALSE)","v":false},null,null,null,{"$f":"IF(AND(J45=TRUE,COUNTIF($B$45:$R$45,TRUE)=1),TRUE,FALSE)","v":false},null,null,null,{"$f":"IF(AND(N45=TRUE,COUNTIF($B$45:$R$45,TRUE)=1),TRUE,FALSE)","v":false},null,null,null,{"$f":"IF(AND(R45=TRUE,COUNTIF($B$45:$R$45,TRUE)=1),TRUE,FALSE)","v":false}]
["Totaal glasoppervlak",{"$f":"IF(B8<>\"Noord\",B44,0)","v":0},"m²",null,null,{"$f":"IF(F8<>\"Noord\",F44,0)","v":{"$error":"#NAME?"}},"m²",null,null,{"$f":"IF(J8<>\"Noord\",J44,0)","v":{"$error":"#NAME?"}},"m²",null,null,{"$f":"IF(N8<>\"Noord\",N44,0)","v":{"$error":"#NAME?"}},"m²",null,null,{"$f":"R44","v":0},"m²"]
["Grootste glasoppervlak ",{"$f":"IF(AND(B45,B47=MAX($B$47:$R$47)),TRUE,FALSE)","v":{"$error":"#NAME?"}},null,null,null,{"$f":"IF(AND(F45,F47=MAX($B$47:$R$47)),TRUE,FALSE)","v":{"$error":"#NAME?"}},null,null,null,{"$f":"IF(AND(J45,J47=MAX($B$47:$R$47)),TRUE,FALSE)","v":{"$error":"#NAME?"}},null,null,null,{"$f":"IF(AND(N45,N47=MAX($B$47:$R$47)),TRUE,FALSE)","v":{"$error":"#NAME?"}},null,null,null,{"$f":"IF(AND(R45,R47=MAX($B$47:$R$47)),TRUE,FALSE)","v":{"$error":"#NAME?"}}]
["Dakvlak maatgevend?",{"$f":"IF(AND(B11<90,B15>3*(B18+D18),'Projectgegevens en Resultaten'!#REF!<65),TRUE,FALSE)","v":{"$error":"#REF!"}},null,null,null,{"$f":"IF(AND(F11<90,F15>3*(F18+H18),'Projectgegevens en Resultaten'!#REF!<65),TRUE,FALSE)","v":{"$error":"#REF!"}},null,null,null,{"$f":"IF(AND(J11<90,J15>3*(J18+L18),'Projectgegevens en Resultaten'!#REF!<65),TRUE,FALSE)","v":{"$error":"#REF!"}},null,null,null,{"$f":"IF(AND(N11<90,N15>3*(N18+P18),'Projectgegevens en Resultaten'!#REF!<65),TRUE,FALSE)","v":{"$error":"#REF!"}},null,null,null,{"$f":"IF(AND(R11<90,R15>3*(R18+T18),'Projectgegevens en Resultaten'!#REF!<65),TRUE,FALSE)","v":{"$error":"#REF!"}}]
["is er een maatgevend dakoppervlak",{"$f":"IF(COUNTIF($B$49:$R$49,TRUE)>0,TRUE,FALSE)","v":false},null,null,null,{"$f":"IF(COUNTIF($B$49:$R$49,TRUE)>0,TRUE,FALSE)","v":false},null,null,null,{"$f":"IF(COUNTIF($B$49:$R$49,TRUE)>0,TRUE,FALSE)","v":false},null,null,null,{"$f":"IF(COUNTIF($B$49:$R$49,TRUE)>0,TRUE,FALSE)","v":false},null,null,null,{"$f":"IF(COUNTIF($B$49:$R$49,TRUE)>0,TRUE,FALSE)","v":false}]
["Maatgevende tijdstip",{"$f":"IF(OR(B46,AND(B45,B50,B49),AND(B45,B48,NOT(B50))),B41)","v":{"$error":"#REF!"}},null,null,null,{"$f":"IF(OR(F46,AND(F45,F50,F49),AND(F45,F48,NOT(F50))),F41)","v":{"$error":"#REF!"}},null,null,null,{"$f":"IF(OR(J46,AND(J45,J50,J49),AND(J45,J48,NOT(J50))),J41)","v":{"$error":"#REF!"}},null,null,null,{"$f":"IF(OR(N46,AND(N45,N50,N49),AND(N45,N48,NOT(N50))),N41)","v":{"$error":"#REF!"}},null,null,null,{"$f":"IF(OR(R46,AND(R45,R50,R49),AND(R45,R48,NOT(R50))),R41)","v":{"$error":"#REF!"}}]
["Maatgevende tijdstip tmax;zi",{"$f":"IFERROR(B88,\"geen glas ingevoerd\")","v":"Geen glas aanwezig"}]
["Buitenluchttemperatuur op tijdstip max koellast Θe",{"$f":"o_maxTemp(VALUE(B52))","v":{"$error":"#NAME?"}},"°C"]
[]
["Koellastbijdrage transmissie ondoorzichtige delen Ptr;ntr;vr;zi",{"$f":"IF(B10=\"Nee\",0,B16*'Projectgegevens en Resultaten'!$B$16)","v":0},null,null,"W",{"$f":"IF(F10=\"Nee\",0,F16*'Projectgegevens en Resultaten'!$B$16)","v":0},null,null,"W",{"$f":"IF(J10=\"Nee\",0,J16*'Projectgegevens en Resultaten'!$B$16)","v":0},null,null,"W",{"$f":"IF(N10=\"Nee\",0,N16*'Projectgegevens en Resultaten'!$B$16)","v":0},null,null,"W",{"$f":"IF(R10=\"Nee\",0,R16*'Projectgegevens en Resultaten'!$B$16)","v":0},null,null,"W"]
["Koellastbijdrage zoninstraling transparante delen Psol;vr;zi",{"$f":"(0.75*B18*FLOOR(B20,0.05)*0.9*B35*B38*B39)+(0.75*D18*FLOOR(D20,0.05)*0.9*D35*D38*D39)","v":{"$error":"#NAME?"}},null,null,"W",{"$f":"(0.75*F18*FLOOR(F20,0.05)*0.9*F35*F38*F39)+(0.75*H18*FLOOR(H20,0.05)*0.9*H35*H38*H39)","v":{"$error":"#NAME?"}},null,null,"W",{"$f":"(0.75*J18*FLOOR(J20,0.05)*0.9*J35*J38*J39)+(0.75*L18*FLOOR(L20,0.05)*0.9*L35*L38*L39)","v":{"$error":"#NAME?"}},null,null,"W",{"$f":"(0.75*N18*FLOOR(N20,0.05)*0.9*N35*N38*N39)+(0.75*P18*FLOOR(P20,0.05)*0.9*P35*P38*P39)","v":{"$error":"#NAME?"}},null,null,"W",{"$f":"(0.75*R18*FLOOR(R20,0.05)*0.9*R35*R38*R39)+(0.75*T18*FLOOR(T20,0.05)*0.9*T35*T38*T39)","v":0},null,null,"W"]
["Koellastbijdrage transmissie transparante delen Ptr;gl;vr;zi",{"$f":"IF(B10=\"Nee\",0,IFERROR(B18*B19*($B$53-24),0)+IFERROR(D18*D19*($B$53-24),0))","v":0},null,null,"W",{"$f":"IF(F10=\"Nee\",0,IFERROR(F18*F19*($B$53-24),0)+IFERROR(H18*H19*($B$53-24),0))","v":0},null,null,"W",{"$f":"IF(J10=\"Nee\",0,IFERROR(J18*J19*($B$53-24),0)+IFERROR(L18*L19*($B$53-24),0))","v":0},null,null,"W",{"$f":"IF(N10=\"Nee\",0,IFERROR(N18*N19*($B$53-24),0)+IFERROR(P18*P19*($B$53-24),0))","v":0},null,null,"W",{"$f":"IF(R10=\"Nee\",0,IFERROR(R18*R19*($B$53-24),0)+IFERROR(T18*T19*($B$53-24),0))","v":0},null,null,"W"]
["Totaal koellastbijdrage per gevel",{"$f":"SUM(B55:D57)","v":{"$error":"#NAME?"}},null,null,"W",{"$f":"SUM(F55:H57)","v":{"$error":"#NAME?"}},null,null,"W",{"$f":"SUM(J55:L57)","v":{"$error":"#NAME?"}},null,null,"W",{"$f":"SUM(N55:P57)","v":{"$error":"#NAME?"}},null,null,"W",{"$f":"SUM(R55:R57)","v":0},null,null,"W"]
[]
["Koellast door interne warmtelast Pint;calc;woon/overig;zi",{"$f":"IF(B5=0,0,IF(B4=\"Woonvertrek\",2*'Projectgegevens en Resultaten'!$B$33*B5,'Projectgegevens en Resultaten'!$B$33*B5))","v":0},null,null,"W"]
["Koellast door buitenluchttoetreding Pv;calc;vr;zi",{"$f":"IFERROR(MAX((SUM('Projectgegevens en Resultaten'!$B$21:$B$23)/3600*1.205*1005*(B53-24))/SUM('Projectgegevens en Resultaten'!$B$40:$T$40)*B5,0),0)","v":0},{"$f":"IFERROR(MAX(SUM(C57:C59)/3600*1.205*1005*(C60-24),0),0)","v":0},{"$f":"IFERROR(MAX(SUM(D57:D59)/3600*1.205*1005*(D60-24),0),0)","v":0},"W"]
[]
["Totaal koellastbijdrage",{"$f":"IFERROR(SUM(B58:T58)+B60+B61,0)","v":0},null,null,"W"]
["Koelbehoefte verblijfsruimte",{"$f":"IFERROR(B63/B5,0)","v":0},null,null,"W/m²"]
[]
[]
[]
[]
[]
[]
["Onderstaande tabellen worden verborgen in de uiteindelijke versie. De tabellen dienen om vast te stellen welk tijdstip tot de hoogste zonbelasting leidt"]
[]
["Isol max voor de orientatie",{"$f":"IF(B$10=\"Nee\",0,o_Isol_Max_Orientatie(B8,B11))","v":0},"W/m²",null,null,{"$f":"IF(F$10=\"Nee\",0,o_Isol_Max_Orientatie(F8,F11))","v":0},"W/m²",null,null,{"$f":"o_Isol_Max_Orientatie(J8,J11)","v":{"$error":"#NAME?"}},"W/m²",null,null,{"$f":"o_Isol_Max_Orientatie(N8,N11)","v":{"$error":"#NAME?"}},"W/m²",null,null,{"$f":"o_Isol_Max_Orientatie(R8,R11)","v":914.11856204111336},"W/m²"]
["Tijdstip bij Isol max bij orientatie",{"$f":"VALUE(o_Tijdstip_Isol_Max_Orientatie(B8,B11))","v":{"$error":"#NAME?"}},null,null,null,{"$f":"VALUE(o_Tijdstip_Isol_Max_Orientatie(F8,F11))","v":{"$error":"#NAME?"}},null,null,null,{"$f":"VALUE(o_Tijdstip_Isol_Max_Orientatie(J8,J11))","v":{"$error":"#NAME?"}},null,null,null,{"$f":"VALUE(o_Tijdstip_Isol_Max_Orientatie(N8,N11))","v":{"$error":"#NAME?"}},null,null,null,{"$f":"VALUE(o_Tijdstip_Isol_Max_Orientatie(R8,R11))","v":"12:00:00"}]
[]
["Koellastbijdrage zoninstraling transparante delen Psol;vr;zi"]
["09:00:00",{"$f":"IF(B$10=\"Nee\",0,(0.75*B$18*FLOOR(B$20,0.05)*0.9*B$35*B$38*o_Isol_Bij_Tijdstip($A77,B$8,B$11))+(0.75*D$18*FLOOR(D$20,0.05)*0.9*D$35*D$38*o_Isol_Bij_Tijdstip($A77,B$8,B$11)))","v":0},"W",null,null,{"$f":"IF(F$10=\"Nee\",0,(0.75*F$18*FLOOR(F$20,0.05)*0.9*F$35*F$38*o_Isol_Bij_Tijdstip($A77,F$8,F$11))+(0.75*H$18*FLOOR(H$20,0.05)*0.9*H$35*H$38*o_Isol_Bij_Tijdstip($A77,F$8,F$11)))","v":0},"W",null,null,{"$f":"IF(J$10=\"Nee\",0,(0.75*J$18*FLOOR(J$20,0.05)*0.9*J$35*J$38*o_Isol_Bij_Tijdstip($A77,J$8,J$11))+(0.75*L$18*FLOOR(L$20,0.05)*0.9*L$35*L$38*o_Isol_Bij_Tijdstip($A77,J$8,J$11)))","v":0},"W",null,null,{"$f":"IF(N$10=\"Nee\",0,(0.75*N$18*FLOOR(N$20,0.05)*0.9*N$35*N$38*o_Isol_Bij_Tijdstip($A77,N$8,N$11))+(0.75*P$18*FLOOR(P$20,0.05)*0.9*P$35*P$38*o_Isol_Bij_Tijdstip($A77,N$8,N$11)))","v":0},"W",null,null,{"$f":"IF(R$10=\"Nee\",0,(0.75*R$18*FLOOR(R$20,0.05)*0.9*R$35*R$38*o_Isol_Bij_Tijdstip($A77,R$8,R$11))+(0.75*T$18*FLOOR(T$20,0.05)*0.9*T$35*T$38*o_Isol_Bij_Tijdstip($A77,R$8,R$11)))","v":0},"W",{"$f":"B77+F77+J77+N77+R77","v":0},"W"]
["10:00:00",{"$f":"IF(B$10=\"Nee\",0,(0.75*B$18*FLOOR(B$20,0.05)*0.9*B$35*B$38*o_Isol_Bij_Tijdstip($A78,B$8,B$11))+(0.75*D$18*FLOOR(D$20,0.05)*0.9*D$35*D$38*o_Isol_Bij_Tijdstip($A78,B$8,B$11)))","v":0},"W",null,null,{"$f":"IF(F$10=\"Nee\",0,(0.75*F$18*FLOOR(F$20,0.05)*0.9*F$35*F$38*o_Isol_Bij_Tijdstip($A78,F$8,F$11))+(0.75*H$18*FLOOR(H$20,0.05)*0.9*H$35*H$38*o_Isol_Bij_Tijdstip($A78,F$8,F$11)))","v":0},"W",null,null,{"$f":"IF(J$10=\"Nee\",0,(0.75*J$18*FLOOR(J$20,0.05)*0.9*J$35*J$38*o_Isol_Bij_Tijdstip($A78,J$8,J$11))+(0.75*L$18*FLOOR(L$20,0.05)*0.9*L$35*L$38*o_Isol_Bij_Tijdstip($A78,J$8,J$11)))","v":0},"W",null,null,{"$f":"IF(N$10=\"Nee\",0,(0.75*N$18*FLOOR(N$20,0.05)*0.9*N$35*N$38*o_Isol_Bij_Tijdstip($A78,N$8,N$11))+(0.75*P$18*FLOOR(P$20,0.05)*0.9*P$35*P$38*o_Isol_Bij_Tijdstip($A78,N$8,N$11)))","v":0},"W",null,null,{"$f":"IF(R$10=\"Nee\",0,(0.75*R$18*FLOOR(R$20,0.05)*0.9*R$35*R$38*o_Isol_Bij_Tijdstip($A78,R$8,R$11))+(0.75*T$18*FLOOR(T$20,0.05)*0.9*T$35*T$38*o_Isol_Bij_Tijdstip($A78,R$8,R$11)))","v":0},"W",0,"W"]
["11:00:00",{"$f":"IF(B$10=\"Nee\",0,(0.75*B$18*FLOOR(B$20,0.05)*0.9*B$35*B$38*o_Isol_Bij_Tijdstip($A79,B$8,B$11))+(0.75*D$18*FLOOR(D$20,0.05)*0.9*D$35*D$38*o_Isol_Bij_Tijdstip($A79,B$8,B$11)))","v":0},"W",null,null,{"$f":"IF(F$10=\"Nee\",0,(0.75*F$18*FLOOR(F$20,0.05)*0.9*F$35*F$38*o_Isol_Bij_Tijdstip($A79,F$8,F$11))+(0.75*H$18*FLOOR(H$20,0.05)*0.9*H$35*H$38*o_Isol_Bij_Tijdstip($A79,F$8,F$11)))","v":0},"W",null,null,{"$f":"IF(J$10=\"Nee\",0,(0.75*J$18*FLOOR(J$20,0.05)*0.9*J$35*J$38*o_Isol_Bij_Tijdstip($A79,J$8,J$11))+(0.75*L$18*FLOOR(L$20,0.05)*0.9*L$35*L$38*o_Isol_Bij_Tijdstip($A79,J$8,J$11)))","v":0},"W",null,null,{"$f":"IF(N$10=\"Nee\",0,(0.75*N$18*FLOOR(N$20,0.05)*0.9*N$35*N$38*o_Isol_Bij_Tijdstip($A79,N$8,N$11))+(0.75*P$18*FLOOR(P$20,0.05)*0.9*P$35*P$38*o_Isol_Bij_Tijdstip($A79,N$8,N$11)))","v":0},"W",null,null,{"$f":"IF(R$10=\"Nee\",0,(0.75*R$18*FLOOR(R$20,0.05)*0.9*R$35*R$38*o_Isol_Bij_Tijdstip($A79,R$8,R$11))+(0.75*T$18*FLOOR(T$20,0.05)*0.9*T$35*T$38*o_Isol_Bij_Tijdstip($A79,R$8,R$11)))","v":0},"W",0,"W"]
["12:00:00",{"$f":"IF(B$10=\"Nee\",0,(0.75*B$18*FLOOR(B$20,0.05)*0.9*B$35*B$38*o_Isol_Bij_Tijdstip($A80,B$8,B$11))+(0.75*D$18*FLOOR(D$20,0.05)*0.9*D$35*D$38*o_Isol_Bij_Tijdstip($A80,B$8,B$11)))","v":0},"W",null,null,{"$f":"IF(F$10=\"Nee\",0,(0.75*F$18*FLOOR(F$20,0.05)*0.9*F$35*F$38*o_Isol_Bij_Tijdstip($A80,F$8,F$11))+(0.75*H$18*FLOOR(H$20,0.05)*0.9*H$35*H$38*o_Isol_Bij_Tijdstip($A80,F$8,F$11)))","v":0},"W",null,null,{"$f":"IF(J$10=\"Nee\",0,(0.75*J$18*FLOOR(J$20,0.05)*0.9*J$35*J$38*o_Isol_Bij_Tijdstip($A80,J$8,J$11))+(0.75*L$18*FLOOR(L$20,0.05)*0.9*L$35*L$38*o_Isol_Bij_Tijdstip($A80,J$8,J$11)))","v":0},"W",null,null,{"$f":"IF(N$10=\"Nee\",0,(0.75*N$18*FLOOR(N$20,0.05)*0.9*N$35*N$38*o_Isol_Bij_Tijdstip($A80,N$8,N$11))+(0.75*P$18*FLOOR(P$20,0.05)*0.9*P$35*P$38*o_Isol_Bij_Tijdstip($A80,N$8,N$11)))","v":0},"W",null,null,{"$f":"IF(R$10=\"Nee\",0,(0.75*R$18*FLOOR(R$20,0.05)*0.9*R$35*R$38*o_Isol_Bij_Tijdstip($A80,R$8,R$11))+(0.75*T$18*FLOOR(T$20,0.05)*0.9*T$35*T$38*o_Isol_Bij_Tijdstip($A80,R$8,R$11)))","v":0},"W",0,"W"]
["13:00:00",{"$f":"IF(B$10=\"Nee\",0,(0.75*B$18*FLOOR(B$20,0.05)*0.9*B$35*B$38*o_Isol_Bij_Tijdstip($A81,B$8,B$11))+(0.75*D$18*FLOOR(D$20,0.05)*0.9*D$35*D$38*o_Isol_Bij_Tijdstip($A81,B$8,B$11)))","v":0},"W",null,null,{"$f":"IF(F$10=\"Nee\",0,(0.75*F$18*FLOOR(F$20,0.05)*0.9*F$35*F$38*o_Isol_Bij_Tijdstip($A81,F$8,F$11))+(0.75*H$18*FLOOR(H$20,0.05)*0.9*H$35*H$38*o_Isol_Bij_Tijdstip($A81,F$8,F$11)))","v":0},"W",null,null,{"$f":"IF(J$10=\"Nee\",0,(0.75*J$18*FLOOR(J$20,0.05)*0.9*J$35*J$38*o_Isol_Bij_Tijdstip($A81,J$8,J$11))+(0.75*L$18*FLOOR(L$20,0.05)*0.9*L$35*L$38*o_Isol_Bij_Tijdstip($A81,J$8,J$11)))","v":0},"W",null,null,{"$f":"IF(N$10=\"Nee\",0,(0.75*N$18*FLOOR(N$20,0.05)*0.9*N$35*N$38*o_Isol_Bij_Tijdstip($A81,N$8,N$11))+(0.75*P$18*FLOOR(P$20,0.05)*0.9*P$35*P$38*o_Isol_Bij_Tijdstip($A81,N$8,N$11)))","v":0},"W",null,null,{"$f":"IF(R$10=\"Nee\",0,(0.75*R$18*FLOOR(R$20,0.05)*0.9*R$35*R$38*o_Isol_Bij_Tijdstip($A81,R$8,R$11))+(0.75*T$18*FLOOR(T$20,0.05)*0.9*T$35*T$38*o_Isol_Bij_Tijdstip($A81,R$8,R$11)))","v":0},"W",0,"W"]
["14:00:00",{"$f":"IF(B$10=\"Nee\",0,(0.75*B$18*FLOOR(B$20,0.05)*0.9*B$35*B$38*o_Isol_Bij_Tijdstip($A82,B$8,B$11))+(0.75*D$18*FLOOR(D$20,0.05)*0.9*D$35*D$38*o_Isol_Bij_Tijdstip($A82,B$8,B$11)))","v":0},"W",null,null,{"$f":"IF(F$10=\"Nee\",0,(0.75*F$18*FLOOR(F$20,0.05)*0.9*F$35*F$38*o_Isol_Bij_Tijdstip($A82,F$8,F$11))+(0.75*H$18*FLOOR(H$20,0.05)*0.9*H$35*H$38*o_Isol_Bij_Tijdstip($A82,F$8,F$11)))","v":0},"W",null,null,{"$f":"IF(J$10=\"Nee\",0,(0.75*J$18*FLOOR(J$20,0.05)*0.9*J$35*J$38*o_Isol_Bij_Tijdstip($A82,J$8,J$11))+(0.75*L$18*FLOOR(L$20,0.05)*0.9*L$35*L$38*o_Isol_Bij_Tijdstip($A82,J$8,J$11)))","v":0},"W",null,null,{"$f":"IF(N$10=\"Nee\",0,(0.75*N$18*FLOOR(N$20,0.05)*0.9*N$35*N$38*o_Isol_Bij_Tijdstip($A82,N$8,N$11))+(0.75*P$18*FLOOR(P$20,0.05)*0.9*P$35*P$38*o_Isol_Bij_Tijdstip($A82,N$8,N$11)))","v":0},"W",null,null,{"$f":"IF(R$10=\"Nee\",0,(0.75*R$18*FLOOR(R$20,0.05)*0.9*R$35*R$38*o_Isol_Bij_Tijdstip($A82,R$8,R$11))+(0.75*T$18*FLOOR(T$20,0.05)*0.9*T$35*T$38*o_Isol_Bij_Tijdstip($A82,R$8,R$11)))","v":0},"W",0,"W"]
["15:00:00",{"$f":"IF(B$10=\"Nee\",0,(0.75*B$18*FLOOR(B$20,0.05)*0.9*B$35*B$38*o_Isol_Bij_Tijdstip($A83,B$8,B$11))+(0.75*D$18*FLOOR(D$20,0.05)*0.9*D$35*D$38*o_Isol_Bij_Tijdstip($A83,B$8,B$11)))","v":0},"W",null,null,{"$f":"IF(F$10=\"Nee\",0,(0.75*F$18*FLOOR(F$20,0.05)*0.9*F$35*F$38*o_Isol_Bij_Tijdstip($A83,F$8,F$11))+(0.75*H$18*FLOOR(H$20,0.05)*0.9*H$35*H$38*o_Isol_Bij_Tijdstip($A83,F$8,F$11)))","v":0},"W",null,null,{"$f":"IF(J$10=\"Nee\",0,(0.75*J$18*FLOOR(J$20,0.05)*0.9*J$35*J$38*o_Isol_Bij_Tijdstip($A83,J$8,J$11))+(0.75*L$18*FLOOR(L$20,0.05)*0.9*L$35*L$38*o_Isol_Bij_Tijdstip($A83,J$8,J$11)))","v":0},"W",null,null,{"$f":"IF(N$10=\"Nee\",0,(0.75*N$18*FLOOR(N$20,0.05)*0.9*N$35*N$38*o_Isol_Bij_Tijdstip($A83,N$8,N$11))+(0.75*P$18*FLOOR(P$20,0.05)*0.9*P$35*P$38*o_Isol_Bij_Tijdstip($A83,N$8,N$11)))","v":0},"W",null,null,{"$f":"IF(R$10=\"Nee\",0,(0.75*R$18*FLOOR(R$20,0.05)*0.9*R$35*R$38*o_Isol_Bij_Tijdstip($A83,R$8,R$11))+(0.75*T$18*FLOOR(T$20,0.05)*0.9*T$35*T$38*o_Isol_Bij_Tijdstip($A83,R$8,R$11)))","v":0},"W",0,"W"]
["16:00:00",{"$f":"IF(B$10=\"Nee\",0,(0.75*B$18*FLOOR(B$20,0.05)*0.9*B$35*B$38*o_Isol_Bij_Tijdstip($A84,B$8,B$11))+(0.75*D$18*FLOOR(D$20,0.05)*0.9*D$35*D$38*o_Isol_Bij_Tijdstip($A84,B$8,B$11)))","v":0},"W",null,null,{"$f":"IF(F$10=\"Nee\",0,(0.75*F$18*FLOOR(F$20,0.05)*0.9*F$35*F$38*o_Isol_Bij_Tijdstip($A84,F$8,F$11))+(0.75*H$18*FLOOR(H$20,0.05)*0.9*H$35*H$38*o_Isol_Bij_Tijdstip($A84,F$8,F$11)))","v":0},"W",null,null,{"$f":"IF(J$10=\"Nee\",0,(0.75*J$18*FLOOR(J$20,0.05)*0.9*J$35*J$38*o_Isol_Bij_Tijdstip($A84,J$8,J$11))+(0.75*L$18*FLOOR(L$20,0.05)*0.9*L$35*L$38*o_Isol_Bij_Tijdstip($A84,J$8,J$11)))","v":0},"W",null,null,{"$f":"IF(N$10=\"Nee\",0,(0.75*N$18*FLOOR(N$20,0.05)*0.9*N$35*N$38*o_Isol_Bij_Tijdstip($A84,N$8,N$11))+(0.75*P$18*FLOOR(P$20,0.05)*0.9*P$35*P$38*o_Isol_Bij_Tijdstip($A84,N$8,N$11)))","v":0},"W",null,null,{"$f":"IF(R$10=\"Nee\",0,(0.75*R$18*FLOOR(R$20,0.05)*0.9*R$35*R$38*o_Isol_Bij_Tijdstip($A84,R$8,R$11))+(0.75*T$18*FLOOR(T$20,0.05)*0.9*T$35*T$38*o_Isol_Bij_Tijdstip($A84,R$8,R$11)))","v":0},"W",0,"W"]
["17:00:00",{"$f":"IF(B$10=\"Nee\",0,(0.75*B$18*FLOOR(B$20,0.05)*0.9*B$35*B$38*o_Isol_Bij_Tijdstip($A85,B$8,B$11))+(0.75*D$18*FLOOR(D$20,0.05)*0.9*D$35*D$38*o_Isol_Bij_Tijdstip($A85,B$8,B$11)))","v":0},"W",null,null,{"$f":"IF(F$10=\"Nee\",0,(0.75*F$18*FLOOR(F$20,0.05)*0.9*F$35*F$38*o_Isol_Bij_Tijdstip($A85,F$8,F$11))+(0.75*H$18*FLOOR(H$20,0.05)*0.9*H$35*H$38*o_Isol_Bij_Tijdstip($A85,F$8,F$11)))","v":0},"W",null,null,{"$f":"IF(J$10=\"Nee\",0,(0.75*J$18*FLOOR(J$20,0.05)*0.9*J$35*J$38*o_Isol_Bij_Tijdstip($A85,J$8,J$11))+(0.75*L$18*FLOOR(L$20,0.05)*0.9*L$35*L$38*o_Isol_Bij_Tijdstip($A85,J$8,J$11)))","v":0},"W",null,null,{"$f":"IF(N$10=\"Nee\",0,(0.75*N$18*FLOOR(N$20,0.05)*0.9*N$35*N$38*o_Isol_Bij_Tijdstip($A85,N$8,N$11))+(0.75*P$18*FLOOR(P$20,0.05)*0.9*P$35*P$38*o_Isol_Bij_Tijdstip($A85,N$8,N$11)))","v":0},"W",null,null,{"$f":"IF(R$10=\"Nee\",0,(0.75*R$18*FLOOR(R$20,0.05)*0.9*R$35*R$38*o_Isol_Bij_Tijdstip($A85,R$8,R$11))+(0.75*T$18*FLOOR(T$20,0.05)*0.9*T$35*T$38*o_Isol_Bij_Tijdstip($A85,R$8,R$11)))","v":0},"W",0,"W"]
["18:00:00",{"$f":"IF(B$10=\"Nee\",0,(0.75*B$18*FLOOR(B$20,0.05)*0.9*B$35*B$38*o_Isol_Bij_Tijdstip($A86,B$8,B$11))+(0.75*D$18*FLOOR(D$20,0.05)*0.9*D$35*D$38*o_Isol_Bij_Tijdstip($A86,B$8,B$11)))","v":0},"W",null,null,{"$f":"IF(F$10=\"Nee\",0,(0.75*F$18*FLOOR(F$20,0.05)*0.9*F$35*F$38*o_Isol_Bij_Tijdstip($A86,F$8,F$11))+(0.75*H$18*FLOOR(H$20,0.05)*0.9*H$35*H$38*o_Isol_Bij_Tijdstip($A86,F$8,F$11)))","v":0},"W",null,null,{"$f":"IF(J$10=\"Nee\",0,(0.75*J$18*FLOOR(J$20,0.05)*0.9*J$35*J$38*o_Isol_Bij_Tijdstip($A86,J$8,J$11))+(0.75*L$18*FLOOR(L$20,0.05)*0.9*L$35*L$38*o_Isol_Bij_Tijdstip($A86,J$8,J$11)))","v":0},"W",null,null,{"$f":"IF(N$10=\"Nee\",0,(0.75*N$18*FLOOR(N$20,0.05)*0.9*N$35*N$38*o_Isol_Bij_Tijdstip($A86,N$8,N$11))+(0.75*P$18*FLOOR(P$20,0.05)*0.9*P$35*P$38*o_Isol_Bij_Tijdstip($A86,N$8,N$11)))","v":0},"W",null,null,{"$f":"IF(R$10=\"Nee\",0,(0.75*R$18*FLOOR(R$20,0.05)*0.9*R$35*R$38*o_Isol_Bij_Tijdstip($A86,R$8,R$11))+(0.75*T$18*FLOOR(T$20,0.05)*0.9*T$35*T$38*o_Isol_Bij_Tijdstip($A86,R$8,R$11)))","v":0},"W",0,"W"]
[]
["Maatgevende tijdstip",{"$f":"IF(MAX(T77:T86)=0,\"Geen glas aanwezig\",_xlfn.XLOOKUP(MAX(T77:T86),T77:T86,A77:A86,\"nvt\"))","v":"Geen glas aanwezig"}]

{"sheet":"Ruimte 2","index":4,"n_rows":88,"n_cols":21,"rows_kept":88,"cut":false,"hidden":false,"merged":[[70,0,71,20],[0,0,0,20],[6,1,6,3],[6,5,6,7],[6,9,6,11],[6,13,6,15],[6,17,6,20],[41,1,41,3],[41,5,41,7],[41,9,41,11],[41,13,41,15],[41,17,41,19],[40,1,40,3],[40,5,40,7],[40,9,40,11],[40,13,40,15],[40,17,40,19],[55,1,55,3],[55,5,55,7],[55,9,55,11],[55,13,55,15],[55,17,55,19],[54,1,54,3],[54,5,54,7],[54,9,54,11],[54,13,54,15],[54,17,54,19],[56,5,56,7],[56,9,56,11],[56,13,56,15],[56,17,56,19],[57,1,57,3],[57,5,57,7],[57,9,57,11],[57,13,57,15],[57,17,57,19],[59,1,59,3],[60,1,60,3],[62,1,62,3],[63,1,63,3],[56,1,56,3]]}
["RUIMTE 2"]
[]
["Ruimtenaam",2]
["Type verblijfsruimte","Andere verblijfsruimte"]
["Vloeroppervlak verblijfsruimte Avr  (gebruiksoppervlak)",0,"m²"]
[]
[null,"Voorzijde woning",null,null,null,"Linker zijde woning",null,null,null,"Achterzijde woning",null,null,null,"Rechter zijde woning",null,null,null,"Platdak"]
["Orientatie gevel / dakvlak (Helling > 15°C)",{"$f":"'Projectgegevens en Resultaten'!$B$17","v":0},null,null,null,{"$f":"o_Orientatie(F9)","v":{"$error":"#NAME?"}},null,null,null,{"$f":"o_Orientatie(J9)","v":{"$error":"#NAME?"}},null,null,null,{"$f":"o_Orientatie(N9)","v":{"$error":"#NAME?"}},null,null,null,"Horizontaal"]
["Orientatiehoek gevel Ƴ",{"$f":"o_OrientatiehOEK(B8)","v":{"$error":"#NAME?"}},null,null,null,{"$f":"IF(B9+90>360,B9+90-360,B9+90)","v":{"$error":"#NAME?"}},null,null,null,{"$f":"IF(F9+90>360,F9+90-360,F9+90)","v":{"$error":"#NAME?"}},null,null,null,{"$f":"IF(J9+90>360,J9+90-360,J9+90)","v":{"$error":"#NAME?"}}]
["Grenst aan buitenlucht ja of nee","Nee",null,null,null,"Nee",null,null,null,"Nee",null,null,null,"Nee",null,null,null,"Nee"]
["Hellingshoek constructie ≥ 15° = hellenddak 90° = gevel",90,"°",null,null,90,"°",null,null,90,"°",null,null,90,"°",null,null,0,"°"]
["Type constructie",{"$f":"o_TypeConstructie(B10,B11)","v":"Woningscheidend"},null,null,null,{"$f":"o_TypeConstructie(F10,F11)","v":"Woningscheidend"},null,null,null,{"$f":"o_TypeConstructie(J10,J11)","v":"Woningscheidend"},null,null,null,{"$f":"o_TypeConstructie(N10,N11)","v":"Woningscheidend"},null,null,null,{"$f":"o_TypeConstructie(R10,R11)","v":"Woningscheidend"}]
["Gevel lengte (binnenwerks)",null,"m",null,null,null,"m",null,null,null,"m",null,null,null,"m",null,null,null,"m"]
["Gevel hoogte / Dak breedte (binnenwerks)",null,"m",null,null,null,"m",null,null,null,"m",null,null,null,"m",null,null,null,"m"]
["Constructie oppervlak (binnenwerks)",{"$f":"B13*B14","v":0},"m²",null,null,{"$f":"F13*F14","v":0},"m²",null,null,{"$f":"J13*J14","v":0},"m²",null,null,{"$f":"N13*N14","v":0},"m²",null,null,{"$f":"R13*R14","v":0},"m²"]
["Gesloten constructie oppervlak",{"$f":"MAX(0,B15-B18-D18)","v":0},"m²",null,null,{"$f":"MAX(0,F15-F18-H18)","v":0},"m²",null,null,{"$f":"MAX(0,J15-J18-L18)","v":0},"m²",null,null,{"$f":"MAX(0,N15-N18-P18)","v":0},"m²",null,null,{"$f":"MAX(0,R15-R18-T18)","v":0},"m²"]
[null,"Glasvlak type 1",null,"Glasvlak type 2",null,"Glasvlak type 1",null,"Glasvlak type 2",null,"Glasvlak type 1",null,"Glasvlak type 2",null,"Glasvlak type 1",null,"Glasvlak type 2",null,"Glasvlak type 1",null,"Glasvlak type 2"]
["Totaal oppervlak van raamtype Aw,k (inclusief kozijn)",null,"m²",null,"m²",null,"m²",null,"m²",null,"m²",null,"m²",null,"m²",null,"m²",null,"m²",null,"m²"]
["Warmtedoorgangscoefficient (U-waarde) van het raam Uw;wi;k",null,"W/m².K",null,"W/m².K",null,"W/m².K",null,"W/m².K",null,"W/m².K",null,"W/m².K",null,"W/m².K",null,"W/m².K",null,"W/m².K",null,"W/m².K"]
["Zontoetredingsfactor (g_waarde) van het glas Ggl;n;wi;k;C;juli",1,null,1,null,1,null,1,null,1,null,1,null,1,null,1,null,1,null,1]
["Beschaduwing situatie bij het raamtype","Minimale belemmering",null,"Minimale belemmering",null,"Minimale belemmering",null,"Minimale belemmering",null,"Minimale belemmering",null,"Minimale belemmering",null,"Minimale belemmering",null,"Minimale belemmering",null,"Minimale belemmering",null,"Minimale belemmering"]
[]
[null,"Overstek",null,"Overstek",null,"Overstek",null,"Overstek",null,"Overstek",null,"Overstek",null,"Overstek",null,"Overstek"]
["Hoogte verschil midden raam onderzijde overstek",0,"m",0,"m",0,"m",0,"m",0,"m",0,"m",0,"m",0,"m",0,null,0,"m"]
["Horizontale afstand glas tot eindpunt overstek",0,"m",0,"m",0,"m",0,"m",0,"m",0,"m",0,"m",0,"m",0,null,0,"m"]
["Overstekhoek",{"$f":"IFERROR(180/PI()*ATAN(B24/B25),0)","v":0},"°",{"$f":"IFERROR(180/PI()*ATAN(D24/D25),0)","v":0},"°",{"$f":"IFERROR(180/PI()*ATAN(F24/F25),0)","v":0},"°",{"$f":"IFERROR(180/PI()*ATAN(H24/H25),0)","v":0},"°",{"$f":"IFERROR(180/PI()*ATAN(J24/J25),0)","v":0},"°",{"$f":"IFERROR(180/PI()*ATAN(L24/L25),0)","v":0},"°",{"$f":"IFERROR(180/PI()*ATAN(N24/N25),0)","v":0},"°",{"$f":"IFERROR(180/PI()*ATAN(P24/P25),0)","v":0},"°",null,null,null,"°"]
["Relatieve hoogte van overstek",{"$f":"IFERROR(B24/B25,1)","v":1},null,{"$f":"IFERROR(D24/D25,1)","v":1},null,{"$f":"IFERROR(F24/F25,1)","v":1},null,{"$f":"IFERROR(H24/H25,1)","v":1},null,{"$f":"IFERROR(J24/J25,1)","v":1},null,{"$f":"IFERROR(L24/L25,1)","v":1},null,{"$f":"IFERROR(N24/N25,1)","v":1},null,{"$f":"IFERROR(P24/P25,1)","v":1}]
[]
[null,"Zijbelemmering",null,"Zijbelemmering",null,"Zijbelemmering",null,"Zijbelemmering",null,"Zijbelemmering",null,"Zijbelemmering",null,"Zijbelemmering",null,"Zijbelemmering"]
["Positie zijbelemmering irt zichtveld (naar buitengericht)","Links",null,"Links",null,"Links",null,"Links",null,"Links",null,"Links",null,"Links",null,"Links",null,"Links",null,"Links"]
["Horizontale afstand midden raam verste punt belemmering",0,"m",0,"m",0,"m",0,"m",0,"m",0,"m",0,"m",0,"m",0,null,0,"m"]
["Horizontale breedte glas tot eindpunt belemmering",0,"m",0,"m",0,"m",0,"m",0,"m",0,"m",0,"m",0,"m",0,null,0,"m"]
["Relatieve breedte van de zijbelemmering bb",{"$f":"IFERROR(B31/B32,999)","v":999},null,{"$f":"IFERROR(D31/D32,999)","v":999},null,{"$f":"IFERROR(F31/F32,999)","v":999},null,{"$f":"IFERROR(H31/H32,999)","v":999},null,{"$f":"IFERROR(J31/J32,999)","v":999},null,{"$f":"IFERROR(L31/L32,999)","v":999},null,{"$f":"IFERROR(N31/N32,999)","v":999},null,{"$f":"IFERROR(P31/P32,999)","v":999}]
[]
["De beschaduwingsreductiefactor Fsh;obst;wi;k;juli",{"$f":"IFERROR(o_Beschaduwingreductie(B21,B8,B27,B30,B33,B11),1)","v":1},null,{"$f":"IFERROR(o_Beschaduwingreductie(D21,B8,D27,D30,D33,B11),1)","v":1},null,{"$f":"IFERROR(o_Beschaduwingreductie(F21,F8,F27,F30,F33,F11),1)","v":1},null,{"$f":"IFERROR(o_Beschaduwingreductie(H21,F8,H27,H30,H33,F11),1)","v":1},null,{"$f":"IFERROR(o_Beschaduwingreductie(J21,J8,J27,J30,J33,J11),1)","v":1},null,{"$f":"IFERROR(o_Beschaduwingreductie(L21,J8,L27,L30,L33,J11),1)","v":1},null,{"$f":"IFERROR(o_Beschaduwingreductie(N21,N8,N27,N30,N33,N11),1)","v":1},null,{"$f":"IFERROR(o_Beschaduwingreductie(P21,N8,P27,P30,P33,N11),1)","v":1},null,{"$f":"o_Beschaduwingreductie(R21,R8,R27,R30,R33,R11)","v":1},null,{"$f":"o_Beschaduwingreductie(T21,R8,T27,T30,T33,R11)","v":1}]
[]
["Type zonwering","Geen zonwering",null,"Geen zonwering",null,"Geen zonwering",null,"Geen zonwering",null,"Geen zonwering",null,"Geen zonwering",null,"Geen zonwering",null,"Geen zonwering",null,"Geen zonwering",null,"Geen zonwering"]
["De reductiefactor voor zonwering Fc;wi;k",{"$f":"o_Zonweringreductie(B37,B8)","v":{"$error":"#NAME?"}},null,{"$f":"o_Zonweringreductie(D37,B8)","v":{"$error":"#NAME?"}},null,{"$f":"o_Zonweringreductie(F37,F8)","v":{"$error":"#NAME?"}},null,{"$f":"o_Zonweringreductie(H37,F8)","v":{"$error":"#NAME?"}},null,{"$f":"o_Zonweringreductie(J37,J8)","v":{"$error":"#NAME?"}},null,{"$f":"o_Zonweringreductie(L37,J8)","v":{"$error":"#NAME?"}},null,{"$f":"o_Zonweringreductie(N37,N8)","v":{"$error":"#NAME?"}},null,{"$f":"o_Zonweringreductie(P37,N8)","v":{"$error":"#NAME?"}},null,{"$f":"o_Zonweringreductie(R37,R8)","v":1},null,{"$f":"o_Zonweringreductie(T37,R8)","v":1}]
["Totaal opvallende zonnestraling van het raam Isol;wi;k;juli",{"$f":"IF(B10=\"Nee\",0,o_Isol_Bij_Tijdstip($B$52,B8,B11))","v":0},"W/m²",{"$f":"IF(B10=\"Nee\",0,o_Isol_Bij_Tijdstip($B$52,B8,B11))","v":0},"W/m²",{"$f":"IF(F10=\"Nee\",0,o_Isol_Bij_Tijdstip($B$52,F8,F11))","v":0},"W/m²",{"$f":"IF(F10=\"Nee\",0,o_Isol_Bij_Tijdstip($B$52,F8,F11))","v":0},"W/m²",{"$f":"IF(J10=\"Nee\",0,o_Isol_Bij_Tijdstip($B$52,J8,J11))","v":0},"W/m²",{"$f":"IF(J10=\"Nee\",0,o_Isol_Bij_Tijdstip($B$52,J8,J11))","v":0},"W/m²",{"$f":"IF(N10=\"Nee\",0,o_Isol_Bij_Tijdstip($B$52,N8,N11))","v":0},"W/m²",{"$f":"IF(N10=\"Nee\",0,o_Isol_Bij_Tijdstip($B$52,N8,N11))","v":0},"W/m²",{"$f":"IF(R10=\"Nee\",0,o_Isol_Bij_Tijdstip($B$52,R8,R11))","v":0},"W/m²",{"$f":"IF(R10=\"Nee\",0,o_Isol_Bij_Tijdstip($B$52,R8,R11))","v":0},"W/m²"]
[]
["Tijdstip maximale koellastbijdrage tmax;zi",{"$f":"VALUE(o_Tijdstip_Isol_Max_Orientatie(B8,B11))","v":{"$error":"#NAME?"}},null,null,null,{"$f":"VALUE(o_Tijdstip_Isol_Max_Orientatie(F8,F11))","v":{"$error":"#NAME?"}},null,null,null,{"$f":"VALUE(o_Tijdstip_Isol_Max_Orientatie(J8,J11))","v":{"$error":"#NAME?"}},null,null,null,{"$f":"VALUE(o_Tijdstip_Isol_Max_Orientatie(N8,N11))","v":{"$error":"#NAME?"}},null,null,null,{"$f":"o_Tijdstip_Isol_Max_Orientatie(R8,R11)","v":"12:00:00 PM"}]
["Buitenluchttemperatuur op tijdstip max koellast Θe",{"$f":"o_maxTemp(VALUE(B41))","v":{"$error":"#NAME?"}},null,null,"°C",{"$f":"o_maxTemp(VALUE(F41))","v":{"$error":"#NAME?"}},null,null,"°C",{"$f":"o_maxTemp(VALUE(J41))","v":{"$error":"#NAME?"}},null,null,"°C",{"$f":"o_maxTemp(VALUE(N41))","v":{"$error":"#NAME?"}},null,null,"°C",{"$f":"o_maxTemp(VALUE(R41))","v":29.5}]
[]
["Glasopppervlak",{"$f":"IF(B10=\"Ja\",B18+D18,0)","v":0},"m²",null,null,{"$f":"IF(F10=\"Ja\",F18+H18,0)","v":0},"m²",null,null,{"$f":"IF(J10=\"Ja\",J18+L18,0)","v":0},"m²",null,null,{"$f":"IF(N10=\"Ja\",N18+P18,0)","v":0},"m²",null,null,{"$f":"IF(R10=\"Ja\",R18+T18,0)","v":0},"m²"]
["Uitwendigescheidingsconstructie niet op Noord?",{"$f":"IF(B10=\"Ja\",IF(B8=\"Noord\",FALSE,TRUE),FALSE)","v":false},null,null,null,{"$f":"IF(F10=\"Ja\",IF(F8=\"Noord\",FALSE,TRUE),FALSE)","v":false},null,null,null,{"$f":"IF(J10=\"Ja\",IF(J8=\"Noord\",FALSE,TRUE),FALSE)","v":false},null,null,null,{"$f":"IF(N10=\"Ja\",IF(N8=\"Noord\",FALSE,TRUE),FALSE)","v":false},null,null,null,{"$f":"IF(R10=\"Ja\",IF(R8=\"Noord\",FALSE,TRUE),FALSE)","v":false}]
["De enige uitwendigescheidingscontructie?",{"$f":"IF(AND(B45=TRUE,COUNTIF($B$45:$R$45,TRUE)=1),TRUE,FALSE)","v":false},null,null,null,{"$f":"IF(AND(F45=TRUE,COUNTIF($B$45:$R$45,TRUE)=1),TRUE,FALSE)","v":false},null,null,null,{"$f":"IF(AND(J45=TRUE,COUNTIF($B$45:$R$45,TRUE)=1),TRUE,FALSE)","v":false},null,null,null,{"$f":"IF(AND(N45=TRUE,COUNTIF($B$45:$R$45,TRUE)=1),TRUE,FALSE)","v":false},null,null,null,{"$f":"IF(AND(R45=TRUE,COUNTIF($B$45:$R$45,TRUE)=1),TRUE,FALSE)","v":false}]
["Totaal glasoppervlak",{"$f":"IF(B8<>\"Noord\",B44,0)","v":0},"m²",null,null,{"$f":"IF(F8<>\"Noord\",F44,0)","v":{"$error":"#NAME?"}},"m²",null,null,{"$f":"IF(J8<>\"Noord\",J44,0)","v":{"$error":"#NAME?"}},"m²",null,null,{"$f":"IF(N8<>\"Noord\",N44,0)","v":{"$error":"#NAME?"}},"m²",null,null,{"$f":"R44","v":0},"m²"]
["Grootste glasoppervlak ",{"$f":"IF(AND(B45,B47=MAX($B$47:$R$47)),TRUE,FALSE)","v":{"$error":"#NAME?"}},null,null,null,{"$f":"IF(AND(F45,F47=MAX($B$47:$R$47)),TRUE,FALSE)","v":{"$error":"#NAME?"}},null,null,null,{"$f":"IF(AND(J45,J47=MAX($B$47:$R$47)),TRUE,FALSE)","v":{"$error":"#NAME?"}},null,null,null,{"$f":"IF(AND(N45,N47=MAX($B$47:$R$47)),TRUE,FALSE)","v":{"$error":"#NAME?"}},null,null,null,{"$f":"IF(AND(R45,R47=MAX($B$47:$R$47)),TRUE,FALSE)","v":{"$error":"#NAME?"}}]
["Dakvlak maatgevend?",{"$f":"IF(AND(B11<90,B15>3*(B18+D18),'Projectgegevens en Resultaten'!#REF!<65),TRUE,FALSE)","v":{"$error":"#REF!"}},null,null,null,{"$f":"IF(AND(F11<90,F15>3*(F18+H18),'Projectgegevens en Resultaten'!#REF!<65),TRUE,FALSE)","v":{"$error":"#REF!"}},null,null,null,{"$f":"IF(AND(J11<90,J15>3*(J18+L18),'Projectgegevens en Resultaten'!#REF!<65),TRUE,FALSE)","v":{"$error":"#REF!"}},null,null,null,{"$f":"IF(AND(N11<90,N15>3*(N18+P18),'Projectgegevens en Resultaten'!#REF!<65),TRUE,FALSE)","v":{"$error":"#REF!"}},null,null,null,{"$f":"IF(AND(R11<90,R15>3*(R18+T18),'Projectgegevens en Resultaten'!#REF!<65),TRUE,FALSE)","v":{"$error":"#REF!"}}]
["is er een maatgevend dakoppervlak",{"$f":"IF(COUNTIF($B$49:$R$49,TRUE)>0,TRUE,FALSE)","v":false},null,null,null,{"$f":"IF(COUNTIF($B$49:$R$49,TRUE)>0,TRUE,FALSE)","v":false},null,null,null,{"$f":"IF(COUNTIF($B$49:$R$49,TRUE)>0,TRUE,FALSE)","v":false},null,null,null,{"$f":"IF(COUNTIF($B$49:$R$49,TRUE)>0,TRUE,FALSE)","v":false},null,null,null,{"$f":"IF(COUNTIF($B$49:$R$49,TRUE)>0,TRUE,FALSE)","v":false}]
["Maatgevende tijdstip",{"$f":"IF(OR(B46,AND(B45,B50,B49),AND(B45,B48,NOT(B50))),B41)","v":{"$error":"#REF!"}},null,null,null,{"$f":"IF(OR(F46,AND(F45,F50,F49),AND(F45,F48,NOT(F50))),F41)","v":{"$error":"#REF!"}},null,null,null,{"$f":"IF(OR(J46,AND(J45,J50,J49),AND(J45,J48,NOT(J50))),J41)","v":{"$error":"#REF!"}},null,null,null,{"$f":"IF(OR(N46,AND(N45,N50,N49),AND(N45,N48,NOT(N50))),N41)","v":{"$error":"#REF!"}},null,null,null,{"$f":"IF(OR(R46,AND(R45,R50,R49),AND(R45,R48,NOT(R50))),R41)","v":{"$error":"#REF!"}}]
["Maatgevende tijdstip tmax;zi",{"$f":"IFERROR(B88,\"geen glas ingevoerd\")","v":"geen glas ingevoerd"}]
["Buitenluchttemperatuur op tijdstip max koellast Θe",{"$f":"o_maxTemp(VALUE(B52))","v":{"$error":"#NAME?"}},"°C"]
[]
["Koellastbijdrage transmissie ondoorzichtige delen Ptr;ntr;vr;zi",{"$f":"IF(B10=\"Nee\",0,B16*'Projectgegevens en Resultaten'!$B$16)","v":0},null,null,"W",{"$f":"IF(F10=\"Nee\",0,F16*'Projectgegevens en Resultaten'!$B$16)","v":0},null,null,"W",{"$f":"IF(J10=\"Nee\",0,J16*'Projectgegevens en Resultaten'!$B$16)","v":0},null,null,"W",{"$f":"IF(N10=\"Nee\",0,N16*'Projectgegevens en Resultaten'!$B$16)","v":0},null,null,"W",{"$f":"IF(R10=\"Nee\",0,R16*'Projectgegevens en Resultaten'!$B$16)","v":0},null,null,"W"]
["Koellastbijdrage zoninstraling transparante delen Psol;vr;zi",{"$f":"(0.75*B18*FLOOR(B20,0.05)*0.9*B35*B38*B39)+(0.75*D18*FLOOR(D20,0.05)*0.9*D35*D38*D39)","v":{"$error":"#NAME?"}},null,null,"W",{"$f":"(0.75*F18*FLOOR(F20,0.05)*0.9*F35*F38*F39)+(0.75*H18*FLOOR(H20,0.05)*0.9*H35*H38*H39)","v":{"$error":"#NAME?"}},null,null,"W",{"$f":"(0.75*J18*FLOOR(J20,0.05)*0.9*J35*J38*J39)+(0.75*L18*FLOOR(L20,0.05)*0.9*L35*L38*L39)","v":{"$error":"#NAME?"}},null,null,"W",{"$f":"(0.75*N18*FLOOR(N20,0.05)*0.9*N35*N38*N39)+(0.75*P18*FLOOR(P20,0.05)*0.9*P35*P38*P39)","v":{"$error":"#NAME?"}},null,null,"W",{"$f":"(0.75*R18*FLOOR(R20,0.05)*0.9*R35*R38*R39)+(0.75*T18*FLOOR(T20,0.05)*0.9*T35*T38*T39)","v":0},null,null,"W"]
["Koellastbijdrage transmissie transparante delen Ptr;gl;vr;zi",{"$f":"IF(B10=\"Nee\",0,IFERROR(B18*B19*($B$53-24),0)+IFERROR(D18*D19*($B$53-24),0))","v":0},null,null,"W",{"$f":"IF(F10=\"Nee\",0,IFERROR(F18*F19*($B$53-24),0)+IFERROR(H18*H19*($B$53-24),0))","v":0},null,null,"W",{"$f":"IF(J10=\"Nee\",0,IFERROR(J18*J19*($B$53-24),0)+IFERROR(L18*L19*($B$53-24),0))","v":0},null,null,"W",{"$f":"IF(N10=\"Nee\",0,IFERROR(N18*N19*($B$53-24),0)+IFERROR(P18*P19*($B$53-24),0))","v":0},null,null,"W",{"$f":"IF(R10=\"Nee\",0,IFERROR(R18*R19*($B$53-24),0)+IFERROR(T18*T19*($B$53-24),0))","v":0},null,null,"W"]
["Totaal koellastbijdrage per gevel",{"$f":"SUM(B55:D57)","v":{"$error":"#NAME?"}},null,null,"W",{"$f":"SUM(F55:H57)","v":{"$error":"#NAME?"}},null,null,"W",{"$f":"SUM(J55:L57)","v":{"$error":"#NAME?"}},null,null,"W",{"$f":"SUM(N55:P57)","v":{"$error":"#NAME?"}},null,null,"W",{"$f":"SUM(R55:R57)","v":0},null,null,"W"]
[]
["Koellast door interne warmtelast Pint;calc;woon/overig;zi",{"$f":"IF(B5=0,0,IF(B4=\"Woonvertrek\",2*'Projectgegevens en Resultaten'!$B$33*B5,'Projectgegevens en Resultaten'!$B$33*B5))","v":0},null,null,"W"]
["Koellast door buitenluchttoetreding Pv;calc;vr;zi",{"$f":"IFERROR(MAX((SUM('Projectgegevens en Resultaten'!$B$21:$B$23)/3600*1.205*1005*(B53-24))/SUM('Projectgegevens en Resultaten'!$B$40:$T$40)*B5,0),0)","v":0},{"$f":"IFERROR(MAX(SUM(C57:C59)/3600*1.205*1005*(C60-24),0),0)","v":0},{"$f":"IFERROR(MAX(SUM(D57:D59)/3600*1.205*1005*(D60-24),0),0)","v":0},"W"]
[]
["Totaal koellastbijdrage",{"$f":"IFERROR(SUM(B58:T58)+B60+B61,0)","v":0},null,null,"W"]
["Koelbehoefte verblijfsruimte",{"$f":"IFERROR(B63/B5,0)","v":0},null,null,"W/m²"]
[]
[]
[]
[]
[]
[]
["Onderstaande tabellen worden verborgen in de uiteindelijke versie. De tabellen dienen om vast te stellen welk tijdstip tot de hoogste zonbelasting leidt"]
[]
["Isol max voor de orientatie",{"$f":"o_Isol_Max_Orientatie(B8,B11)","v":{"$error":"#NAME?"}},"W/m²",null,null,{"$f":"o_Isol_Max_Orientatie(F8,F11)","v":{"$error":"#NAME?"}},"W/m²",null,null,{"$f":"o_Isol_Max_Orientatie(J8,J11)","v":{"$error":"#NAME?"}},"W/m²",null,null,{"$f":"o_Isol_Max_Orientatie(N8,N11)","v":{"$error":"#NAME?"}},"W/m²",null,null,{"$f":"o_Isol_Max_Orientatie(R8,R11)","v":914.11856204111336},"W/m²"]
["Tijdstip bij Isol max bij orientatie",{"$f":"VALUE(o_Tijdstip_Isol_Max_Orientatie(B8,B11))","v":{"$error":"#NAME?"}},null,null,null,{"$f":"VALUE(o_Tijdstip_Isol_Max_Orientatie(F8,F11))","v":{"$error":"#NAME?"}},null,null,null,{"$f":"VALUE(o_Tijdstip_Isol_Max_Orientatie(J8,J11))","v":{"$error":"#NAME?"}},null,null,null,{"$f":"VALUE(o_Tijdstip_Isol_Max_Orientatie(N8,N11))","v":{"$error":"#NAME?"}},null,null,null,{"$f":"VALUE(o_Tijdstip_Isol_Max_Orientatie(R8,R11))","v":"12:00:00"}]
[]
["Koellastbijdrage zoninstraling transparante delen Psol;vr;zi"]
["09:00:00",{"$f":"(0.75*B$18*FLOOR(B$20,0.05)*0.9*B$35*B$38*o_Isol_Bij_Tijdstip($A77,B$8,B$11))+(0.75*D$18*FLOOR(D$20,0.05)*0.9*D$35*D$38*o_Isol_Bij_Tijdstip($A77,B$8,B$11))","v":{"$error":"#NAME?"}},"W",null,null,{"$f":"(0.75*F$18*FLOOR(F$20,0.05)*0.9*F$35*F$38*o_Isol_Bij_Tijdstip($A77,F$8,F$11))+(0.75*H$18*FLOOR(H$20,0.05)*0.9*H$35*H$38*o_Isol_Bij_Tijdstip($A77,F$8,F$11))","v":{"$error":"#NAME?"}},"W",null,null,{"$f":"(0.75*J$18*FLOOR(J$20,0.05)*0.9*J$35*J$38*o_Isol_Bij_Tijdstip($A77,J$8,J$11))+(0.75*L$18*FLOOR(L$20,0.05)*0.9*L$35*L$38*o_Isol_Bij_Tijdstip($A77,J$8,J$11))","v":{"$error":"#NAME?"}},"W",null,null,{"$f":"(0.75*N$18*FLOOR(N$20,0.05)*0.9*N$35*N$38*o_Isol_Bij_Tijdstip($A77,N$8,N$11))+(0.75*P$18*FLOOR(P$20,0.05)*0.9*P$35*P$38*o_Isol_Bij_Tijdstip($A77,N$8,N$11))","v":{"$error":"#NAME?"}},"W",null,null,{"$f":"(0.75*R$18*FLOOR(R$20,0.05)*0.9*R$35*R$38*o_Isol_Bij_Tijdstip($A77,R$8,R$11))+(0.75*T$18*FLOOR(T$20,0.05)*0.9*T$35*T$38*o_Isol_Bij_Tijdstip($A77,R$8,R$11))","v":0},"W",{"$f":"B77+F77+J77+N77+R77","v":{"$error":"#NAME?"}},"W"]
["10:00:00",{"$f":"(0.75*B$18*FLOOR(B$20,0.05)*0.9*B$35*B$38*o_Isol_Bij_Tijdstip($A78,B$8,B$11))+(0.75*D$18*FLOOR(D$20,0.05)*0.9*D$35*D$38*o_Isol_Bij_Tijdstip($A78,B$8,B$11))","v":{"$error":"#NAME?"}},"W",null,null,{"$f":"(0.75*F$18*FLOOR(F$20,0.05)*0.9*F$35*F$38*o_Isol_Bij_Tijdstip($A78,F$8,F$11))+(0.75*H$18*FLOOR(H$20,0.05)*0.9*H$35*H$38*o_Isol_Bij_Tijdstip($A78,F$8,F$11))","v":{"$error":"#NAME?"}},"W",null,null,{"$f":"(0.75*J$18*FLOOR(J$20,0.05)*0.9*J$35*J$38*o_Isol_Bij_Tijdstip($A78,J$8,J$11))+(0.75*L$18*FLOOR(L$20,0.05)*0.9*L$35*L$38*o_Isol_Bij_Tijdstip($A78,J$8,J$11))","v":{"$error":"#NAME?"}},"W",null,null,{"$f":"(0.75*N$18*FLOOR(N$20,0.05)*0.9*N$35*N$38*o_Isol_Bij_Tijdstip($A78,N$8,N$11))+(0.75*P$18*FLOOR(P$20,0.05)*0.9*P$35*P$38*o_Isol_Bij_Tijdstip($A78,N$8,N$11))","v":{"$error":"#NAME?"}},"W",null,null,{"$f":"(0.75*R$18*FLOOR(R$20,0.05)*0.9*R$35*R$38*o_Isol_Bij_Tijdstip($A78,R$8,R$11))+(0.75*T$18*FLOOR(T$20,0.05)*0.9*T$35*T$38*o_Isol_Bij_Tijdstip($A78,R$8,R$11))","v":0},"W",{"$error":"#NAME?"},"W"]
["11:00:00",{"$f":"(0.75*B$18*FLOOR(B$20,0.05)*0.9*B$35*B$38*o_Isol_Bij_Tijdstip($A79,B$8,B$11))+(0.75*D$18*FLOOR(D$20,0.05)*0.9*D$35*D$38*o_Isol_Bij_Tijdstip($A79,B$8,B$11))","v":{"$error":"#NAME?"}},"W",null,null,{"$f":"(0.75*F$18*FLOOR(F$20,0.05)*0.9*F$35*F$38*o_Isol_Bij_Tijdstip($A79,F$8,F$11))+(0.75*H$18*FLOOR(H$20,0.05)*0.9*H$35*H$38*o_Isol_Bij_Tijdstip($A79,F$8,F$11))","v":{"$error":"#NAME?"}},"W",null,null,{"$f":"(0.75*J$18*FLOOR(J$20,0.05)*0.9*J$35*J$38*o_Isol_Bij_Tijdstip($A79,J$8,J$11))+(0.75*L$18*FLOOR(L$20,0.05)*0.9*L$35*L$38*o_Isol_Bij_Tijdstip($A79,J$8,J$11))","v":{"$error":"#NAME?"}},"W",null,null,{"$f":"(0.75*N$18*FLOOR(N$20,0.05)*0.9*N$35*N$38*o_Isol_Bij_Tijdstip($A79,N$8,N$11))+(0.75*P$18*FLOOR(P$20,0.05)*0.9*P$35*P$38*o_Isol_Bij_Tijdstip($A79,N$8,N$11))","v":{"$error":"#NAME?"}},"W",null,null,{"$f":"(0.75*R$18*FLOOR(R$20,0.05)*0.9*R$35*R$38*o_Isol_Bij_Tijdstip($A79,R$8,R$11))+(0.75*T$18*FLOOR(T$20,0.05)*0.9*T$35*T$38*o_Isol_Bij_Tijdstip($A79,R$8,R$11))","v":0},"W",{"$error":"#NAME?"},"W"]
["12:00:00",{"$f":"(0.75*B$18*FLOOR(B$20,0.05)*0.9*B$35*B$38*o_Isol_Bij_Tijdstip($A80,B$8,B$11))+(0.75*D$18*FLOOR(D$20,0.05)*0.9*D$35*D$38*o_Isol_Bij_Tijdstip($A80,B$8,B$11))","v":{"$error":"#NAME?"}},"W",null,null,{"$f":"(0.75*F$18*FLOOR(F$20,0.05)*0.9*F$35*F$38*o_Isol_Bij_Tijdstip($A80,F$8,F$11))+(0.75*H$18*FLOOR(H$20,0.05)*0.9*H$35*H$38*o_Isol_Bij_Tijdstip($A80,F$8,F$11))","v":{"$error":"#NAME?"}},"W",null,null,{"$f":"(0.75*J$18*FLOOR(J$20,0.05)*0.9*J$35*J$38*o_Isol_Bij_Tijdstip($A80,J$8,J$11))+(0.75*L$18*FLOOR(L$20,0.05)*0.9*L$35*L$38*o_Isol_Bij_Tijdstip($A80,J$8,J$11))","v":{"$error":"#NAME?"}},"W",null,null,{"$f":"(0.75*N$18*FLOOR(N$20,0.05)*0.9*N$35*N$38*o_Isol_Bij_Tijdstip($A80,N$8,N$11))+(0.75*P$18*FLOOR(P$20,0.05)*0.9*P$35*P$38*o_Isol_Bij_Tijdstip($A80,N$8,N$11))","v":{"$error":"#NAME?"}},"W",null,null,{"$f":"(0.75*R$18*FLOOR(R$20,0.05)*0.9*R$35*R$38*o_Isol_Bij_Tijdstip($A80,R$8,R$11))+(0.75*T$18*FLOOR(T$20,0.05)*0.9*T$35*T$38*o_Isol_Bij_Tijdstip($A80,R$8,R$11))","v":0},"W",{"$error":"#NAME?"},"W"]
["13:00:00",{"$f":"(0.75*B$18*FLOOR(B$20,0.05)*0.9*B$35*B$38*o_Isol_Bij_Tijdstip($A81,B$8,B$11))+(0.75*D$18*FLOOR(D$20,0.05)*0.9*D$35*D$38*o_Isol_Bij_Tijdstip($A81,B$8,B$11))","v":{"$error":"#NAME?"}},"W",null,null,{"$f":"(0.75*F$18*FLOOR(F$20,0.05)*0.9*F$35*F$38*o_Isol_Bij_Tijdstip($A81,F$8,F$11))+(0.75*H$18*FLOOR(H$20,0.05)*0.9*H$35*H$38*o_Isol_Bij_Tijdstip($A81,F$8,F$11))","v":{"$error":"#NAME?"}},"W",null,null,{"$f":"(0.75*J$18*FLOOR(J$20,0.05)*0.9*J$35*J$38*o_Isol_Bij_Tijdstip($A81,J$8,J$11))+(0.75*L$18*FLOOR(L$20,0.05)*0.9*L$35*L$38*o_Isol_Bij_Tijdstip($A81,J$8,J$11))","v":{"$error":"#NAME?"}},"W",null,null,{"$f":"(0.75*N$18*FLOOR(N$20,0.05)*0.9*N$35*N$38*o_Isol_Bij_Tijdstip($A81,N$8,N$11))+(0.75*P$18*FLOOR(P$20,0.05)*0.9*P$35*P$38*o_Isol_Bij_Tijdstip($A81,N$8,N$11))","v":{"$error":"#NAME?"}},"W",null,null,{"$f":"(0.75*R$18*FLOOR(R$20,0.05)*0.9*R$35*R$38*o_Isol_Bij_Tijdstip($A81,R$8,R$11))+(0.75*T$18*FLOOR(T$20,0.05)*0.9*T$35*T$38*o_Isol_Bij_Tijdstip($A81,R$8,R$11))","v":0},"W",{"$error":"#NAME?"},"W"]
["14:00:00",{"$f":"(0.75*B$18*FLOOR(B$20,0.05)*0.9*B$35*B$38*o_Isol_Bij_Tijdstip($A82,B$8,B$11))+(0.75*D$18*FLOOR(D$20,0.05)*0.9*D$35*D$38*o_Isol_Bij_Tijdstip($A82,B$8,B$11))","v":{"$error":"#NAME?"}},"W",null,null,{"$f":"(0.75*F$18*FLOOR(F$20,0.05)*0.9*F$35*F$38*o_Isol_Bij_Tijdstip($A82,F$8,F$11))+(0.75*H$18*FLOOR(H$20,0.05)*0.9*H$35*H$38*o_Isol_Bij_Tijdstip($A82,F$8,F$11))","v":{"$error":"#NAME?"}},"W",null,null,{"$f":"(0.75*J$18*FLOOR(J$20,0.05)*0.9*J$35*J$38*o_Isol_Bij_Tijdstip($A82,J$8,J$11))+(0.75*L$18*FLOOR(L$20,0.05)*0.9*L$35*L$38*o_Isol_Bij_Tijdstip($A82,J$8,J$11))","v":{"$error":"#NAME?"}},"W",null,null,{"$f":"(0.75*N$18*FLOOR(N$20,0.05)*0.9*N$35*N$38*o_Isol_Bij_Tijdstip($A82,N$8,N$11))+(0.75*P$18*FLOOR(P$20,0.05)*0.9*P$35*P$38*o_Isol_Bij_Tijdstip($A82,N$8,N$11))","v":{"$error":"#NAME?"}},"W",null,null,{"$f":"(0.75*R$18*FLOOR(R$20,0.05)*0.9*R$35*R$38*o_Isol_Bij_Tijdstip($A82,R$8,R$11))+(0.75*T$18*FLOOR(T$20,0.05)*0.9*T$35*T$38*o_Isol_Bij_Tijdstip($A82,R$8,R$11))","v":0},"W",{"$error":"#NAME?"},"W"]
["15:00:00",{"$f":"(0.75*B$18*FLOOR(B$20,0.05)*0.9*B$35*B$38*o_Isol_Bij_Tijdstip($A83,B$8,B$11))+(0.75*D$18*FLOOR(D$20,0.05)*0.9*D$35*D$38*o_Isol_Bij_Tijdstip($A83,B$8,B$11))","v":{"$error":"#NAME?"}},"W",null,null,{"$f":"(0.75*F$18*FLOOR(F$20,0.05)*0.9*F$35*F$38*o_Isol_Bij_Tijdstip($A83,F$8,F$11))+(0.75*H$18*FLOOR(H$20,0.05)*0.9*H$35*H$38*o_Isol_Bij_Tijdstip($A83,F$8,F$11))","v":{"$error":"#NAME?"}},"W",null,null,{"$f":"(0.75*J$18*FLOOR(J$20,0.05)*0.9*J$35*J$38*o_Isol_Bij_Tijdstip($A83,J$8,J$11))+(0.75*L$18*FLOOR(L$20,0.05)*0.9*L$35*L$38*o_Isol_Bij_Tijdstip($A83,J$8,J$11))","v":{"$error":"#NAME?"}},"W",null,null,{"$f":"(0.75*N$18*FLOOR(N$20,0.05)*0.9*N$35*N$38*o_Isol_Bij_Tijdstip($A83,N$8,N$11))+(0.75*P$18*FLOOR(P$20,0.05)*0.9*P$35*P$38*o_Isol_Bij_Tijdstip($A83,N$8,N$11))","v":{"$error":"#NAME?"}},"W",null,null,{"$f":"(0.75*R$18*FLOOR(R$20,0.05)*0.9*R$35*R$38*o_Isol_Bij_Tijdstip($A83,R$8,R$11))+(0.75*T$18*FLOOR(T$20,0.05)*0.9*T$35*T$38*o_Isol_Bij_Tijdstip($A83,R$8,R$11))","v":0},"W",{"$error":"#NAME?"},"W"]
["16:00:00",{"$f":"(0.75*B$18*FLOOR(B$20,0.05)*0.9*B$35*B$38*o_Isol_Bij_Tijdstip($A84,B$8,B$11))+(0.75*D$18*FLOOR(D$20,0.05)*0.9*D$35*D$38*o_Isol_Bij_Tijdstip($A84,B$8,B$11))","v":{"$error":"#NAME?"}},"W",null,null,{"$f":"(0.75*F$18*FLOOR(F$20,0.05)*0.9*F$35*F$38*o_Isol_Bij_Tijdstip($A84,F$8,F$11))+(0.75*H$18*FLOOR(H$20,0.05)*0.9*H$35*H$38*o_Isol_Bij_Tijdstip($A84,F$8,F$11))","v":{"$error":"#NAME?"}},"W",null,null,{"$f":"(0.75*J$18*FLOOR(J$20,0.05)*0.9*J$35*J$38*o_Isol_Bij_Tijdstip($A84,J$8,J$11))+(0.75*L$18*FLOOR(L$20,0.05)*0.9*L$35*L$38*o_Isol_Bij_Tijdstip($A84,J$8,J$11))","v":{"$error":"#NAME?"}},"W",null,null,{"$f":"(0.75*N$18*FLOOR(N$20,0.05)*0.9*N$35*N$38*o_Isol_Bij_Tijdstip($A84,N$8,N$11))+(0.75*P$18*FLOOR(P$20,0.05)*0.9*P$35*P$38*o_Isol_Bij_Tijdstip($A84,N$8,N$11))","v":{"$error":"#NAME?"}},"W",null,null,{"$f":"(0.75*R$18*FLOOR(R$20,0.05)*0.9*R$35*R$38*o_Isol_Bij_Tijdstip($A84,R$8,R$11))+(0.75*T$18*FLOOR(T$20,0.05)*0.9*T$35*T$38*o_Isol_Bij_Tijdstip($A84,R$8,R$11))","v":0},"W",{"$error":"#NAME?"},"W"]
["17:00:00",{"$f":"(0.75*B$18*FLOOR(B$20,0.05)*0.9*B$35*B$38*o_Isol_Bij_Tijdstip($A85,B$8,B$11))+(0.75*D$18*FLOOR(D$20,0.05)*0.9*D$35*D$38*o_Isol_Bij_Tijdstip($A85,B$8,B$11))","v":{"$error":"#NAME?"}},"W",null,null,{"$f":"(0.75*F$18*FLOOR(F$20,0.05)*0.9*F$35*F$38*o_Isol_Bij_Tijdstip($A85,F$8,F$11))+(0.75*H$18*FLOOR(H$20,0.05)*0.9*H$35*H$38*o_Isol_Bij_Tijdstip($A85,F$8,F$11))","v":{"$error":"#NAME?"}},"W",null,null,{"$f":"(0.75*J$18*FLOOR(J$20,0.05)*0.9*J$35*J$38*o_Isol_Bij_Tijdstip($A85,J$8,J$11))+(0.75*L$18*FLOOR(L$20,0.05)*0.9*L$35*L$38*o_Isol_Bij_Tijdstip($A85,J$8,J$11))","v":{"$error":"#NAME?"}},"W",null,null,{"$f":"(0.75*N$18*FLOOR(N$20,0.05)*0.9*N$35*N$38*o_Isol_Bij_Tijdstip($A85,N$8,N$11))+(0.75*P$18*FLOOR(P$20,0.05)*0.9*P$35*P$38*o_Isol_Bij_Tijdstip($A85,N$8,N$11))","v":{"$error":"#NAME?"}},"W",null,null,{"$f":"(0.75*R$18*FLOOR(R$20,0.05)*0.9*R$35*R$38*o_Isol_Bij_Tijdstip($A85,R$8,R$11))+(0.75*T$18*FLOOR(T$20,0.05)*0.9*T$35*T$38*o_Isol_Bij_Tijdstip($A85,R$8,R$11))","v":0},"W",{"$error":"#NAME?"},"W"]
["18:00:00",{"$f":"(0.75*B$18*FLOOR(B$20,0.05)*0.9*B$35*B$38*o_Isol_Bij_Tijdstip($A86,B$8,B$11))+(0.75*D$18*FLOOR(D$20,0.05)*0.9*D$35*D$38*o_Isol_Bij_Tijdstip($A86,B$8,B$11))","v":{"$error":"#NAME?"}},"W",null,null,{"$f":"(0.75*F$18*FLOOR(F$20,0.05)*0.9*F$35*F$38*o_Isol_Bij_Tijdstip($A86,F$8,F$11))+(0.75*H$18*FLOOR(H$20,0.05)*0.9*H$35*H$38*o_Isol_Bij_Tijdstip($A86,F$8,F$11))","v":{"$error":"#NAME?"}},"W",null,null,{"$f":"(0.75*J$18*FLOOR(J$20,0.05)*0.9*J$35*J$38*o_Isol_Bij_Tijdstip($A86,J$8,J$11))+(0.75*L$18*FLOOR(L$20,0.05)*0.9*L$35*L$38*o_Isol_Bij_Tijdstip($A86,J$8,J$11))","v":{"$error":"#NAME?"}},"W",null,null,{"$f":"(0.75*N$18*FLOOR(N$20,0.05)*0.9*N$35*N$38*o_Isol_Bij_Tijdstip($A86,N$8,N$11))+(0.75*P$18*FLOOR(P$20,0.05)*0.9*P$35*P$38*o_Isol_Bij_Tijdstip($A86,N$8,N$11))","v":{"$error":"#NAME?"}},"W",null,null,{"$f":"(0.75*R$18*FLOOR(R$20,0.05)*0.9*R$35*R$38*o_Isol_Bij_Tijdstip($A86,R$8,R$11))+(0.75*T$18*FLOOR(T$20,0.05)*0.9*T$35*T$38*o_Isol_Bij_Tijdstip($A86,R$8,R$11))","v":0},"W",{"$error":"#NAME?"},"W"]
[]
["Maatgevende tijdstip",{"$f":"IF(MAX(T77:T86)=0,\"Geen glas aanwezig\",_xlfn.XLOOKUP(MAX(T77:T86),T77:T86,A77:A86,\"nvt\"))","v":{"$error":"#NAME?"}}]

{"sheet":"Ruimte 3","index":5,"n_rows":88,"n_cols":21,"rows_kept":88,"cut":false,"hidden":false,"merged":[[70,0,71,20],[0,0,0,20],[6,1,6,3],[6,5,6,7],[6,9,6,11],[6,13,6,15],[6,17,6,20],[41,1,41,3],[41,5,41,7],[41,9,41,11],[41,13,41,15],[41,17,41,19],[40,1,40,3],[40,5,40,7],[40,9,40,11],[40,13,40,15],[40,17,40,19],[55,1,55,3],[55,5,55,7],[55,9,55,11],[55,13,55,15],[55,17,55,19],[54,1,54,3],[54,5,54,7],[54,9,54,11],[54,13,54,15],[54,17,54,19],[56,5,56,7],[56,9,56,11],[56,13,56,15],[56,17,56,19],[57,1,57,3],[57,5,57,7],[57,9,57,11],[57,13,57,15],[57,17,57,19],[59,1,59,3],[60,1,60,3],[62,1,62,3],[63,1,63,3],[56,1,56,3]]}
["RUIMTE 3"]
[]
["Ruimtenaam",3]
["Type verblijfsruimte","Andere verblijfsruimte"]
["Vloeroppervlak verblijfsruimte Avr  (gebruiksoppervlak)",0,"m²"]
[]
[null,"Voorzijde woning",null,null,null,"Linker zijde woning",null,null,null,"Achterzijde woning",null,null,null,"Rechter zijde woning",null,null,null,"Platdak"]
["Orientatie gevel / dakvlak (Helling > 15°C)",{"$f":"'Projectgegevens en Resultaten'!$B$17","v":0},null,null,null,{"$f":"o_Orientatie(F9)","v":{"$error":"#NAME?"}},null,null,null,{"$f":"o_Orientatie(J9)","v":{"$error":"#NAME?"}},null,null,null,{"$f":"o_Orientatie(N9)","v":{"$error":"#NAME?"}},null,null,null,"Horizontaal"]
["Orientatiehoek gevel Ƴ",{"$f":"o_OrientatiehOEK(B8)","v":{"$error":"#NAME?"}},null,null,null,{"$f":"IF(B9+90>360,B9+90-360,B9+90)","v":{"$error":"#NAME?"}},null,null,null,{"$f":"IF(F9+90>360,F9+90-360,F9+90)","v":{"$error":"#NAME?"}},null,null,null,{"$f":"IF(J9+90>360,J9+90-360,J9+90)","v":{"$error":"#NAME?"}}]
["Grenst aan buitenlucht ja of nee","Nee",null,null,null,"Nee",null,null,null,"Nee",null,null,null,"Nee",null,null,null,"Nee"]
["Hellingshoek constructie ≥ 15° = hellenddak 90° = gevel",90,"°",null,null,90,"°",null,null,90,"°",null,null,90,"°",null,null,0,"°"]
["Type constructie",{"$f":"o_TypeConstructie(B10,B11)","v":"Woningscheidend"},null,null,null,{"$f":"o_TypeConstructie(F10,F11)","v":"Woningscheidend"},null,null,null,{"$f":"o_TypeConstructie(J10,J11)","v":"Woningscheidend"},null,null,null,{"$f":"o_TypeConstructie(N10,N11)","v":"Woningscheidend"},null,null,null,{"$f":"o_TypeConstructie(R10,R11)","v":"Woningscheidend"}]
["Gevel lengte (binnenwerks)",null,"m",null,null,null,"m",null,null,null,"m",null,null,null,"m",null,null,null,"m"]
["Gevel hoogte / Dak breedte (binnenwerks)",null,"m",null,null,null,"m",null,null,null,"m",null,null,null,"m",null,null,null,"m"]
["Constructie oppervlak (binnenwerks)",{"$f":"B13*B14","v":0},"m²",null,null,{"$f":"F13*F14","v":0},"m²",null,null,{"$f":"J13*J14","v":0},"m²",null,null,{"$f":"N13*N14","v":0},"m²",null,null,{"$f":"R13*R14","v":0},"m²"]
["Gesloten constructie oppervlak",{"$f":"MAX(0,B15-B18-D18)","v":0},"m²",null,null,{"$f":"MAX(0,F15-F18-H18)","v":0},"m²",null,null,{"$f":"MAX(0,J15-J18-L18)","v":0},"m²",null,null,{"$f":"MAX(0,N15-N18-P18)","v":0},"m²",null,null,{"$f":"MAX(0,R15-R18-T18)","v":0},"m²"]
[null,"Glasvlak type 1",null,"Glasvlak type 2",null,"Glasvlak type 1",null,"Glasvlak type 2",null,"Glasvlak type 1",null,"Glasvlak type 2",null,"Glasvlak type 1",null,"Glasvlak type 2",null,"Glasvlak type 1",null,"Glasvlak type 2"]
["Totaal oppervlak van raamtype Aw,k (inclusief kozijn)",null,"m²",null,"m²",null,"m²",null,"m²",null,"m²",null,"m²",null,"m²",null,"m²",null,"m²",null,"m²"]
["Warmtedoorgangscoefficient (U-waarde) van het raam Uw;wi;k",null,"W/m².K",null,"W/m².K",null,"W/m².K",null,"W/m².K",null,"W/m².K",null,"W/m².K",null,"W/m².K",null,"W/m².K",null,"W/m².K",null,"W/m².K"]
["Zontoetredingsfactor (g_waarde) van het glas Ggl;n;wi;k;C;juli",1,null,1,null,1,null,1,null,1,null,1,null,1,null,1,null,1,null,1]
["Beschaduwing situatie bij het raamtype","Minimale belemmering",null,"Minimale belemmering",null,"Minimale belemmering",null,"Minimale belemmering",null,"Minimale belemmering",null,"Minimale belemmering",null,"Minimale belemmering",null,"Minimale belemmering",null,"Minimale belemmering",null,"Minimale belemmering"]
[]
[null,"Overstek",null,"Overstek",null,"Overstek",null,"Overstek",null,"Overstek",null,"Overstek",null,"Overstek",null,"Overstek"]
["Hoogte verschil midden raam onderzijde overstek",0,"m",0,"m",0,"m",0,"m",0,"m",0,"m",0,"m",0,"m",0,null,0,"m"]
["Horizontale afstand glas tot eindpunt overstek",0,"m",0,"m",0,"m",0,"m",0,"m",0,"m",0,"m",0,"m",0,null,0,"m"]
["Overstekhoek",{"$f":"IFERROR(180/PI()*ATAN(B24/B25),0)","v":0},"°",{"$f":"IFERROR(180/PI()*ATAN(D24/D25),0)","v":0},"°",{"$f":"IFERROR(180/PI()*ATAN(F24/F25),0)","v":0},"°",{"$f":"IFERROR(180/PI()*ATAN(H24/H25),0)","v":0},"°",{"$f":"IFERROR(180/PI()*ATAN(J24/J25),0)","v":0},"°",{"$f":"IFERROR(180/PI()*ATAN(L24/L25),0)","v":0},"°",{"$f":"IFERROR(180/PI()*ATAN(N24/N25),0)","v":0},"°",{"$f":"IFERROR(180/PI()*ATAN(P24/P25),0)","v":0},"°",null,null,null,"°"]
["Relatieve hoogte van overstek",{"$f":"IFERROR(B24/B25,1)","v":1},null,{"$f":"IFERROR(D24/D25,1)","v":1},null,{"$f":"IFERROR(F24/F25,1)","v":1},null,{"$f":"IFERROR(H24/H25,1)","v":1},null,{"$f":"IFERROR(J24/J25,1)","v":1},null,{"$f":"IFERROR(L24/L25,1)","v":1},null,{"$f":"IFERROR(N24/N25,1)","v":1},null,{"$f":"IFERROR(P24/P25,1)","v":1}]
[]
[null,"Zijbelemmering",null,"Zijbelemmering",null,"Zijbelemmering",null,"Zijbelemmering",null,"Zijbelemmering",null,"Zijbelemmering",null,"Zijbelemmering",null,"Zijbelemmering"]
["Positie zijbelemmering irt zichtveld (naar buitengericht)","Links",null,"Links",null,"Links",null,"Links",null,"Links",null,"Links",null,"Links",null,"Links",null,"Links",null,"Links"]
["Horizontale afstand midden raam verste punt belemmering",0,"m",0,"m",0,"m",0,"m",0,"m",0,"m",0,"m",0,"m",0,null,0,"m"]
["Horizontale breedte glas tot eindpunt belemmering",0,"m",0,"m",0,"m",0,"m",0,"m",0,"m",0,"m",0,"m",0,null,0,"m"]
["Relatieve breedte van de zijbelemmering bb",{"$f":"IFERROR(B31/B32,999)","v":999},null,{"$f":"IFERROR(D31/D32,999)","v":999},null,{"$f":"IFERROR(F31/F32,999)","v":999},null,{"$f":"IFERROR(H31/H32,999)","v":999},null,{"$f":"IFERROR(J31/J32,999)","v":999},null,{"$f":"IFERROR(L31/L32,999)","v":999},null,{"$f":"IFERROR(N31/N32,999)","v":999},null,{"$f":"IFERROR(P31/P32,999)","v":999}]
[]
["De beschaduwingsreductiefactor Fsh;obst;wi;k;juli",{"$f":"IFERROR(o_Beschaduwingreductie(B21,B8,B27,B30,B33,B11),1)","v":1},null,{"$f":"IFERROR(o_Beschaduwingreductie(D21,B8,D27,D30,D33,B11),1)","v":1},null,{"$f":"IFERROR(o_Beschaduwingreductie(F21,F8,F27,F30,F33,F11),1)","v":1},null,{"$f":"IFERROR(o_Beschaduwingreductie(H21,F8,H27,H30,H33,F11),1)","v":1},null,{"$f":"IFERROR(o_Beschaduwingreductie(J21,J8,J27,J30,J33,J11),1)","v":1},null,{"$f":"IFERROR(o_Beschaduwingreductie(L21,J8,L27,L30,L33,J11),1)","v":1},null,{"$f":"IFERROR(o_Beschaduwingreductie(N21,N8,N27,N30,N33,N11),1)","v":1},null,{"$f":"IFERROR(o_Beschaduwingreductie(P21,N8,P27,P30,P33,N11),1)","v":1},null,{"$f":"o_Beschaduwingreductie(R21,R8,R27,R30,R33,R11)","v":1},null,{"$f":"o_Beschaduwingreductie(T21,R8,T27,T30,T33,R11)","v":1}]
[]
["Type zonwering","Geen zonwering",null,"Geen zonwering",null,"Geen zonwering",null,"Geen zonwering",null,"Geen zonwering",null,"Geen zonwering",null,"Geen zonwering",null,"Geen zonwering",null,"Geen zonwering",null,"Geen zonwering"]
["De reductiefactor voor zonwering Fc;wi;k",{"$f":"o_Zonweringreductie(B37,B8)","v":{"$error":"#NAME?"}},null,{"$f":"o_Zonweringreductie(D37,B8)","v":{"$error":"#NAME?"}},null,{"$f":"o_Zonweringreductie(F37,F8)","v":{"$error":"#NAME?"}},null,{"$f":"o_Zonweringreductie(H37,F8)","v":{"$error":"#NAME?"}},null,{"$f":"o_Zonweringreductie(J37,J8)","v":{"$error":"#NAME?"}},null,{"$f":"o_Zonweringreductie(L37,J8)","v":{"$error":"#NAME?"}},null,{"$f":"o_Zonweringreductie(N37,N8)","v":{"$error":"#NAME?"}},null,{"$f":"o_Zonweringreductie(P37,N8)","v":{"$error":"#NAME?"}},null,{"$f":"o_Zonweringreductie(R37,R8)","v":1},null,{"$f":"o_Zonweringreductie(T37,R8)","v":1}]
["Totaal opvallende zonnestraling van het raam Isol;wi;k;juli",{"$f":"IF(B10=\"Nee\",0,o_Isol_Bij_Tijdstip($B$52,B8,B11))","v":0},"W/m²",{"$f":"IF(B10=\"Nee\",0,o_Isol_Bij_Tijdstip($B$52,B8,B11))","v":0},"W/m²",{"$f":"IF(F10=\"Nee\",0,o_Isol_Bij_Tijdstip($B$52,F8,F11))","v":0},"W/m²",{"$f":"IF(F10=\"Nee\",0,o_Isol_Bij_Tijdstip($B$52,F8,F11))","v":0},"W/m²",{"$f":"IF(J10=\"Nee\",0,o_Isol_Bij_Tijdstip($B$52,J8,J11))","v":0},"W/m²",{"$f":"IF(J10=\"Nee\",0,o_Isol_Bij_Tijdstip($B$52,J8,J11))","v":0},"W/m²",{"$f":"IF(N10=\"Nee\",0,o_Isol_Bij_Tijdstip($B$52,N8,N11))","v":0},"W/m²",{"$f":"IF(N10=\"Nee\",0,o_Isol_Bij_Tijdstip($B$52,N8,N11))","v":0},"W/m²",{"$f":"IF(R10=\"Nee\",0,o_Isol_Bij_Tijdstip($B$52,R8,R11))","v":0},"W/m²",{"$f":"IF(R10=\"Nee\",0,o_Isol_Bij_Tijdstip($B$52,R8,R11))","v":0},"W/m²"]
[]
["Tijdstip maximale koellastbijdrage tmax;zi",{"$f":"VALUE(o_Tijdstip_Isol_Max_Orientatie(B8,B11))","v":{"$error":"#NAME?"}},null,null,null,{"$f":"VALUE(o_Tijdstip_Isol_Max_Orientatie(F8,F11))","v":{"$error":"#NAME?"}},null,null,null,{"$f":"VALUE(o_Tijdstip_Isol_Max_Orientatie(J8,J11))","v":{"$error":"#NAME?"}},null,null,null,{"$f":"VALUE(o_Tijdstip_Isol_Max_Orientatie(N8,N11))","v":{"$error":"#NAME?"}},null,null,null,{"$f":"o_Tijdstip_Isol_Max_Orientatie(R8,R11)","v":"12:00:00 PM"}]
["Buitenluchttemperatuur op tijdstip max koellast Θe",{"$f":"o_maxTemp(VALUE(B41))","v":{"$error":"#NAME?"}},null,null,"°C",{"$f":"o_maxTemp(VALUE(F41))","v":{"$error":"#NAME?"}},null,null,"°C",{"$f":"o_maxTemp(VALUE(J41))","v":{"$error":"#NAME?"}},null,null,"°C",{"$f":"o_maxTemp(VALUE(N41))","v":{"$error":"#NAME?"}},null,null,"°C",{"$f":"o_maxTemp(VALUE(R41))","v":29.5}]
[]
["Glasopppervlak",{"$f":"IF(B10=\"Ja\",B18+D18,0)","v":0},"m²",null,null,{"$f":"IF(F10=\"Ja\",F18+H18,0)","v":0},"m²",null,null,{"$f":"IF(J10=\"Ja\",J18+L18,0)","v":0},"m²",null,null,{"$f":"IF(N10=\"Ja\",N18+P18,0)","v":0},"m²",null,null,{"$f":"IF(R10=\"Ja\",R18+T18,0)","v":0},"m²"]
["Uitwendigescheidingsconstructie niet op Noord?",{"$f":"IF(B10=\"Ja\",IF(B8=\"Noord\",FALSE,TRUE),FALSE)","v":false},null,null,null,{"$f":"IF(F10=\"Ja\",IF(F8=\"Noord\",FALSE,TRUE),FALSE)","v":false},null,null,null,{"$f":"IF(J10=\"Ja\",IF(J8=\"Noord\",FALSE,TRUE),FALSE)","v":false},null,null,null,{"$f":"IF(N10=\"Ja\",IF(N8=\"Noord\",FALSE,TRUE),FALSE)","v":false},null,null,null,{"$f":"IF(R10=\"Ja\",IF(R8=\"Noord\",FALSE,TRUE),FALSE)","v":false}]
["De enige uitwendigescheidingscontructie?",{"$f":"IF(AND(B45=TRUE,COUNTIF($B$45:$R$45,TRUE)=1),TRUE,FALSE)","v":false},null,null,null,{"$f":"IF(AND(F45=TRUE,COUNTIF($B$45:$R$45,TRUE)=1),TRUE,FALSE)","v":false},null,null,null,{"$f":"IF(AND(J45=TRUE,COUNTIF($B$45:$R$45,TRUE)=1),TRUE,FALSE)","v":false},null,null,null,{"$f":"IF(AND(N45=TRUE,COUNTIF($B$45:$R$45,TRUE)=1),TRUE,FALSE)","v":false},null,null,null,{"$f":"IF(AND(R45=TRUE,COUNTIF($B$45:$R$45,TRUE)=1),TRUE,FALSE)","v":false}]
["Totaal glasoppervlak",{"$f":"IF(B8<>\"Noord\",B44,0)","v":0},"m²",null,null,{"$f":"IF(F8<>\"Noord\",F44,0)","v":{"$error":"#NAME?"}},"m²",null,null,{"$f":"IF(J8<>\"Noord\",J44,0)","v":{"$error":"#NAME?"}},"m²",null,null,{"$f":"IF(N8<>\"Noord\",N44,0)","v":{"$error":"#NAME?"}},"m²",null,null,{"$f":"R44","v":0},"m²"]
["Grootste glasoppervlak ",{"$f":"IF(AND(B45,B47=MAX($B$47:$R$47)),TRUE,FALSE)","v":{"$error":"#NAME?"}},null,null,null,{"$f":"IF(AND(F45,F47=MAX($B$47:$R$47)),TRUE,FALSE)","v":{"$error":"#NAME?"}},null,null,null,{"$f":"IF(AND(J45,J47=MAX($B$47:$R$47)),TRUE,FALSE)","v":{"$error":"#NAME?"}},null,null,null,{"$f":"IF(AND(N45,N47=MAX($B$47:$R$47)),TRUE,FALSE)","v":{"$error":"#NAME?"}},null,null,null,{"$f":"IF(AND(R45,R47=MAX($B$47:$R$47)),TRUE,FALSE)","v":{"$error":"#NAME?"}}]
["Dakvlak maatgevend?",{"$f":"IF(AND(B11<90,B15>3*(B18+D18),'Projectgegevens en Resultaten'!#REF!<65),TRUE,FALSE)","v":{"$error":"#REF!"}},null,null,null,{"$f":"IF(AND(F11<90,F15>3*(F18+H18),'Projectgegevens en Resultaten'!#REF!<65),TRUE,FALSE)","v":{"$error":"#REF!"}},null,null,null,{"$f":"IF(AND(J11<90,J15>3*(J18+L18),'Projectgegevens en Resultaten'!#REF!<65),TRUE,FALSE)","v":{"$error":"#REF!"}},null,null,null,{"$f":"IF(AND(N11<90,N15>3*(N18+P18),'Projectgegevens en Resultaten'!#REF!<65),TRUE,FALSE)","v":{"$error":"#REF!"}},null,null,null,{"$f":"IF(AND(R11<90,R15>3*(R18+T18),'Projectgegevens en Resultaten'!#REF!<65),TRUE,FALSE)","v":{"$error":"#REF!"}}]
["is er een maatgevend dakoppervlak",{"$f":"IF(COUNTIF($B$49:$R$49,TRUE)>0,TRUE,FALSE)","v":false},null,null,null,{"$f":"IF(COUNTIF($B$49:$R$49,TRUE)>0,TRUE,FALSE)","v":false},null,null,null,{"$f":"IF(COUNTIF($B$49:$R$49,TRUE)>0,TRUE,FALSE)","v":false},null,null,null,{"$f":"IF(COUNTIF($B$49:$R$49,TRUE)>0,TRUE,FALSE)","v":false},null,null,null,{"$f":"IF(COUNTIF($B$49:$R$49,TRUE)>0,TRUE,FALSE)","v":false}]
["Maatgevende tijdstip",{"$f":"IF(OR(B46,AND(B45,B50,B49),AND(B45,B48,NOT(B50))),B41)","v":{"$error":"#REF!"}},null,null,null,{"$f":"IF(OR(F46,AND(F45,F50,F49),AND(F45,F48,NOT(F50))),F41)","v":{"$error":"#REF!"}},null,null,null,{"$f":"IF(OR(J46,AND(J45,J50,J49),AND(J45,J48,NOT(J50))),J41)","v":{"$error":"#REF!"}},null,null,null,{"$f":"IF(OR(N46,AND(N45,N50,N49),AND(N45,N48,NOT(N50))),N41)","v":{"$error":"#REF!"}},null,null,null,{"$f":"IF(OR(R46,AND(R45,R50,R49),AND(R45,R48,NOT(R50))),R41)","v":{"$error":"#REF!"}}]
["Maatgevende tijdstip tmax;zi",{"$f":"IFERROR(B88,\"geen glas ingevoerd\")","v":"geen glas ingevoerd"}]
["Buitenluchttemperatuur op tijdstip max koellast Θe",{"$f":"o_maxTemp(VALUE(B52))","v":{"$error":"#NAME?"}},"°C"]
[]
["Koellastbijdrage transmissie ondoorzichtige delen Ptr;ntr;vr;zi",{"$f":"IF(B10=\"Nee\",0,B16*'Projectgegevens en Resultaten'!$B$16)","v":0},null,null,"W",{"$f":"IF(F10=\"Nee\",0,F16*'Projectgegevens en Resultaten'!$B$16)","v":0},null,null,"W",{"$f":"IF(J10=\"Nee\",0,J16*'Projectgegevens en Resultaten'!$B$16)","v":0},null,null,"W",{"$f":"IF(N10=\"Nee\",0,N16*'Projectgegevens en Resultaten'!$B$16)","v":0},null,null,"W",{"$f":"IF(R10=\"Nee\",0,R16*'Projectgegevens en Resultaten'!$B$16)","v":0},null,null,"W"]
["Koellastbijdrage zoninstraling transparante delen Psol;vr;zi",{"$f":"(0.75*B18*FLOOR(B20,0.05)*0.9*B35*B38*B39)+(0.75*D18*FLOOR(D20,0.05)*0.9*D35*D38*D39)","v":{"$error":"#NAME?"}},null,null,"W",{"$f":"(0.75*F18*FLOOR(F20,0.05)*0.9*F35*F38*F39)+(0.75*H18*FLOOR(H20,0.05)*0.9*H35*H38*H39)","v":{"$error":"#NAME?"}},null,null,"W",{"$f":"(0.75*J18*FLOOR(J20,0.05)*0.9*J35*J38*J39)+(0.75*L18*FLOOR(L20,0.05)*0.9*L35*L38*L39)","v":{"$error":"#NAME?"}},null,null,"W",{"$f":"(0.75*N18*FLOOR(N20,0.05)*0.9*N35*N38*N39)+(0.75*P18*FLOOR(P20,0.05)*0.9*P35*P38*P39)","v":{"$error":"#NAME?"}},null,null,"W",{"$f":"(0.75*R18*FLOOR(R20,0.05)*0.9*R35*R38*R39)+(0.75*T18*FLOOR(T20,0.05)*0.9*T35*T38*T39)","v":0},null,null,"W"]
["Koellastbijdrage transmissie transparante delen Ptr;gl;vr;zi",{"$f":"IF(B10=\"Nee\",0,IFERROR(B18*B19*($B$53-24),0)+IFERROR(D18*D19*($B$53-24),0))","v":0},null,null,"W",{"$f":"IF(F10=\"Nee\",0,IFERROR(F18*F19*($B$53-24),0)+IFERROR(H18*H19*($B$53-24),0))","v":0},null,null,"W",{"$f":"IF(J10=\"Nee\",0,IFERROR(J18*J19*($B$53-24),0)+IFERROR(L18*L19*($B$53-24),0))","v":0},null,null,"W",{"$f":"IF(N10=\"Nee\",0,IFERROR(N18*N19*($B$53-24),0)+IFERROR(P18*P19*($B$53-24),0))","v":0},null,null,"W",{"$f":"IF(R10=\"Nee\",0,IFERROR(R18*R19*($B$53-24),0)+IFERROR(T18*T19*($B$53-24),0))","v":0},null,null,"W"]
["Totaal koellastbijdrage per gevel",{"$f":"SUM(B55:D57)","v":{"$error":"#NAME?"}},null,null,"W",{"$f":"SUM(F55:H57)","v":{"$error":"#NAME?"}},null,null,"W",{"$f":"SUM(J55:L57)","v":{"$error":"#NAME?"}},null,null,"W",{"$f":"SUM(N55:P57)","v":{"$error":"#NAME?"}},null,null,"W",{"$f":"SUM(R55:R57)","v":0},null,null,"W"]
[]
["Koellast door interne warmtelast Pint;calc;woon/overig;zi",{"$f":"IF(B5=0,0,IF(B4=\"Woonvertrek\",2*'Projectgegevens en Resultaten'!$B$33*B5,'Projectgegevens en Resultaten'!$B$33*B5))","v":0},null,null,"W"]
["Koellast door buitenluchttoetreding Pv;calc;vr;zi",{"$f":"IFERROR(MAX((SUM('Projectgegevens en Resultaten'!$B$21:$B$23)/3600*1.205*1005*(B53-24))/SUM('Projectgegevens en Resultaten'!$B$40:$T$40)*B5,0),0)","v":0},{"$f":"IFERROR(MAX(SUM(C57:C59)/3600*1.205*1005*(C60-24),0),0)","v":0},{"$f":"IFERROR(MAX(SUM(D57:D59)/3600*1.205*1005*(D60-24),0),0)","v":0},"W"]
[]
["Totaal koellastbijdrage",{"$f":"IFERROR(SUM(B58:T58)+B60+B61,0)","v":0},null,null,"W"]
["Koelbehoefte verblijfsruimte",{"$f":"IFERROR(B63/B5,0)","v":0},null,null,"W/m²"]
[]
[]
[]
[]
[]
[]
["Onderstaande tabellen worden verborgen in de uiteindelijke versie. De tabellen dienen om vast te stellen welk tijdstip tot de hoogste zonbelasting leidt"]
[]
["Isol max voor de orientatie",{"$f":"o_Isol_Max_Orientatie(B8,B11)","v":{"$error":"#NAME?"}},"W/m²",null,null,{"$f":"o_Isol_Max_Orientatie(F8,F11)","v":{"$error":"#NAME?"}},"W/m²",null,null,{"$f":"o_Isol_Max_Orientatie(J8,J11)","v":{"$error":"#NAME?"}},"W/m²",null,null,{"$f":"o_Isol_Max_Orientatie(N8,N11)","v":{"$error":"#NAME?"}},"W/m²",null,null,{"$f":"o_Isol_Max_Orientatie(R8,R11)","v":914.11856204111336},"W/m²"]
["Tijdstip bij Isol max bij orientatie",{"$f":"VALUE(o_Tijdstip_Isol_Max_Orientatie(B8,B11))","v":{"$error":"#NAME?"}},null,null,null,{"$f":"VALUE(o_Tijdstip_Isol_Max_Orientatie(F8,F11))","v":{"$error":"#NAME?"}},null,null,null,{"$f":"VALUE(o_Tijdstip_Isol_Max_Orientatie(J8,J11))","v":{"$error":"#NAME?"}},null,null,null,{"$f":"VALUE(o_Tijdstip_Isol_Max_Orientatie(N8,N11))","v":{"$error":"#NAME?"}},null,null,null,{"$f":"VALUE(o_Tijdstip_Isol_Max_Orientatie(R8,R11))","v":"12:00:00"}]
[]
["Koellastbijdrage zoninstraling transparante delen Psol;vr;zi"]
["09:00:00",{"$f":"(0.75*B$18*FLOOR(B$20,0.05)*0.9*B$35*B$38*o_Isol_Bij_Tijdstip($A77,B$8,B$11))+(0.75*D$18*FLOOR(D$20,0.05)*0.9*D$35*D$38*o_Isol_Bij_Tijdstip($A77,B$8,B$11))","v":{"$error":"#NAME?"}},"W",null,null,{"$f":"(0.75*F$18*FLOOR(F$20,0.05)*0.9*F$35*F$38*o_Isol_Bij_Tijdstip($A77,F$8,F$11))+(0.75*H$18*FLOOR(H$20,0.05)*0.9*H$35*H$38*o_Isol_Bij_Tijdstip($A77,F$8,F$11))","v":{"$error":"#NAME?"}},"W",null,null,{"$f":"(0.75*J$18*FLOOR(J$20,0.05)*0.9*J$35*J$38*o_Isol_Bij_Tijdstip($A77,J$8,J$11))+(0.75*L$18*FLOOR(L$20,0.05)*0.9*L$35*L$38*o_Isol_Bij_Tijdstip($A77,J$8,J$11))","v":{"$error":"#NAME?"}},"W",null,null,{"$f":"(0.75*N$18*FLOOR(N$20,0.05)*0.9*N$35*N$38*o_Isol_Bij_Tijdstip($A77,N$8,N$11))+(0.75*P$18*FLOOR(P$20,0.05)*0.9*P$35*P$38*o_Isol_Bij_Tijdstip($A77,N$8,N$11))","v":{"$error":"#NAME?"}},"W",null,null,{"$f":"(0.75*R$18*FLOOR(R$20,0.05)*0.9*R$35*R$38*o_Isol_Bij_Tijdstip($A77,R$8,R$11))+(0.75*T$18*FLOOR(T$20,0.05)*0.9*T$35*T$38*o_Isol_Bij_Tijdstip($A77,R$8,R$11))","v":0},"W",{"$f":"B77+F77+J77+N77+R77","v":{"$error":"#NAME?"}},"W"]
["10:00:00",{"$f":"(0.75*B$18*FLOOR(B$20,0.05)*0.9*B$35*B$38*o_Isol_Bij_Tijdstip($A78,B$8,B$11))+(0.75*D$18*FLOOR(D$20,0.05)*0.9*D$35*D$38*o_Isol_Bij_Tijdstip($A78,B$8,B$11))","v":{"$error":"#NAME?"}},"W",null,null,{"$f":"(0.75*F$18*FLOOR(F$20,0.05)*0.9*F$35*F$38*o_Isol_Bij_Tijdstip($A78,F$8,F$11))+(0.75*H$18*FLOOR(H$20,0.05)*0.9*H$35*H$38*o_Isol_Bij_Tijdstip($A78,F$8,F$11))","v":{"$error":"#NAME?"}},"W",null,null,{"$f":"(0.75*J$18*FLOOR(J$20,0.05)*0.9*J$35*J$38*o_Isol_Bij_Tijdstip($A78,J$8,J$11))+(0.75*L$18*FLOOR(L$20,0.05)*0.9*L$35*L$38*o_Isol_Bij_Tijdstip($A78,J$8,J$11))","v":{"$error":"#NAME?"}},"W",null,null,{"$f":"(0.75*N$18*FLOOR(N$20,0.05)*0.9*N$35*N$38*o_Isol_Bij_Tijdstip($A78,N$8,N$11))+(0.75*P$18*FLOOR(P$20,0.05)*0.9*P$35*P$38*o_Isol_Bij_Tijdstip($A78,N$8,N$11))","v":{"$error":"#NAME?"}},"W",null,null,{"$f":"(0.75*R$18*FLOOR(R$20,0.05)*0.9*R$35*R$38*o_Isol_Bij_Tijdstip($A78,R$8,R$11))+(0.75*T$18*FLOOR(T$20,0.05)*0.9*T$35*T$38*o_Isol_Bij_Tijdstip($A78,R$8,R$11))","v":0},"W",{"$error":"#NAME?"},"W"]
["11:00:00",{"$f":"(0.75*B$18*FLOOR(B$20,0.05)*0.9*B$35*B$38*o_Isol_Bij_Tijdstip($A79,B$8,B$11))+(0.75*D$18*FLOOR(D$20,0.05)*0.9*D$35*D$38*o_Isol_Bij_Tijdstip($A79,B$8,B$11))","v":{"$error":"#NAME?"}},"W",null,null,{"$f":"(0.75*F$18*FLOOR(F$20,0.05)*0.9*F$35*F$38*o_Isol_Bij_Tijdstip($A79,F$8,F$11))+(0.75*H$18*FLOOR(H$20,0.05)*0.9*H$35*H$38*o_Isol_Bij_Tijdstip($A79,F$8,F$11))","v":{"$error":"#NAME?"}},"W",null,null,{"$f":"(0.75*J$18*FLOOR(J$20,0.05)*0.9*J$35*J$38*o_Isol_Bij_Tijdstip($A79,J$8,J$11))+(0.75*L$18*FLOOR(L$20,0.05)*0.9*L$35*L$38*o_Isol_Bij_Tijdstip($A79,J$8,J$11))","v":{"$error":"#NAME?"}},"W",null,null,{"$f":"(0.75*N$18*FLOOR(N$20,0.05)*0.9*N$35*N$38*o_Isol_Bij_Tijdstip($A79,N$8,N$11))+(0.75*P$18*FLOOR(P$20,0.05)*0.9*P$35*P$38*o_Isol_Bij_Tijdstip($A79,N$8,N$11))","v":{"$error":"#NAME?"}},"W",null,null,{"$f":"(0.75*R$18*FLOOR(R$20,0.05)*0.9*R$35*R$38*o_Isol_Bij_Tijdstip($A79,R$8,R$11))+(0.75*T$18*FLOOR(T$20,0.05)*0.9*T$35*T$38*o_Isol_Bij_Tijdstip($A79,R$8,R$11))","v":0},"W",{"$error":"#NAME?"},"W"]
["12:00:00",{"$f":"(0.75*B$18*FLOOR(B$20,0.05)*0.9*B$35*B$38*o_Isol_Bij_Tijdstip($A80,B$8,B$11))+(0.75*D$18*FLOOR(D$20,0.05)*0.9*D$35*D$38*o_Isol_Bij_Tijdstip($A80,B$8,B$11))","v":{"$error":"#NAME?"}},"W",null,null,{"$f":"(0.75*F$18*FLOOR(F$20,0.05)*0.9*F$35*F$38*o_Isol_Bij_Tijdstip($A80,F$8,F$11))+(0.75*H$18*FLOOR(H$20,0.05)*0.9*H$35*H$38*o_Isol_Bij_Tijdstip($A80,F$8,F$11))","v":{"$error":"#NAME?"}},"W",null,null,{"$f":"(0.75*J$18*FLOOR(J$20,0.05)*0.9*J$35*J$38*o_Isol_Bij_Tijdstip($A80,J$8,J$11))+(0.75*L$18*FLOOR(L$20,0.05)*0.9*L$35*L$38*o_Isol_Bij_Tijdstip($A80,J$8,J$11))","v":{"$error":"#NAME?"}},"W",null,null,{"$f":"(0.75*N$18*FLOOR(N$20,0.05)*0.9*N$35*N$38*o_Isol_Bij_Tijdstip($A80,N$8,N$11))+(0.75*P$18*FLOOR(P$20,0.05)*0.9*P$35*P$38*o_Isol_Bij_Tijdstip($A80,N$8,N$11))","v":{"$error":"#NAME?"}},"W",null,null,{"$f":"(0.75*R$18*FLOOR(R$20,0.05)*0.9*R$35*R$38*o_Isol_Bij_Tijdstip($A80,R$8,R$11))+(0.75*T$18*FLOOR(T$20,0.05)*0.9*T$35*T$38*o_Isol_Bij_Tijdstip($A80,R$8,R$11))","v":0},"W",{"$error":"#NAME?"},"W"]
["13:00:00",{"$f":"(0.75*B$18*FLOOR(B$20,0.05)*0.9*B$35*B$38*o_Isol_Bij_Tijdstip($A81,B$8,B$11))+(0.75*D$18*FLOOR(D$20,0.05)*0.9*D$35*D$38*o_Isol_Bij_Tijdstip($A81,B$8,B$11))","v":{"$error":"#NAME?"}},"W",null,null,{"$f":"(0.75*F$18*FLOOR(F$20,0.05)*0.9*F$35*F$38*o_Isol_Bij_Tijdstip($A81,F$8,F$11))+(0.75*H$18*FLOOR(H$20,0.05)*0.9*H$35*H$38*o_Isol_Bij_Tijdstip($A81,F$8,F$11))","v":{"$error":"#NAME?"}},"W",null,null,{"$f":"(0.75*J$18*FLOOR(J$20,0.05)*0.9*J$35*J$38*o_Isol_Bij_Tijdstip($A81,J$8,J$11))+(0.75*L$18*FLOOR(L$20,0.05)*0.9*L$35*L$38*o_Isol_Bij_Tijdstip($A81,J$8,J$11))","v":{"$error":"#NAME?"}},"W",null,null,{"$f":"(0.75*N$18*FLOOR(N$20,0.05)*0.9*N$35*N$38*o_Isol_Bij_Tijdstip($A81,N$8,N$11))+(0.75*P$18*FLOOR(P$20,0.05)*0.9*P$35*P$38*o_Isol_Bij_Tijdstip($A81,N$8,N$11))","v":{"$error":"#NAME?"}},"W",null,null,{"$f":"(0.75*R$18*FLOOR(R$20,0.05)*0.9*R$35*R$38*o_Isol_Bij_Tijdstip($A81,R$8,R$11))+(0.75*T$18*FLOOR(T$20,0.05)*0.9*T$35*T$38*o_Isol_Bij_Tijdstip($A81,R$8,R$11))","v":0},"W",{"$error":"#NAME?"},"W"]
["14:00:00",{"$f":"(0.75*B$18*FLOOR(B$20,0.05)*0.9*B$35*B$38*o_Isol_Bij_Tijdstip($A82,B$8,B$11))+(0.75*D$18*FLOOR(D$20,0.05)*0.9*D$35*D$38*o_Isol_Bij_Tijdstip($A82,B$8,B$11))","v":{"$error":"#NAME?"}},"W",null,null,{"$f":"(0.75*F$18*FLOOR(F$20,0.05)*0.9*F$35*F$38*o_Isol_Bij_Tijdstip($A82,F$8,F$11))+(0.75*H$18*FLOOR(H$20,0.05)*0.9*H$35*H$38*o_Isol_Bij_Tijdstip($A82,F$8,F$11))","v":{"$error":"#NAME?"}},"W",null,null,{"$f":"(0.75*J$18*FLOOR(J$20,0.05)*0.9*J$35*J$38*o_Isol_Bij_Tijdstip($A82,J$8,J$11))+(0.75*L$18*FLOOR(L$20,0.05)*0.9*L$35*L$38*o_Isol_Bij_Tijdstip($A82,J$8,J$11))","v":{"$error":"#NAME?"}},"W",null,null,{"$f":"(0.75*N$18*FLOOR(N$20,0.05)*0.9*N$35*N$38*o_Isol_Bij_Tijdstip($A82,N$8,N$11))+(0.75*P$18*FLOOR(P$20,0.05)*0.9*P$35*P$38*o_Isol_Bij_Tijdstip($A82,N$8,N$11))","v":{"$error":"#NAME?"}},"W",null,null,{"$f":"(0.75*R$18*FLOOR(R$20,0.05)*0.9*R$35*R$38*o_Isol_Bij_Tijdstip($A82,R$8,R$11))+(0.75*T$18*FLOOR(T$20,0.05)*0.9*T$35*T$38*o_Isol_Bij_Tijdstip($A82,R$8,R$11))","v":0},"W",{"$error":"#NAME?"},"W"]
["15:00:00",{"$f":"(0.75*B$18*FLOOR(B$20,0.05)*0.9*B$35*B$38*o_Isol_Bij_Tijdstip($A83,B$8,B$11))+(0.75*D$18*FLOOR(D$20,0.05)*0.9*D$35*D$38*o_Isol_Bij_Tijdstip($A83,B$8,B$11))","v":{"$error":"#NAME?"}},"W",null,null,{"$f":"(0.75*F$18*FLOOR(F$20,0.05)*0.9*F$35*F$38*o_Isol_Bij_Tijdstip($A83,F$8,F$11))+(0.75*H$18*FLOOR(H$20,0.05)*0.9*H$35*H$38*o_Isol_Bij_Tijdstip($A83,F$8,F$11))","v":{"$error":"#NAME?"}},"W",null,null,{"$f":"(0.75*J$18*FLOOR(J$20,0.05)*0.9*J$35*J$38*o_Isol_Bij_Tijdstip($A83,J$8,J$11))+(0.75*L$18*FLOOR(L$20,0.05)*0.9*L$35*L$38*o_Isol_Bij_Tijdstip($A83,J$8,J$11))","v":{"$error":"#NAME?"}},"W",null,null,{"$f":"(0.75*N$18*FLOOR(N$20,0.05)*0.9*N$35*N$38*o_Isol_Bij_Tijdstip($A83,N$8,N$11))+(0.75*P$18*FLOOR(P$20,0.05)*0.9*P$35*P$38*o_Isol_Bij_Tijdstip($A83,N$8,N$11))","v":{"$error":"#NAME?"}},"W",null,null,{"$f":"(0.75*R$18*FLOOR(R$20,0.05)*0.9*R$35*R$38*o_Isol_Bij_Tijdstip($A83,R$8,R$11))+(0.75*T$18*FLOOR(T$20,0.05)*0.9*T$35*T$38*o_Isol_Bij_Tijdstip($A83,R$8,R$11))","v":0},"W",{"$error":"#NAME?"},"W"]
["16:00:00",{"$f":"(0.75*B$18*FLOOR(B$20,0.05)*0.9*B$35*B$38*o_Isol_Bij_Tijdstip($A84,B$8,B$11))+(0.75*D$18*FLOOR(D$20,0.05)*0.9*D$35*D$38*o_Isol_Bij_Tijdstip($A84,B$8,B$11))","v":{"$error":"#NAME?"}},"W",null,null,{"$f":"(0.75*F$18*FLOOR(F$20,0.05)*0.9*F$35*F$38*o_Isol_Bij_Tijdstip($A84,F$8,F$11))+(0.75*H$18*FLOOR(H$20,0.05)*0.9*H$35*H$38*o_Isol_Bij_Tijdstip($A84,F$8,F$11))","v":{"$error":"#NAME?"}},"W",null,null,{"$f":"(0.75*J$18*FLOOR(J$20,0.05)*0.9*J$35*J$38*o_Isol_Bij_Tijdstip($A84,J$8,J$11))+(0.75*L$18*FLOOR(L$20,0.05)*0.9*L$35*L$38*o_Isol_Bij_Tijdstip($A84,J$8,J$11))","v":{"$error":"#NAME?"}},"W",null,null,{"$f":"(0.75*N$18*FLOOR(N$20,0.05)*0.9*N$35*N$38*o_Isol_Bij_Tijdstip($A84,N$8,N$11))+(0.75*P$18*FLOOR(P$20,0.05)*0.9*P$35*P$38*o_Isol_Bij_Tijdstip($A84,N$8,N$11))","v":{"$error":"#NAME?"}},"W",null,null,{"$f":"(0.75*R$18*FLOOR(R$20,0.05)*0.9*R$35*R$38*o_Isol_Bij_Tijdstip($A84,R$8,R$11))+(0.75*T$18*FLOOR(T$20,0.05)*0.9*T$35*T$38*o_Isol_Bij_Tijdstip($A84,R$8,R$11))","v":0},"W",{"$error":"#NAME?"},"W"]
["17:00:00",{"$f":"(0.75*B$18*FLOOR(B$20,0.05)*0.9*B$35*B$38*o_Isol_Bij_Tijdstip($A85,B$8,B$11))+(0.75*D$18*FLOOR(D$20,0.05)*0.9*D$35*D$38*o_Isol_Bij_Tijdstip($A85,B$8,B$11))","v":{"$error":"#NAME?"}},"W",null,null,{"$f":"(0.75*F$18*FLOOR(F$20,0.05)*0.9*F$35*F$38*o_Isol_Bij_Tijdstip($A85,F$8,F$11))+(0.75*H$18*FLOOR(H$20,0.05)*0.9*H$35*H$38*o_Isol_Bij_Tijdstip($A85,F$8,F$11))","v":{"$error":"#NAME?"}},"W",null,null,{"$f":"(0.75*J$18*FLOOR(J$20,0.05)*0.9*J$35*J$38*o_Isol_Bij_Tijdstip($A85,J$8,J$11))+(0.75*L$18*FLOOR(L$20,0.05)*0.9*L$35*L$38*o_Isol_Bij_Tijdstip($A85,J$8,J$11))","v":{"$error":"#NAME?"}},"W",null,null,{"$f":"(0.75*N$18*FLOOR(N$20,0.05)*0.9*N$35*N$38*o_Isol_Bij_Tijdstip($A85,N$8,N$11))+(0.75*P$18*FLOOR(P$20,0.05)*0.9*P$35*P$38*o_Isol_Bij_Tijdstip($A85,N$8,N$11))","v":{"$error":"#NAME?"}},"W",null,null,{"$f":"(0.75*R$18*FLOOR(R$20,0.05)*0.9*R$35*R$38*o_Isol_Bij_Tijdstip($A85,R$8,R$11))+(0.75*T$18*FLOOR(T$20,0.05)*0.9*T$35*T$38*o_Isol_Bij_Tijdstip($A85,R$8,R$11))","v":0},"W",{"$error":"#NAME?"},"W"]
["18:00:00",{"$f":"(0.75*B$18*FLOOR(B$20,0.05)*0.9*B$35*B$38*o_Isol_Bij_Tijdstip($A86,B$8,B$11))+(0.75*D$18*FLOOR(D$20,0.05)*0.9*D$35*D$38*o_Isol_Bij_Tijdstip($A86,B$8,B$11))","v":{"$error":"#NAME?"}},"W",null,null,{"$f":"(0.75*F$18*FLOOR(F$20,0.05)*0.9*F$35*F$38*o_Isol_Bij_Tijdstip($A86,F$8,F$11))+(0.75*H$18*FLOOR(H$20,0.05)*0.9*H$35*H$38*o_Isol_Bij_Tijdstip($A86,F$8,F$11))","v":{"$error":"#NAME?"}},"W",null,null,{"$f":"(0.75*J$18*FLOOR(J$20,0.05)*0.9*J$35*J$38*o_Isol_Bij_Tijdstip($A86,J$8,J$11))+(0.75*L$18*FLOOR(L$20,0.05)*0.9*L$35*L$38*o_Isol_Bij_Tijdstip($A86,J$8,J$11))","v":{"$error":"#NAME?"}},"W",null,null,{"$f":"(0.75*N$18*FLOOR(N$20,0.05)*0.9*N$35*N$38*o_Isol_Bij_Tijdstip($A86,N$8,N$11))+(0.75*P$18*FLOOR(P$20,0.05)*0.9*P$35*P$38*o_Isol_Bij_Tijdstip($A86,N$8,N$11))","v":{"$error":"#NAME?"}},"W",null,null,{"$f":"(0.75*R$18*FLOOR(R$20,0.05)*0.9*R$35*R$38*o_Isol_Bij_Tijdstip($A86,R$8,R$11))+(0.75*T$18*FLOOR(T$20,0.05)*0.9*T$35*T$38*o_Isol_Bij_Tijdstip($A86,R$8,R$11))","v":0},"W",{"$error":"#NAME?"},"W"]
[]
["Maatgevende tijdstip",{"$f":"IF(MAX(T77:T86)=0,\"Geen glas aanwezig\",_xlfn.XLOOKUP(MAX(T77:T86),T77:T86,A77:A86,\"nvt\"))","v":{"$error":"#NAME?"}}]

{"sheet":"Ruimte 4","index":6,"n_rows":88,"n_cols":21,"rows_kept":88,"cut":false,"hidden":false,"merged":[[70,0,71,20],[0,0,0,20],[6,1,6,3],[6,5,6,7],[6,9,6,11],[6,13,6,15],[6,17,6,20],[41,1,41,3],[41,5,41,7],[41,9,41,11],[41,13,41,15],[41,17,41,19],[40,1,40,3],[40,5,40,7],[40,9,40,11],[40,13,40,15],[40,17,40,19],[55,1,55,3],[55,5,55,7],[55,9,55,11],[55,13,55,15],[55,17,55,19],[54,1,54,3],[54,5,54,7],[54,9,54,11],[54,13,54,15],[54,17,54,19],[56,5,56,7],[56,9,56,11],[56,13,56,15],[56,17,56,19],[57,1,57,3],[57,5,57,7],[57,9,57,11],[57,13,57,15],[57,17,57,19],[59,1,59,3],[60,1,60,3],[62,1,62,3],[63,1,63,3],[56,1,56,3]]}
["RUIMTE 4"]
[]
["Ruimtenaam",4]
["Type verblijfsruimte","Andere verblijfsruimte"]
["Vloeroppervlak verblijfsruimte Avr  (gebruiksoppervlak)",0,"m²"]
[]
[null,"Voorzijde woning",null,null,null,"Linker zijde woning",null,null,null,"Achterzijde woning",null,null,null,"Rechter zijde woning",null,null,null,"Platdak"]
["Orientatie gevel / dakvlak (Helling > 15°C)",{"$f":"'Projectgegevens en Resultaten'!$B$17","v":0},null,null,null,{"$f":"o_Orientatie(F9)","v":{"$error":"#NAME?"}},null,null,null,{"$f":"o_Orientatie(J9)","v":{"$error":"#NAME?"}},null,null,null,{"$f":"o_Orientatie(N9)","v":{"$error":"#NAME?"}},null,null,null,"Horizontaal"]
["Orientatiehoek gevel Ƴ",{"$f":"o_OrientatiehOEK(B8)","v":{"$error":"#NAME?"}},null,null,null,{"$f":"IF(B9+90>360,B9+90-360,B9+90)","v":{"$error":"#NAME?"}},null,null,null,{"$f":"IF(F9+90>360,F9+90-360,F9+90)","v":{"$error":"#NAME?"}},null,null,null,{"$f":"IF(J9+90>360,J9+90-360,J9+90)","v":{"$error":"#NAME?"}}]
["Grenst aan buitenlucht ja of nee","Nee",null,null,null,"Nee",null,null,null,"Nee",null,null,null,"Nee",null,null,null,"Nee"]
["Hellingshoek constructie ≥ 15° = hellenddak 90° = gevel",90,"°",null,null,90,"°",null,null,90,"°",null,null,90,"°",null,null,0,"°"]
["Type constructie",{"$f":"o_TypeConstructie(B10,B11)","v":"Woningscheidend"},null,null,null,{"$f":"o_TypeConstructie(F10,F11)","v":"Woningscheidend"},null,null,null,{"$f":"o_TypeConstructie(J10,J11)","v":"Woningscheidend"},null,null,null,{"$f":"o_TypeConstructie(N10,N11)","v":"Woningscheidend"},null,null,null,{"$f":"o_TypeConstructie(R10,R11)","v":"Woningscheidend"}]
["Gevel lengte (binnenwerks)",null,"m",null,null,null,"m",null,null,null,"m",null,null,null,"m",null,null,null,"m"]
["Gevel hoogte / Dak breedte (binnenwerks)",null,"m",null,null,null,"m",null,null,null,"m",null,null,null,"m",null,null,null,"m"]
["Constructie oppervlak (binnenwerks)",{"$f":"B13*B14","v":0},"m²",null,null,{"$f":"F13*F14","v":0},"m²",null,null,{"$f":"J13*J14","v":0},"m²",null,null,{"$f":"N13*N14","v":0},"m²",null,null,{"$f":"R13*R14","v":0},"m²"]
["Gesloten constructie oppervlak",{"$f":"MAX(0,B15-B18-D18)","v":0},"m²",null,null,{"$f":"MAX(0,F15-F18-H18)","v":0},"m²",null,null,{"$f":"MAX(0,J15-J18-L18)","v":0},"m²",null,null,{"$f":"MAX(0,N15-N18-P18)","v":0},"m²",null,null,{"$f":"MAX(0,R15-R18-T18)","v":0},"m²"]
[null,"Glasvlak type 1",null,"Glasvlak type 2",null,"Glasvlak type 1",null,"Glasvlak type 2",null,"Glasvlak type 1",null,"Glasvlak type 2",null,"Glasvlak type 1",null,"Glasvlak type 2",null,"Glasvlak type 1",null,"Glasvlak type 2"]
["Totaal oppervlak van raamtype Aw,k (inclusief kozijn)",null,"m²",null,"m²",null,"m²",null,"m²",null,"m²",null,"m²",null,"m²",null,"m²",null,"m²",null,"m²"]
["Warmtedoorgangscoefficient (U-waarde) van het raam Uw;wi;k",null,"W/m².K",null,"W/m².K",null,"W/m².K",null,"W/m².K",null,"W/m².K",null,"W/m².K",null,"W/m².K",null,"W/m².K",null,"W/m².K",null,"W/m².K"]
["Zontoetredingsfactor (g_waarde) van het glas Ggl;n;wi;k;C;juli",1,null,1,null,1,null,1,null,1,null,1,null,1,null,1,null,1,null,1]
["Beschaduwing situatie bij het raamtype","Minimale belemmering",null,"Minimale belemmering",null,"Minimale belemmering",null,"Minimale belemmering",null,"Minimale belemmering",null,"Minimale belemmering",null,"Minimale belemmering",null,"Minimale belemmering",null,"Minimale belemmering",null,"Minimale belemmering"]
[]
[null,"Overstek",null,"Overstek",null,"Overstek",null,"Overstek",null,"Overstek",null,"Overstek",null,"Overstek",null,"Overstek"]
["Hoogte verschil midden raam onderzijde overstek",0,"m",0,"m",0,"m",0,"m",0,"m",0,"m",0,"m",0,"m",0,null,0,"m"]
["Horizontale afstand glas tot eindpunt overstek",0,"m",0,"m",0,"m",0,"m",0,"m",0,"m",0,"m",0,"m",0,null,0,"m"]
["Overstekhoek",{"$f":"IFERROR(180/PI()*ATAN(B24/B25),0)","v":0},"°",{"$f":"IFERROR(180/PI()*ATAN(D24/D25),0)","v":0},"°",{"$f":"IFERROR(180/PI()*ATAN(F24/F25),0)","v":0},"°",{"$f":"IFERROR(180/PI()*ATAN(H24/H25),0)","v":0},"°",{"$f":"IFERROR(180/PI()*ATAN(J24/J25),0)","v":0},"°",{"$f":"IFERROR(180/PI()*ATAN(L24/L25),0)","v":0},"°",{"$f":"IFERROR(180/PI()*ATAN(N24/N25),0)","v":0},"°",{"$f":"IFERROR(180/PI()*ATAN(P24/P25),0)","v":0},"°",null,null,null,"°"]
["Relatieve hoogte van overstek",{"$f":"IFERROR(B24/B25,1)","v":1},null,{"$f":"IFERROR(D24/D25,1)","v":1},null,{"$f":"IFERROR(F24/F25,1)","v":1},null,{"$f":"IFERROR(H24/H25,1)","v":1},null,{"$f":"IFERROR(J24/J25,1)","v":1},null,{"$f":"IFERROR(L24/L25,1)","v":1},null,{"$f":"IFERROR(N24/N25,1)","v":1},null,{"$f":"IFERROR(P24/P25,1)","v":1}]
[]
[null,"Zijbelemmering",null,"Zijbelemmering",null,"Zijbelemmering",null,"Zijbelemmering",null,"Zijbelemmering",null,"Zijbelemmering",null,"Zijbelemmering",null,"Zijbelemmering"]
["Positie zijbelemmering irt zichtveld (naar buitengericht)","Links",null,"Links",null,"Links",null,"Links",null,"Links",null,"Links",null,"Links",null,"Links",null,"Links",null,"Links"]
["Horizontale afstand midden raam verste punt belemmering",0,"m",0,"m",0,"m",0,"m",0,"m",0,"m",0,"m",0,"m",0,null,0,"m"]
["Horizontale breedte glas tot eindpunt belemmering",0,"m",0,"m",0,"m",0,"m",0,"m",0,"m",0,"m",0,"m",0,null,0,"m"]
["Relatieve breedte van de zijbelemmering bb",{"$f":"IFERROR(B31/B32,999)","v":999},null,{"$f":"IFERROR(D31/D32,999)","v":999},null,{"$f":"IFERROR(F31/F32,999)","v":999},null,{"$f":"IFERROR(H31/H32,999)","v":999},null,{"$f":"IFERROR(J31/J32,999)","v":999},null,{"$f":"IFERROR(L31/L32,999)","v":999},null,{"$f":"IFERROR(N31/N32,999)","v":999},null,{"$f":"IFERROR(P31/P32,999)","v":999}]
[]
["De beschaduwingsreductiefactor Fsh;obst;wi;k;juli",{"$f":"IFERROR(o_Beschaduwingreductie(B21,B8,B27,B30,B33,B11),1)","v":1},null,{"$f":"IFERROR(o_Beschaduwingreductie(D21,B8,D27,D30,D33,B11),1)","v":1},null,{"$f":"IFERROR(o_Beschaduwingreductie(F21,F8,F27,F30,F33,F11),1)","v":1},null,{"$f":"IFERROR(o_Beschaduwingreductie(H21,F8,H27,H30,H33,F11),1)","v":1},null,{"$f":"IFERROR(o_Beschaduwingreductie(J21,J8,J27,J30,J33,J11),1)","v":1},null,{"$f":"IFERROR(o_Beschaduwingreductie(L21,J8,L27,L30,L33,J11),1)","v":1},null,{"$f":"IFERROR(o_Beschaduwingreductie(N21,N8,N27,N30,N33,N11),1)","v":1},null,{"$f":"IFERROR(o_Beschaduwingreductie(P21,N8,P27,P30,P33,N11),1)","v":1},null,{"$f":"o_Beschaduwingreductie(R21,R8,R27,R30,R33,R11)","v":1},null,{"$f":"o_Beschaduwingreductie(T21,R8,T27,T30,T33,R11)","v":1}]
[]
["Type zonwering","Geen zonwering",null,"Geen zonwering",null,"Geen zonwering",null,"Geen zonwering",null,"Geen zonwering",null,"Geen zonwering",null,"Geen zonwering",null,"Geen zonwering",null,"Geen zonwering",null,"Geen zonwering"]
["De reductiefactor voor zonwering Fc;wi;k",{"$f":"o_Zonweringreductie(B37,B8)","v":{"$error":"#NAME?"}},null,{"$f":"o_Zonweringreductie(D37,B8)","v":{"$error":"#NAME?"}},null,{"$f":"o_Zonweringreductie(F37,F8)","v":{"$error":"#NAME?"}},null,{"$f":"o_Zonweringreductie(H37,F8)","v":{"$error":"#NAME?"}},null,{"$f":"o_Zonweringreductie(J37,J8)","v":{"$error":"#NAME?"}},null,{"$f":"o_Zonweringreductie(L37,J8)","v":{"$error":"#NAME?"}},null,{"$f":"o_Zonweringreductie(N37,N8)","v":{"$error":"#NAME?"}},null,{"$f":"o_Zonweringreductie(P37,N8)","v":{"$error":"#NAME?"}},null,{"$f":"o_Zonweringreductie(R37,R8)","v":1},null,{"$f":"o_Zonweringreductie(T37,R8)","v":1}]
["Totaal opvallende zonnestraling van het raam Isol;wi;k;juli",{"$f":"IF(B10=\"Nee\",0,o_Isol_Bij_Tijdstip($B$52,B8,B11))","v":0},"W/m²",{"$f":"IF(B10=\"Nee\",0,o_Isol_Bij_Tijdstip($B$52,B8,B11))","v":0},"W/m²",{"$f":"IF(F10=\"Nee\",0,o_Isol_Bij_Tijdstip($B$52,F8,F11))","v":0},"W/m²",{"$f":"IF(F10=\"Nee\",0,o_Isol_Bij_Tijdstip($B$52,F8,F11))","v":0},"W/m²",{"$f":"IF(J10=\"Nee\",0,o_Isol_Bij_Tijdstip($B$52,J8,J11))","v":0},"W/m²",{"$f":"IF(J10=\"Nee\",0,o_Isol_Bij_Tijdstip($B$52,J8,J11))","v":0},"W/m²",{"$f":"IF(N10=\"Nee\",0,o_Isol_Bij_Tijdstip($B$52,N8,N11))","v":0},"W/m²",{"$f":"IF(N10=\"Nee\",0,o_Isol_Bij_Tijdstip($B$52,N8,N11))","v":0},"W/m²",{"$f":"IF(R10=\"Nee\",0,o_Isol_Bij_Tijdstip($B$52,R8,R11))","v":0},"W/m²",{"$f":"IF(R10=\"Nee\",0,o_Isol_Bij_Tijdstip($B$52,R8,R11))","v":0},"W/m²"]
[]
["Tijdstip maximale koellastbijdrage tmax;zi",{"$f":"VALUE(o_Tijdstip_Isol_Max_Orientatie(B8,B11))","v":{"$error":"#NAME?"}},null,null,null,{"$f":"VALUE(o_Tijdstip_Isol_Max_Orientatie(F8,F11))","v":{"$error":"#NAME?"}},null,null,null,{"$f":"VALUE(o_Tijdstip_Isol_Max_Orientatie(J8,J11))","v":{"$error":"#NAME?"}},null,null,null,{"$f":"VALUE(o_Tijdstip_Isol_Max_Orientatie(N8,N11))","v":{"$error":"#NAME?"}},null,null,null,{"$f":"o_Tijdstip_Isol_Max_Orientatie(R8,R11)","v":"12:00:00 PM"}]
["Buitenluchttemperatuur op tijdstip max koellast Θe",{"$f":"o_maxTemp(VALUE(B41))","v":{"$error":"#NAME?"}},null,null,"°C",{"$f":"o_maxTemp(VALUE(F41))","v":{"$error":"#NAME?"}},null,null,"°C",{"$f":"o_maxTemp(VALUE(J41))","v":{"$error":"#NAME?"}},null,null,"°C",{"$f":"o_maxTemp(VALUE(N41))","v":{"$error":"#NAME?"}},null,null,"°C",{"$f":"o_maxTemp(VALUE(R41))","v":29.5}]
[]
["Glasopppervlak",{"$f":"IF(B10=\"Ja\",B18+D18,0)","v":0},"m²",null,null,{"$f":"IF(F10=\"Ja\",F18+H18,0)","v":0},"m²",null,null,{"$f":"IF(J10=\"Ja\",J18+L18,0)","v":0},"m²",null,null,{"$f":"IF(N10=\"Ja\",N18+P18,0)","v":0},"m²",null,null,{"$f":"IF(R10=\"Ja\",R18+T18,0)","v":0},"m²"]
["Uitwendigescheidingsconstructie niet op Noord?",{"$f":"IF(B10=\"Ja\",IF(B8=\"Noord\",FALSE,TRUE),FALSE)","v":false},null,null,null,{"$f":"IF(F10=\"Ja\",IF(F8=\"Noord\",FALSE,TRUE),FALSE)","v":false},null,null,null,{"$f":"IF(J10=\"Ja\",IF(J8=\"Noord\",FALSE,TRUE),FALSE)","v":false},null,null,null,{"$f":"IF(N10=\"Ja\",IF(N8=\"Noord\",FALSE,TRUE),FALSE)","v":false},null,null,null,{"$f":"IF(R10=\"Ja\",IF(R8=\"Noord\",FALSE,TRUE),FALSE)","v":false}]
["De enige uitwendigescheidingscontructie?",{"$f":"IF(AND(B45=TRUE,COUNTIF($B$45:$R$45,TRUE)=1),TRUE,FALSE)","v":false},null,null,null,{"$f":"IF(AND(F45=TRUE,COUNTIF($B$45:$R$45,TRUE)=1),TRUE,FALSE)","v":false},null,null,null,{"$f":"IF(AND(J45=TRUE,COUNTIF($B$45:$R$45,TRUE)=1),TRUE,FALSE)","v":false},null,null,null,{"$f":"IF(AND(N45=TRUE,COUNTIF($B$45:$R$45,TRUE)=1),TRUE,FALSE)","v":false},null,null,null,{"$f":"IF(AND(R45=TRUE,COUNTIF($B$45:$R$45,TRUE)=1),TRUE,FALSE)","v":false}]
["Totaal glasoppervlak",{"$f":"IF(B8<>\"Noord\",B44,0)","v":0},"m²",null,null,{"$f":"IF(F8<>\"Noord\",F44,0)","v":{"$error":"#NAME?"}},"m²",null,null,{"$f":"IF(J8<>\"Noord\",J44,0)","v":{"$error":"#NAME?"}},"m²",null,null,{"$f":"IF(N8<>\"Noord\",N44,0)","v":{"$error":"#NAME?"}},"m²",null,null,{"$f":"R44","v":0},"m²"]
["Grootste glasoppervlak ",{"$f":"IF(AND(B45,B47=MAX($B$47:$R$47)),TRUE,FALSE)","v":{"$error":"#NAME?"}},null,null,null,{"$f":"IF(AND(F45,F47=MAX($B$47:$R$47)),TRUE,FALSE)","v":{"$error":"#NAME?"}},null,null,null,{"$f":"IF(AND(J45,J47=MAX($B$47:$R$47)),TRUE,FALSE)","v":{"$error":"#NAME?"}},null,null,null,{"$f":"IF(AND(N45,N47=MAX($B$47:$R$47)),TRUE,FALSE)","v":{"$error":"#NAME?"}},null,null,null,{"$f":"IF(AND(R45,R47=MAX($B$47:$R$47)),TRUE,FALSE)","v":{"$error":"#NAME?"}}]
["Dakvlak maatgevend?",{"$f":"IF(AND(B11<90,B15>3*(B18+D18),'Projectgegevens en Resultaten'!#REF!<65),TRUE,FALSE)","v":{"$error":"#REF!"}},null,null,null,{"$f":"IF(AND(F11<90,F15>3*(F18+H18),'Projectgegevens en Resultaten'!#REF!<65),TRUE,FALSE)","v":{"$error":"#REF!"}},null,null,null,{"$f":"IF(AND(J11<90,J15>3*(J18+L18),'Projectgegevens en Resultaten'!#REF!<65),TRUE,FALSE)","v":{"$error":"#REF!"}},null,null,null,{"$f":"IF(AND(N11<90,N15>3*(N18+P18),'Projectgegevens en Resultaten'!#REF!<65),TRUE,FALSE)","v":{"$error":"#REF!"}},null,null,null,{"$f":"IF(AND(R11<90,R15>3*(R18+T18),'Projectgegevens en Resultaten'!#REF!<65),TRUE,FALSE)","v":{"$error":"#REF!"}}]
["is er een maatgevend dakoppervlak",{"$f":"IF(COUNTIF($B$49:$R$49,TRUE)>0,TRUE,FALSE)","v":false},null,null,null,{"$f":"IF(COUNTIF($B$49:$R$49,TRUE)>0,TRUE,FALSE)","v":false},null,null,null,{"$f":"IF(COUNTIF($B$49:$R$49,TRUE)>0,TRUE,FALSE)","v":false},null,null,null,{"$f":"IF(COUNTIF($B$49:$R$49,TRUE)>0,TRUE,FALSE)","v":false},null,null,null,{"$f":"IF(COUNTIF($B$49:$R$49,TRUE)>0,TRUE,FALSE)","v":false}]
["Maatgevende tijdstip",{"$f":"IF(OR(B46,AND(B45,B50,B49),AND(B45,B48,NOT(B50))),B41)","v":{"$error":"#REF!"}},null,null,null,{"$f":"IF(OR(F46,AND(F45,F50,F49),AND(F45,F48,NOT(F50))),F41)","v":{"$error":"#REF!"}},null,null,null,{"$f":"IF(OR(J46,AND(J45,J50,J49),AND(J45,J48,NOT(J50))),J41)","v":{"$error":"#REF!"}},null,null,null,{"$f":"IF(OR(N46,AND(N45,N50,N49),AND(N45,N48,NOT(N50))),N41)","v":{"$error":"#REF!"}},null,null,null,{"$f":"IF(OR(R46,AND(R45,R50,R49),AND(R45,R48,NOT(R50))),R41)","v":{"$error":"#REF!"}}]
["Maatgevende tijdstip tmax;zi",{"$f":"IFERROR(B88,\"geen glas ingevoerd\")","v":"geen glas ingevoerd"}]
["Buitenluchttemperatuur op tijdstip max koellast Θe",{"$f":"o_maxTemp(VALUE(B52))","v":{"$error":"#NAME?"}},"°C"]
[]
["Koellastbijdrage transmissie ondoorzichtige delen Ptr;ntr;vr;zi",{"$f":"IF(B10=\"Nee\",0,B16*'Projectgegevens en Resultaten'!$B$16)","v":0},null,null,"W",{"$f":"IF(F10=\"Nee\",0,F16*'Projectgegevens en Resultaten'!$B$16)","v":0},null,null,"W",{"$f":"IF(J10=\"Nee\",0,J16*'Projectgegevens en Resultaten'!$B$16)","v":0},null,null,"W",{"$f":"IF(N10=\"Nee\",0,N16*'Projectgegevens en Resultaten'!$B$16)","v":0},null,null,"W",{"$f":"IF(R10=\"Nee\",0,R16*'Projectgegevens en Resultaten'!$B$16)","v":0},null,null,"W"]
["Koellastbijdrage zoninstraling transparante delen Psol;vr;zi",{"$f":"(0.75*B18*FLOOR(B20,0.05)*0.9*B35*B38*B39)+(0.75*D18*FLOOR(D20,0.05)*0.9*D35*D38*D39)","v":{"$error":"#NAME?"}},null,null,"W",{"$f":"(0.75*F18*FLOOR(F20,0.05)*0.9*F35*F38*F39)+(0.75*H18*FLOOR(H20,0.05)*0.9*H35*H38*H39)","v":{"$error":"#NAME?"}},null,null,"W",{"$f":"(0.75*J18*FLOOR(J20,0.05)*0.9*J35*J38*J39)+(0.75*L18*FLOOR(L20,0.05)*0.9*L35*L38*L39)","v":{"$error":"#NAME?"}},null,null,"W",{"$f":"(0.75*N18*FLOOR(N20,0.05)*0.9*N35*N38*N39)+(0.75*P18*FLOOR(P20,0.05)*0.9*P35*P38*P39)","v":{"$error":"#NAME?"}},null,null,"W",{"$f":"(0.75*R18*FLOOR(R20,0.05)*0.9*R35*R38*R39)+(0.75*T18*FLOOR(T20,0.05)*0.9*T35*T38*T39)","v":0},null,null,"W"]
["Koellastbijdrage transmissie transparante delen Ptr;gl;vr;zi",{"$f":"IF(B10=\"Nee\",0,IFERROR(B18*B19*($B$53-24),0)+IFERROR(D18*D19*($B$53-24),0))","v":0},null,null,"W",{"$f":"IF(F10=\"Nee\",0,IFERROR(F18*F19*($B$53-24),0)+IFERROR(H18*H19*($B$53-24),0))","v":0},null,null,"W",{"$f":"IF(J10=\"Nee\",0,IFERROR(J18*J19*($B$53-24),0)+IFERROR(L18*L19*($B$53-24),0))","v":0},null,null,"W",{"$f":"IF(N10=\"Nee\",0,IFERROR(N18*N19*($B$53-24),0)+IFERROR(P18*P19*($B$53-24),0))","v":0},null,null,"W",{"$f":"IF(R10=\"Nee\",0,IFERROR(R18*R19*($B$53-24),0)+IFERROR(T18*T19*($B$53-24),0))","v":0},null,null,"W"]
["Totaal koellastbijdrage per gevel",{"$f":"SUM(B55:D57)","v":{"$error":"#NAME?"}},null,null,"W",{"$f":"SUM(F55:H57)","v":{"$error":"#NAME?"}},null,null,"W",{"$f":"SUM(J55:L57)","v":{"$error":"#NAME?"}},null,null,"W",{"$f":"SUM(N55:P57)","v":{"$error":"#NAME?"}},null,null,"W",{"$f":"SUM(R55:R57)","v":0},null,null,"W"]
[]
["Koellast door interne warmtelast Pint;calc;woon/overig;zi",{"$f":"IF(B5=0,0,IF(B4=\"Woonvertrek\",2*'Projectgegevens en Resultaten'!$B$33*B5,'Projectgegevens en Resultaten'!$B$33*B5))","v":0},null,null,"W"]
["Koellast door buitenluchttoetreding Pv;calc;vr;zi",{"$f":"IFERROR(MAX((SUM('Projectgegevens en Resultaten'!$B$21:$B$23)/3600*1.205*1005*(B53-24))/SUM('Projectgegevens en Resultaten'!$B$40:$T$40)*B5,0),0)","v":0},{"$f":"IFERROR(MAX(SUM(C57:C59)/3600*1.205*1005*(C60-24),0),0)","v":0},{"$f":"IFERROR(MAX(SUM(D57:D59)/3600*1.205*1005*(D60-24),0),0)","v":0},"W"]
[]
["Totaal koellastbijdrage",{"$f":"IFERROR(SUM(B58:T58)+B60+B61,0)","v":0},null,null,"W"]
["Koelbehoefte verblijfsruimte",{"$f":"IFERROR(B63/B5,0)","v":0},null,null,"W/m²"]
[]
[]
[]
[]
[]
[]
["Onderstaande tabellen worden verborgen in de uiteindelijke versie. De tabellen dienen om vast te stellen welk tijdstip tot de hoogste zonbelasting leidt"]
[]
["Isol max voor de orientatie",{"$f":"o_Isol_Max_Orientatie(B8,B11)","v":{"$error":"#NAME?"}},"W/m²",null,null,{"$f":"o_Isol_Max_Orientatie(F8,F11)","v":{"$error":"#NAME?"}},"W/m²",null,null,{"$f":"o_Isol_Max_Orientatie(J8,J11)","v":{"$error":"#NAME?"}},"W/m²",null,null,{"$f":"o_Isol_Max_Orientatie(N8,N11)","v":{"$error":"#NAME?"}},"W/m²",null,null,{"$f":"o_Isol_Max_Orientatie(R8,R11)","v":914.11856204111336},"W/m²"]
["Tijdstip bij Isol max bij orientatie",{"$f":"VALUE(o_Tijdstip_Isol_Max_Orientatie(B8,B11))","v":{"$error":"#NAME?"}},null,null,null,{"$f":"VALUE(o_Tijdstip_Isol_Max_Orientatie(F8,F11))","v":{"$error":"#NAME?"}},null,null,null,{"$f":"VALUE(o_Tijdstip_Isol_Max_Orientatie(J8,J11))","v":{"$error":"#NAME?"}},null,null,null,{"$f":"VALUE(o_Tijdstip_Isol_Max_Orientatie(N8,N11))","v":{"$error":"#NAME?"}},null,null,null,{"$f":"VALUE(o_Tijdstip_Isol_Max_Orientatie(R8,R11))","v":"12:00:00"}]
[]
["Koellastbijdrage zoninstraling transparante delen Psol;vr;zi"]
["09:00:00",{"$f":"(0.75*B$18*FLOOR(B$20,0.05)*0.9*B$35*B$38*o_Isol_Bij_Tijdstip($A77,B$8,B$11))+(0.75*D$18*FLOOR(D$20,0.05)*0.9*D$35*D$38*o_Isol_Bij_Tijdstip($A77,B$8,B$11))","v":{"$error":"#NAME?"}},"W",{"$f":"o_maxTemp(VALUE(A77))","v":24.7},null,{"$f":"(0.75*F$18*FLOOR(F$20,0.05)*0.9*F$35*F$38*o_Isol_Bij_Tijdstip($A77,F$8,F$11))+(0.75*H$18*FLOOR(H$20,0.05)*0.9*H$35*H$38*o_Isol_Bij_Tijdstip($A77,F$8,F$11))","v":{"$error":"#NAME?"}},"W",null,null,{"$f":"(0.75*J$18*FLOOR(J$20,0.05)*0.9*J$35*J$38*o_Isol_Bij_Tijdstip($A77,J$8,J$11))+(0.75*L$18*FLOOR(L$20,0.05)*0.9*L$35*L$38*o_Isol_Bij_Tijdstip($A77,J$8,J$11))","v":{"$error":"#NAME?"}},"W",null,null,{"$f":"(0.75*N$18*FLOOR(N$20,0.05)*0.9*N$35*N$38*o_Isol_Bij_Tijdstip($A77,N$8,N$11))+(0.75*P$18*FLOOR(P$20,0.05)*0.9*P$35*P$38*o_Isol_Bij_Tijdstip($A77,N$8,N$11))","v":{"$error":"#NAME?"}},"W",null,null,{"$f":"(0.75*R$18*FLOOR(R$20,0.05)*0.9*R$35*R$38*o_Isol_Bij_Tijdstip($A77,R$8,R$11))+(0.75*T$18*FLOOR(T$20,0.05)*0.9*T$35*T$38*o_Isol_Bij_Tijdstip($A77,R$8,R$11))","v":0},"W",{"$f":"B77+F77+J77+N77+R77","v":{"$error":"#NAME?"}},"W"]
["10:00:00",{"$f":"(0.75*B$18*FLOOR(B$20,0.05)*0.9*B$35*B$38*o_Isol_Bij_Tijdstip($A78,B$8,B$11))+(0.75*D$18*FLOOR(D$20,0.05)*0.9*D$35*D$38*o_Isol_Bij_Tijdstip($A78,B$8,B$11))","v":{"$error":"#NAME?"}},"W",{"$f":"o_maxTemp(VALUE(A78))","v":26.9},null,{"$f":"(0.75*F$18*FLOOR(F$20,0.05)*0.9*F$35*F$38*o_Isol_Bij_Tijdstip($A78,F$8,F$11))+(0.75*H$18*FLOOR(H$20,0.05)*0.9*H$35*H$38*o_Isol_Bij_Tijdstip($A78,F$8,F$11))","v":{"$error":"#NAME?"}},"W",null,null,{"$f":"(0.75*J$18*FLOOR(J$20,0.05)*0.9*J$35*J$38*o_Isol_Bij_Tijdstip($A78,J$8,J$11))+(0.75*L$18*FLOOR(L$20,0.05)*0.9*L$35*L$38*o_Isol_Bij_Tijdstip($A78,J$8,J$11))","v":{"$error":"#NAME?"}},"W",null,null,{"$f":"(0.75*N$18*FLOOR(N$20,0.05)*0.9*N$35*N$38*o_Isol_Bij_Tijdstip($A78,N$8,N$11))+(0.75*P$18*FLOOR(P$20,0.05)*0.9*P$35*P$38*o_Isol_Bij_Tijdstip($A78,N$8,N$11))","v":{"$error":"#NAME?"}},"W",null,null,{"$f":"(0.75*R$18*FLOOR(R$20,0.05)*0.9*R$35*R$38*o_Isol_Bij_Tijdstip($A78,R$8,R$11))+(0.75*T$18*FLOOR(T$20,0.05)*0.9*T$35*T$38*o_Isol_Bij_Tijdstip($A78,R$8,R$11))","v":0},"W",{"$error":"#NAME?"},"W"]
["11:00:00",{"$f":"(0.75*B$18*FLOOR(B$20,0.05)*0.9*B$35*B$38*o_Isol_Bij_Tijdstip($A79,B$8,B$11))+(0.75*D$18*FLOOR(D$20,0.05)*0.9*D$35*D$38*o_Isol_Bij_Tijdstip($A79,B$8,B$11))","v":{"$error":"#NAME?"}},"W",{"$f":"o_maxTemp(VALUE(A79))","v":28.2},null,{"$f":"(0.75*F$18*FLOOR(F$20,0.05)*0.9*F$35*F$38*o_Isol_Bij_Tijdstip($A79,F$8,F$11))+(0.75*H$18*FLOOR(H$20,0.05)*0.9*H$35*H$38*o_Isol_Bij_Tijdstip($A79,F$8,F$11))","v":{"$error":"#NAME?"}},"W",null,null,{"$f":"(0.75*J$18*FLOOR(J$20,0.05)*0.9*J$35*J$38*o_Isol_Bij_Tijdstip($A79,J$8,J$11))+(0.75*L$18*FLOOR(L$20,0.05)*0.9*L$35*L$38*o_Isol_Bij_Tijdstip($A79,J$8,J$11))","v":{"$error":"#NAME?"}},"W",null,null,{"$f":"(0.75*N$18*FLOOR(N$20,0.05)*0.9*N$35*N$38*o_Isol_Bij_Tijdstip($A79,N$8,N$11))+(0.75*P$18*FLOOR(P$20,0.05)*0.9*P$35*P$38*o_Isol_Bij_Tijdstip($A79,N$8,N$11))","v":{"$error":"#NAME?"}},"W",null,null,{"$f":"(0.75*R$18*FLOOR(R$20,0.05)*0.9*R$35*R$38*o_Isol_Bij_Tijdstip($A79,R$8,R$11))+(0.75*T$18*FLOOR(T$20,0.05)*0.9*T$35*T$38*o_Isol_Bij_Tijdstip($A79,R$8,R$11))","v":0},"W",{"$error":"#NAME?"},"W"]
["12:00:00",{"$f":"(0.75*B$18*FLOOR(B$20,0.05)*0.9*B$35*B$38*o_Isol_Bij_Tijdstip($A80,B$8,B$11))+(0.75*D$18*FLOOR(D$20,0.05)*0.9*D$35*D$38*o_Isol_Bij_Tijdstip($A80,B$8,B$11))","v":{"$error":"#NAME?"}},"W",{"$f":"o_maxTemp(VALUE(A80))","v":28.9},null,{"$f":"(0.75*F$18*FLOOR(F$20,0.05)*0.9*F$35*F$38*o_Isol_Bij_Tijdstip($A80,F$8,F$11))+(0.75*H$18*FLOOR(H$20,0.05)*0.9*H$35*H$38*o_Isol_Bij_Tijdstip($A80,F$8,F$11))","v":{"$error":"#NAME?"}},"W",null,null,{"$f":"(0.75*J$18*FLOOR(J$20,0.05)*0.9*J$35*J$38*o_Isol_Bij_Tijdstip($A80,J$8,J$11))+(0.75*L$18*FLOOR(L$20,0.05)*0.9*L$35*L$38*o_Isol_Bij_Tijdstip($A80,J$8,J$11))","v":{"$error":"#NAME?"}},"W",null,null,{"$f":"(0.75*N$18*FLOOR(N$20,0.05)*0.9*N$35*N$38*o_Isol_Bij_Tijdstip($A80,N$8,N$11))+(0.75*P$18*FLOOR(P$20,0.05)*0.9*P$35*P$38*o_Isol_Bij_Tijdstip($A80,N$8,N$11))","v":{"$error":"#NAME?"}},"W",null,null,{"$f":"(0.75*R$18*FLOOR(R$20,0.05)*0.9*R$35*R$38*o_Isol_Bij_Tijdstip($A80,R$8,R$11))+(0.75*T$18*FLOOR(T$20,0.05)*0.9*T$35*T$38*o_Isol_Bij_Tijdstip($A80,R$8,R$11))","v":0},"W",{"$error":"#NAME?"},"W"]
["13:00:00",{"$f":"(0.75*B$18*FLOOR(B$20,0.05)*0.9*B$35*B$38*o_Isol_Bij_Tijdstip($A81,B$8,B$11))+(0.75*D$18*FLOOR(D$20,0.05)*0.9*D$35*D$38*o_Isol_Bij_Tijdstip($A81,B$8,B$11))","v":{"$error":"#NAME?"}},"W",{"$f":"o_maxTemp(VALUE(A81))","v":29.7},null,{"$f":"(0.75*F$18*FLOOR(F$20,0.05)*0.9*F$35*F$38*o_Isol_Bij_Tijdstip($A81,F$8,F$11))+(0.75*H$18*FLOOR(H$20,0.05)*0.9*H$35*H$38*o_Isol_Bij_Tijdstip($A81,F$8,F$11))","v":{"$error":"#NAME?"}},"W",null,null,{"$f":"(0.75*J$18*FLOOR(J$20,0.05)*0.9*J$35*J$38*o_Isol_Bij_Tijdstip($A81,J$8,J$11))+(0.75*L$18*FLOOR(L$20,0.05)*0.9*L$35*L$38*o_Isol_Bij_Tijdstip($A81,J$8,J$11))","v":{"$error":"#NAME?"}},"W",null,null,{"$f":"(0.75*N$18*FLOOR(N$20,0.05)*0.9*N$35*N$38*o_Isol_Bij_Tijdstip($A81,N$8,N$11))+(0.75*P$18*FLOOR(P$20,0.05)*0.9*P$35*P$38*o_Isol_Bij_Tijdstip($A81,N$8,N$11))","v":{"$error":"#NAME?"}},"W",null,null,{"$f":"(0.75*R$18*FLOOR(R$20,0.05)*0.9*R$35*R$38*o_Isol_Bij_Tijdstip($A81,R$8,R$11))+(0.75*T$18*FLOOR(T$20,0.05)*0.9*T$35*T$38*o_Isol_Bij_Tijdstip($A81,R$8,R$11))","v":0},"W",{"$error":"#NAME?"},"W"]
["14:00:00",{"$f":"(0.75*B$18*FLOOR(B$20,0.05)*0.9*B$35*B$38*o_Isol_Bij_Tijdstip($A82,B$8,B$11))+(0.75*D$18*FLOOR(D$20,0.05)*0.9*D$35*D$38*o_Isol_Bij_Tijdstip($A82,B$8,B$11))","v":{"$error":"#NAME?"}},"W",{"$f":"o_maxTemp(VALUE(A82))","v":29.9},null,{"$f":"(0.75*F$18*FLOOR(F$20,0.05)*0.9*F$35*F$38*o_Isol_Bij_Tijdstip($A82,F$8,F$11))+(0.75*H$18*FLOOR(H$20,0.05)*0.9*H$35*H$38*o_Isol_Bij_Tijdstip($A82,F$8,F$11))","v":{"$error":"#NAME?"}},"W",null,null,{"$f":"(0.75*J$18*FLOOR(J$20,0.05)*0.9*J$35*J$38*o_Isol_Bij_Tijdstip($A82,J$8,J$11))+(0.75*L$18*FLOOR(L$20,0.05)*0.9*L$35*L$38*o_Isol_Bij_Tijdstip($A82,J$8,J$11))","v":{"$error":"#NAME?"}},"W",null,null,{"$f":"(0.75*N$18*FLOOR(N$20,0.05)*0.9*N$35*N$38*o_Isol_Bij_Tijdstip($A82,N$8,N$11))+(0.75*P$18*FLOOR(P$20,0.05)*0.9*P$35*P$38*o_Isol_Bij_Tijdstip($A82,N$8,N$11))","v":{"$error":"#NAME?"}},"W",null,null,{"$f":"(0.75*R$18*FLOOR(R$20,0.05)*0.9*R$35*R$38*o_Isol_Bij_Tijdstip($A82,R$8,R$11))+(0.75*T$18*FLOOR(T$20,0.05)*0.9*T$35*T$38*o_Isol_Bij_Tijdstip($A82,R$8,R$11))","v":0},"W",{"$error":"#NAME?"},"W"]
["15:00:00",{"$f":"(0.75*B$18*FLOOR(B$20,0.05)*0.9*B$35*B$38*o_Isol_Bij_Tijdstip($A83,B$8,B$11))+(0.75*D$18*FLOOR(D$20,0.05)*0.9*D$35*D$38*o_Isol_Bij_Tijdstip($A83,B$8,B$11))","v":{"$error":"#NAME?"}},"W",{"$f":"o_maxTemp(VALUE(A83))","v":29.800000000000015},null,{"$f":"(0.75*F$18*FLOOR(F$20,0.05)*0.9*F$35*F$38*o_Isol_Bij_Tijdstip($A83,F$8,F$11))+(0.75*H$18*FLOOR(H$20,0.05)*0.9*H$35*H$38*o_Isol_Bij_Tijdstip($A83,F$8,F$11))","v":{"$error":"#NAME?"}},"W",null,null,{"$f":"(0.75*J$18*FLOOR(J$20,0.05)*0.9*J$35*J$38*o_Isol_Bij_Tijdstip($A83,J$8,J$11))+(0.75*L$18*FLOOR(L$20,0.05)*0.9*L$35*L$38*o_Isol_Bij_Tijdstip($A83,J$8,J$11))","v":{"$error":"#NAME?"}},"W",null,null,{"$f":"(0.75*N$18*FLOOR(N$20,0.05)*0.9*N$35*N$38*o_Isol_Bij_Tijdstip($A83,N$8,N$11))+(0.75*P$18*FLOOR(P$20,0.05)*0.9*P$35*P$38*o_Isol_Bij_Tijdstip($A83,N$8,N$11))","v":{"$error":"#NAME?"}},"W",null,null,{"$f":"(0.75*R$18*FLOOR(R$20,0.05)*0.9*R$35*R$38*o_Isol_Bij_Tijdstip($A83,R$8,R$11))+(0.75*T$18*FLOOR(T$20,0.05)*0.9*T$35*T$38*o_Isol_Bij_Tijdstip($A83,R$8,R$11))","v":0},"W",{"$error":"#NAME?"},"W"]
["16:00:00",{"$f":"(0.75*B$18*FLOOR(B$20,0.05)*0.9*B$35*B$38*o_Isol_Bij_Tijdstip($A84,B$8,B$11))+(0.75*D$18*FLOOR(D$20,0.05)*0.9*D$35*D$38*o_Isol_Bij_Tijdstip($A84,B$8,B$11))","v":{"$error":"#NAME?"}},"W",{"$f":"o_maxTemp(VALUE(A84))","v":30.400000000000006},null,{"$f":"(0.75*F$18*FLOOR(F$20,0.05)*0.9*F$35*F$38*o_Isol_Bij_Tijdstip($A84,F$8,F$11))+(0.75*H$18*FLOOR(H$20,0.05)*0.9*H$35*H$38*o_Isol_Bij_Tijdstip($A84,F$8,F$11))","v":{"$error":"#NAME?"}},"W",null,null,{"$f":"(0.75*J$18*FLOOR(J$20,0.05)*0.9*J$35*J$38*o_Isol_Bij_Tijdstip($A84,J$8,J$11))+(0.75*L$18*FLOOR(L$20,0.05)*0.9*L$35*L$38*o_Isol_Bij_Tijdstip($A84,J$8,J$11))","v":{"$error":"#NAME?"}},"W",null,null,{"$f":"(0.75*N$18*FLOOR(N$20,0.05)*0.9*N$35*N$38*o_Isol_Bij_Tijdstip($A84,N$8,N$11))+(0.75*P$18*FLOOR(P$20,0.05)*0.9*P$35*P$38*o_Isol_Bij_Tijdstip($A84,N$8,N$11))","v":{"$error":"#NAME?"}},"W",null,null,{"$f":"(0.75*R$18*FLOOR(R$20,0.05)*0.9*R$35*R$38*o_Isol_Bij_Tijdstip($A84,R$8,R$11))+(0.75*T$18*FLOOR(T$20,0.05)*0.9*T$35*T$38*o_Isol_Bij_Tijdstip($A84,R$8,R$11))","v":0},"W",{"$error":"#NAME?"},"W"]
["17:00:00",{"$f":"(0.75*B$18*FLOOR(B$20,0.05)*0.9*B$35*B$38*o_Isol_Bij_Tijdstip($A85,B$8,B$11))+(0.75*D$18*FLOOR(D$20,0.05)*0.9*D$35*D$38*o_Isol_Bij_Tijdstip($A85,B$8,B$11))","v":{"$error":"#NAME?"}},"W",{"$f":"o_maxTemp(VALUE(A85))","v":30.59999999999998},null,{"$f":"(0.75*F$18*FLOOR(F$20,0.05)*0.9*F$35*F$38*o_Isol_Bij_Tijdstip($A85,F$8,F$11))+(0.75*H$18*FLOOR(H$20,0.05)*0.9*H$35*H$38*o_Isol_Bij_Tijdstip($A85,F$8,F$11))","v":{"$error":"#NAME?"}},"W",null,null,{"$f":"(0.75*J$18*FLOOR(J$20,0.05)*0.9*J$35*J$38*o_Isol_Bij_Tijdstip($A85,J$8,J$11))+(0.75*L$18*FLOOR(L$20,0.05)*0.9*L$35*L$38*o_Isol_Bij_Tijdstip($A85,J$8,J$11))","v":{"$error":"#NAME?"}},"W",null,null,{"$f":"(0.75*N$18*FLOOR(N$20,0.05)*0.9*N$35*N$38*o_Isol_Bij_Tijdstip($A85,N$8,N$11))+(0.75*P$18*FLOOR(P$20,0.05)*0.9*P$35*P$38*o_Isol_Bij_Tijdstip($A85,N$8,N$11))","v":{"$error":"#NAME?"}},"W",null,null,{"$f":"(0.75*R$18*FLOOR(R$20,0.05)*0.9*R$35*R$38*o_Isol_Bij_Tijdstip($A85,R$8,R$11))+(0.75*T$18*FLOOR(T$20,0.05)*0.9*T$35*T$38*o_Isol_Bij_Tijdstip($A85,R$8,R$11))","v":0},"W",{"$error":"#NAME?"},"W"]
["18:00:00",{"$f":"(0.75*B$18*FLOOR(B$20,0.05)*0.9*B$35*B$38*o_Isol_Bij_Tijdstip($A86,B$8,B$11))+(0.75*D$18*FLOOR(D$20,0.05)*0.9*D$35*D$38*o_Isol_Bij_Tijdstip($A86,B$8,B$11))","v":{"$error":"#NAME?"}},"W",{"$f":"o_maxTemp(VALUE(A86))","v":30.099999999999973},null,{"$f":"(0.75*F$18*FLOOR(F$20,0.05)*0.9*F$35*F$38*o_Isol_Bij_Tijdstip($A86,F$8,F$11))+(0.75*H$18*FLOOR(H$20,0.05)*0.9*H$35*H$38*o_Isol_Bij_Tijdstip($A86,F$8,F$11))","v":{"$error":"#NAME?"}},"W",null,null,{"$f":"(0.75*J$18*FLOOR(J$20,0.05)*0.9*J$35*J$38*o_Isol_Bij_Tijdstip($A86,J$8,J$11))+(0.75*L$18*FLOOR(L$20,0.05)*0.9*L$35*L$38*o_Isol_Bij_Tijdstip($A86,J$8,J$11))","v":{"$error":"#NAME?"}},"W",null,null,{"$f":"(0.75*N$18*FLOOR(N$20,0.05)*0.9*N$35*N$38*o_Isol_Bij_Tijdstip($A86,N$8,N$11))+(0.75*P$18*FLOOR(P$20,0.05)*0.9*P$35*P$38*o_Isol_Bij_Tijdstip($A86,N$8,N$11))","v":{"$error":"#NAME?"}},"W",null,null,{"$f":"(0.75*R$18*FLOOR(R$20,0.05)*0.9*R$35*R$38*o_Isol_Bij_Tijdstip($A86,R$8,R$11))+(0.75*T$18*FLOOR(T$20,0.05)*0.9*T$35*T$38*o_Isol_Bij_Tijdstip($A86,R$8,R$11))","v":0},"W",{"$error":"#NAME?"},"W"]
[]
["Maatgevende tijdstip",{"$f":"IF(MAX(T77:T86)=0,\"Geen glas aanwezig\",_xlfn.XLOOKUP(MAX(T77:T86),T77:T86,A77:A86,\"nvt\"))","v":{"$error":"#NAME?"}}]

{"sheet":"Ruimte 5","index":7,"n_rows":88,"n_cols":21,"rows_kept":88,"cut":false,"hidden":false,"merged":[[70,0,71,20],[0,0,0,20],[6,1,6,3],[6,5,6,7],[6,9,6,11],[6,13,6,15],[6,17,6,20],[41,1,41,3],[41,5,41,7],[41,9,41,11],[41,13,41,15],[41,17,41,19],[40,1,40,3],[40,5,40,7],[40,9,40,11],[40,13,40,15],[40,17,40,19],[55,1,55,3],[55,5,55,7],[55,9,55,11],[55,13,55,15],[55,17,55,19],[54,1,54,3],[54,5,54,7],[54,9,54,11],[54,13,54,15],[54,17,54,19],[56,5,56,7],[56,9,56,11],[56,13,56,15],[56,17,56,19],[57,1,57,3],[57,5,57,7],[57,9,57,11],[57,13,57,15],[57,17,57,19],[59,1,59,3],[60,1,60,3],[62,1,62,3],[63,1,63,3],[56,1,56,3]]}
["RUIMTE 5"]
[]
["Ruimtenaam",5]
["Type verblijfsruimte","Andere verblijfsruimte"]
["Vloeroppervlak verblijfsruimte Avr  (gebruiksoppervlak)",0,"m²"]
[]
[null,"Voorzijde woning",null,null,null,"Linker zijde woning",null,null,null,"Achterzijde woning",null,null,null,"Rechter zijde woning",null,null,null,"Platdak"]
["Orientatie gevel / dakvlak (Helling > 15°C)",{"$f":"'Projectgegevens en Resultaten'!$B$17","v":0},null,null,null,{"$f":"o_Orientatie(F9)","v":{"$error":"#NAME?"}},null,null,null,{"$f":"o_Orientatie(J9)","v":{"$error":"#NAME?"}},null,null,null,{"$f":"o_Orientatie(N9)","v":{"$error":"#NAME?"}},null,null,null,"Horizontaal"]
["Orientatiehoek gevel Ƴ",{"$f":"o_OrientatiehOEK(B8)","v":{"$error":"#NAME?"}},null,null,null,{"$f":"IF(B9+90>360,B9+90-360,B9+90)","v":{"$error":"#NAME?"}},null,null,null,{"$f":"IF(F9+90>360,F9+90-360,F9+90)","v":{"$error":"#NAME?"}},null,null,null,{"$f":"IF(J9+90>360,J9+90-360,J9+90)","v":{"$error":"#NAME?"}}]
["Grenst aan buitenlucht ja of nee","Nee",null,null,null,"Nee",null,null,null,"Nee",null,null,null,"Nee",null,null,null,"Nee"]
["Hellingshoek constructie ≥ 15° = hellenddak 90° = gevel",90,"°",null,null,90,"°",null,null,90,"°",null,null,90,"°",null,null,0,"°"]
["Type constructie",{"$f":"o_TypeConstructie(B10,B11)","v":"Woningscheidend"},null,null,null,{"$f":"o_TypeConstructie(F10,F11)","v":"Woningscheidend"},null,null,null,{"$f":"o_TypeConstructie(J10,J11)","v":"Woningscheidend"},null,null,null,{"$f":"o_TypeConstructie(N10,N11)","v":"Woningscheidend"},null,null,null,{"$f":"o_TypeConstructie(R10,R11)","v":"Woningscheidend"}]
["Gevel lengte (binnenwerks)",null,"m",null,null,null,"m",null,null,null,"m",null,null,null,"m",null,null,null,"m"]
["Gevel hoogte / Dak breedte (binnenwerks)",null,"m",null,null,null,"m",null,null,null,"m",null,null,null,"m",null,null,null,"m"]
["Constructie oppervlak (binnenwerks)",{"$f":"B13*B14","v":0},"m²",null,null,{"$f":"F13*F14","v":0},"m²",null,null,{"$f":"J13*J14","v":0},"m²",null,null,{"$f":"N13*N14","v":0},"m²",null,null,{"$f":"R13*R14","v":0},"m²"]
["Gesloten constructie oppervlak",{"$f":"MAX(0,B15-B18-D18)","v":0},"m²",null,null,{"$f":"MAX(0,F15-F18-H18)","v":0},"m²",null,null,{"$f":"MAX(0,J15-J18-L18)","v":0},"m²",null,null,{"$f":"MAX(0,N15-N18-P18)","v":0},"m²",null,null,{"$f":"MAX(0,R15-R18-T18)","v":0},"m²"]
[null,"Glasvlak type 1",null,"Glasvlak type 2",null,"Glasvlak type 1",null,"Glasvlak type 2",null,"Glasvlak type 1",null,"Glasvlak type 2",null,"Glasvlak type 1",null,"Glasvlak type 2",null,"Glasvlak type 1",null,"Glasvlak type 2"]
["Totaal oppervlak van raamtype Aw,k (inclusief kozijn)",null,"m²",null,"m²",null,"m²",null,"m²",null,"m²",null,"m²",null,"m²",null,"m²",null,"m²",null,"m²"]
["Warmtedoorgangscoefficient (U-waarde) van het raam Uw;wi;k",null,"W/m².K",null,"W/m².K",null,"W/m².K",null,"W/m².K",null,"W/m².K",null,"W/m².K",null,"W/m².K",null,"W/m².K",null,"W/m².K",null,"W/m².K"]
["Zontoetredingsfactor (g_waarde) van het glas Ggl;n;wi;k;C;juli",1,null,1,null,1,null,1,null,1,null,1,null,1,null,1,null,1,null,1]
["Beschaduwing situatie bij het raamtype","Minimale belemmering",null,"Minimale belemmering",null,"Minimale belemmering",null,"Minimale belemmering",null,"Minimale belemmering",null,"Minimale belemmering",null,"Minimale belemmering",null,"Minimale belemmering",null,"Minimale belemmering",null,"Minimale belemmering"]
[]
[null,"Overstek",null,"Overstek",null,"Overstek",null,"Overstek",null,"Overstek",null,"Overstek",null,"Overstek",null,"Overstek"]
["Hoogte verschil midden raam onderzijde overstek",0,"m",0,"m",0,"m",0,"m",0,"m",0,"m",0,"m",0,"m",0,null,0,"m"]
["Horizontale afstand glas tot eindpunt overstek",0,"m",0,"m",0,"m",0,"m",0,"m",0,"m",0,"m",0,"m",0,null,0,"m"]
["Overstekhoek",{"$f":"IFERROR(180/PI()*ATAN(B24/B25),0)","v":0},"°",{"$f":"IFERROR(180/PI()*ATAN(D24/D25),0)","v":0},"°",{"$f":"IFERROR(180/PI()*ATAN(F24/F25),0)","v":0},"°",{"$f":"IFERROR(180/PI()*ATAN(H24/H25),0)","v":0},"°",{"$f":"IFERROR(180/PI()*ATAN(J24/J25),0)","v":0},"°",{"$f":"IFERROR(180/PI()*ATAN(L24/L25),0)","v":0},"°",{"$f":"IFERROR(180/PI()*ATAN(N24/N25),0)","v":0},"°",{"$f":"IFERROR(180/PI()*ATAN(P24/P25),0)","v":0},"°",null,null,null,"°"]
["Relatieve hoogte van overstek",{"$f":"IFERROR(B24/B25,1)","v":1},null,{"$f":"IFERROR(D24/D25,1)","v":1},null,{"$f":"IFERROR(F24/F25,1)","v":1},null,{"$f":"IFERROR(H24/H25,1)","v":1},null,{"$f":"IFERROR(J24/J25,1)","v":1},null,{"$f":"IFERROR(L24/L25,1)","v":1},null,{"$f":"IFERROR(N24/N25,1)","v":1},null,{"$f":"IFERROR(P24/P25,1)","v":1}]
[]
[null,"Zijbelemmering",null,"Zijbelemmering",null,"Zijbelemmering",null,"Zijbelemmering",null,"Zijbelemmering",null,"Zijbelemmering",null,"Zijbelemmering",null,"Zijbelemmering"]
["Positie zijbelemmering irt zichtveld (naar buitengericht)","Links",null,"Links",null,"Links",null,"Links",null,"Links",null,"Links",null,"Links",null,"Links",null,"Links",null,"Links"]
["Horizontale afstand midden raam verste punt belemmering",0,"m",0,"m",0,"m",0,"m",0,"m",0,"m",0,"m",0,"m",0,null,0,"m"]
["Horizontale breedte glas tot eindpunt belemmering",0,"m",0,"m",0,"m",0,"m",0,"m",0,"m",0,"m",0,"m",0,null,0,"m"]
["Relatieve breedte van de zijbelemmering bb",{"$f":"IFERROR(B31/B32,999)","v":999},null,{"$f":"IFERROR(D31/D32,999)","v":999},null,{"$f":"IFERROR(F31/F32,999)","v":999},null,{"$f":"IFERROR(H31/H32,999)","v":999},null,{"$f":"IFERROR(J31/J32,999)","v":999},null,{"$f":"IFERROR(L31/L32,999)","v":999},null,{"$f":"IFERROR(N31/N32,999)","v":999},null,{"$f":"IFERROR(P31/P32,999)","v":999}]
[]
["De beschaduwingsreductiefactor Fsh;obst;wi;k;juli",{"$f":"IFERROR(o_Beschaduwingreductie(B21,B8,B27,B30,B33,B11),1)","v":1},null,{"$f":"IFERROR(o_Beschaduwingreductie(D21,B8,D27,D30,D33,B11),1)","v":1},null,{"$f":"IFERROR(o_Beschaduwingreductie(F21,F8,F27,F30,F33,F11),1)","v":1},null,{"$f":"IFERROR(o_Beschaduwingreductie(H21,F8,H27,H30,H33,F11),1)","v":1},null,{"$f":"IFERROR(o_Beschaduwingreductie(J21,J8,J27,J30,J33,J11),1)","v":1},null,{"$f":"IFERROR(o_Beschaduwingreductie(L21,J8,L27,L30,L33,J11),1)","v":1},null,{"$f":"IFERROR(o_Beschaduwingreductie(N21,N8,N27,N30,N33,N11),1)","v":1},null,{"$f":"IFERROR(o_Beschaduwingreductie(P21,N8,P27,P30,P33,N11),1)","v":1},null,{"$f":"o_Beschaduwingreductie(R21,R8,R27,R30,R33,R11)","v":1},null,{"$f":"o_Beschaduwingreductie(T21,R8,T27,T30,T33,R11)","v":1}]
[]
["Type zonwering","Geen zonwering",null,"Geen zonwering",null,"Geen zonwering",null,"Geen zonwering",null,"Geen zonwering",null,"Geen zonwering",null,"Geen zonwering",null,"Geen zonwering",null,"Geen zonwering",null,"Geen zonwering"]
["De reductiefactor voor zonwering Fc;wi;k",{"$f":"o_Zonweringreductie(B37,B8)","v":{"$error":"#NAME?"}},null,{"$f":"o_Zonweringreductie(D37,B8)","v":{"$error":"#NAME?"}},null,{"$f":"o_Zonweringreductie(F37,F8)","v":{"$error":"#NAME?"}},null,{"$f":"o_Zonweringreductie(H37,F8)","v":{"$error":"#NAME?"}},null,{"$f":"o_Zonweringreductie(J37,J8)","v":{"$error":"#NAME?"}},null,{"$f":"o_Zonweringreductie(L37,J8)","v":{"$error":"#NAME?"}},null,{"$f":"o_Zonweringreductie(N37,N8)","v":{"$error":"#NAME?"}},null,{"$f":"o_Zonweringreductie(P37,N8)","v":{"$error":"#NAME?"}},null,{"$f":"o_Zonweringreductie(R37,R8)","v":1},null,{"$f":"o_Zonweringreductie(T37,R8)","v":1}]
["Totaal opvallende zonnestraling van het raam Isol;wi;k;juli",{"$f":"IF(B10=\"Nee\",0,o_Isol_Bij_Tijdstip($B$52,B8,B11))","v":0},"W/m²",{"$f":"IF(B10=\"Nee\",0,o_Isol_Bij_Tijdstip($B$52,B8,B11))","v":0},"W/m²",{"$f":"IF(F10=\"Nee\",0,o_Isol_Bij_Tijdstip($B$52,F8,F11))","v":0},"W/m²",{"$f":"IF(F10=\"Nee\",0,o_Isol_Bij_Tijdstip($B$52,F8,F11))","v":0},"W/m²",{"$f":"IF(J10=\"Nee\",0,o_Isol_Bij_Tijdstip($B$52,J8,J11))","v":0},"W/m²",{"$f":"IF(J10=\"Nee\",0,o_Isol_Bij_Tijdstip($B$52,J8,J11))","v":0},"W/m²",{"$f":"IF(N10=\"Nee\",0,o_Isol_Bij_Tijdstip($B$52,N8,N11))","v":0},"W/m²",{"$f":"IF(N10=\"Nee\",0,o_Isol_Bij_Tijdstip($B$52,N8,N11))","v":0},"W/m²",{"$f":"IF(R10=\"Nee\",0,o_Isol_Bij_Tijdstip($B$52,R8,R11))","v":0},"W/m²",{"$f":"IF(R10=\"Nee\",0,o_Isol_Bij_Tijdstip($B$52,R8,R11))","v":0},"W/m²"]
[]
["Tijdstip maximale koellastbijdrage tmax;zi",{"$f":"VALUE(o_Tijdstip_Isol_Max_Orientatie(B8,B11))","v":{"$error":"#NAME?"}},null,null,null,{"$f":"VALUE(o_Tijdstip_Isol_Max_Orientatie(F8,F11))","v":{"$error":"#NAME?"}},null,null,null,{"$f":"VALUE(o_Tijdstip_Isol_Max_Orientatie(J8,J11))","v":{"$error":"#NAME?"}},null,null,null,{"$f":"VALUE(o_Tijdstip_Isol_Max_Orientatie(N8,N11))","v":{"$error":"#NAME?"}},null,null,null,{"$f":"o_Tijdstip_Isol_Max_Orientatie(R8,R11)","v":"12:00:00 PM"}]
["Buitenluchttemperatuur op tijdstip max koellast Θe",{"$f":"o_maxTemp(VALUE(B41))","v":{"$error":"#NAME?"}},null,null,"°C",{"$f":"o_maxTemp(VALUE(F41))","v":{"$error":"#NAME?"}},null,null,"°C",{"$f":"o_maxTemp(VALUE(J41))","v":{"$error":"#NAME?"}},null,null,"°C",{"$f":"o_maxTemp(VALUE(N41))","v":{"$error":"#NAME?"}},null,null,"°C",{"$f":"o_maxTemp(VALUE(R41))","v":29.5}]
[]
["Glasopppervlak",{"$f":"IF(B10=\"Ja\",B18+D18,0)","v":0},"m²",null,null,{"$f":"IF(F10=\"Ja\",F18+H18,0)","v":0},"m²",null,null,{"$f":"IF(J10=\"Ja\",J18+L18,0)","v":0},"m²",null,null,{"$f":"IF(N10=\"Ja\",N18+P18,0)","v":0},"m²",null,null,{"$f":"IF(R10=\"Ja\",R18+T18,0)","v":0},"m²"]
["Uitwendigescheidingsconstructie niet op Noord?",{"$f":"IF(B10=\"Ja\",IF(B8=\"Noord\",FALSE,TRUE),FALSE)","v":false},null,null,null,{"$f":"IF(F10=\"Ja\",IF(F8=\"Noord\",FALSE,TRUE),FALSE)","v":false},null,null,null,{"$f":"IF(J10=\"Ja\",IF(J8=\"Noord\",FALSE,TRUE),FALSE)","v":false},null,null,null,{"$f":"IF(N10=\"Ja\",IF(N8=\"Noord\",FALSE,TRUE),FALSE)","v":false},null,null,null,{"$f":"IF(R10=\"Ja\",IF(R8=\"Noord\",FALSE,TRUE),FALSE)","v":false}]
["De enige uitwendigescheidingscontructie?",{"$f":"IF(AND(B45=TRUE,COUNTIF($B$45:$R$45,TRUE)=1),TRUE,FALSE)","v":false},null,null,null,{"$f":"IF(AND(F45=TRUE,COUNTIF($B$45:$R$45,TRUE)=1),TRUE,FALSE)","v":false},null,null,null,{"$f":"IF(AND(J45=TRUE,COUNTIF($B$45:$R$45,TRUE)=1),TRUE,FALSE)","v":false},null,null,null,{"$f":"IF(AND(N45=TRUE,COUNTIF($B$45:$R$45,TRUE)=1),TRUE,FALSE)","v":false},null,null,null,{"$f":"IF(AND(R45=TRUE,COUNTIF($B$45:$R$45,TRUE)=1),TRUE,FALSE)","v":false}]
["Totaal glasoppervlak",{"$f":"IF(B8<>\"Noord\",B44,0)","v":0},"m²",null,null,{"$f":"IF(F8<>\"Noord\",F44,0)","v":{"$error":"#NAME?"}},"m²",null,null,{"$f":"IF(J8<>\"Noord\",J44,0)","v":{"$error":"#NAME?"}},"m²",null,null,{"$f":"IF(N8<>\"Noord\",N44,0)","v":{"$error":"#NAME?"}},"m²",null,null,{"$f":"R44","v":0},"m²"]
["Grootste glasoppervlak ",{"$f":"IF(AND(B45,B47=MAX($B$47:$R$47)),TRUE,FALSE)","v":{"$error":"#NAME?"}},null,null,null,{"$f":"IF(AND(F45,F47=MAX($B$47:$R$47)),TRUE,FALSE)","v":{"$error":"#NAME?"}},null,null,null,{"$f":"IF(AND(J45,J47=MAX($B$47:$R$47)),TRUE,FALSE)","v":{"$error":"#NAME?"}},null,null,null,{"$f":"IF(AND(N45,N47=MAX($B$47:$R$47)),TRUE,FALSE)","v":{"$error":"#NAME?"}},null,null,null,{"$f":"IF(AND(R45,R47=MAX($B$47:$R$47)),TRUE,FALSE)","v":{"$error":"#NAME?"}}]
["Dakvlak maatgevend?",{"$f":"IF(AND(B11<90,B15>3*(B18+D18),'Projectgegevens en Resultaten'!#REF!<65),TRUE,FALSE)","v":{"$error":"#REF!"}},null,null,null,{"$f":"IF(AND(F11<90,F15>3*(F18+H18),'Projectgegevens en Resultaten'!#REF!<65),TRUE,FALSE)","v":{"$error":"#REF!"}},null,null,null,{"$f":"IF(AND(J11<90,J15>3*(J18+L18),'Projectgegevens en Resultaten'!#REF!<65),TRUE,FALSE)","v":{"$error":"#REF!"}},null,null,null,{"$f":"IF(AND(N11<90,N15>3*(N18+P18),'Projectgegevens en Resultaten'!#REF!<65),TRUE,FALSE)","v":{"$error":"#REF!"}},null,null,null,{"$f":"IF(AND(R11<90,R15>3*(R18+T18),'Projectgegevens en Resultaten'!#REF!<65),TRUE,FALSE)","v":{"$error":"#REF!"}}]
["is er een maatgevend dakoppervlak",{"$f":"IF(COUNTIF($B$49:$R$49,TRUE)>0,TRUE,FALSE)","v":false},null,null,null,{"$f":"IF(COUNTIF($B$49:$R$49,TRUE)>0,TRUE,FALSE)","v":false},null,null,null,{"$f":"IF(COUNTIF($B$49:$R$49,TRUE)>0,TRUE,FALSE)","v":false},null,null,null,{"$f":"IF(COUNTIF($B$49:$R$49,TRUE)>0,TRUE,FALSE)","v":false},null,null,null,{"$f":"IF(COUNTIF($B$49:$R$49,TRUE)>0,TRUE,FALSE)","v":false}]
["Maatgevende tijdstip",{"$f":"IF(OR(B46,AND(B45,B50,B49),AND(B45,B48,NOT(B50))),B41)","v":{"$error":"#REF!"}},null,null,null,{"$f":"IF(OR(F46,AND(F45,F50,F49),AND(F45,F48,NOT(F50))),F41)","v":{"$error":"#REF!"}},null,null,null,{"$f":"IF(OR(J46,AND(J45,J50,J49),AND(J45,J48,NOT(J50))),J41)","v":{"$error":"#REF!"}},null,null,null,{"$f":"IF(OR(N46,AND(N45,N50,N49),AND(N45,N48,NOT(N50))),N41)","v":{"$error":"#REF!"}},null,null,null,{"$f":"IF(OR(R46,AND(R45,R50,R49),AND(R45,R48,NOT(R50))),R41)","v":{"$error":"#REF!"}}]
["Maatgevende tijdstip tmax;zi",{"$f":"IFERROR(B88,\"geen glas ingevoerd\")","v":"geen glas ingevoerd"}]
["Buitenluchttemperatuur op tijdstip max koellast Θe",{"$f":"o_maxTemp(VALUE(B52))","v":{"$error":"#NAME?"}},"°C"]
[]
["Koellastbijdrage transmissie ondoorzichtige delen Ptr;ntr;vr;zi",{"$f":"IF(B10=\"Nee\",0,B16*'Projectgegevens en Resultaten'!$B$16)","v":0},null,null,"W",{"$f":"IF(F10=\"Nee\",0,F16*'Projectgegevens en Resultaten'!$B$16)","v":0},null,null,"W",{"$f":"IF(J10=\"Nee\",0,J16*'Projectgegevens en Resultaten'!$B$16)","v":0},null,null,"W",{"$f":"IF(N10=\"Nee\",0,N16*'Projectgegevens en Resultaten'!$B$16)","v":0},null,null,"W",{"$f":"IF(R10=\"Nee\",0,R16*'Projectgegevens en Resultaten'!$B$16)","v":0},null,null,"W"]
["Koellastbijdrage zoninstraling transparante delen Psol;vr;zi",{"$f":"(0.75*B18*FLOOR(B20,0.05)*0.9*B35*B38*B39)+(0.75*D18*FLOOR(D20,0.05)*0.9*D35*D38*D39)","v":{"$error":"#NAME?"}},null,null,"W",{"$f":"(0.75*F18*FLOOR(F20,0.05)*0.9*F35*F38*F39)+(0.75*H18*FLOOR(H20,0.05)*0.9*H35*H38*H39)","v":{"$error":"#NAME?"}},null,null,"W",{"$f":"(0.75*J18*FLOOR(J20,0.05)*0.9*J35*J38*J39)+(0.75*L18*FLOOR(L20,0.05)*0.9*L35*L38*L39)","v":{"$error":"#NAME?"}},null,null,"W",{"$f":"(0.75*N18*FLOOR(N20,0.05)*0.9*N35*N38*N39)+(0.75*P18*FLOOR(P20,0.05)*0.9*P35*P38*P39)","v":{"$error":"#NAME?"}},null,null,"W",{"$f":"(0.75*R18*FLOOR(R20,0.05)*0.9*R35*R38*R39)+(0.75*T18*FLOOR(T20,0.05)*0.9*T35*T38*T39)","v":0},null,null,"W"]
["Koellastbijdrage transmissie transparante delen Ptr;gl;vr;zi",{"$f":"IF(B10=\"Nee\",0,IFERROR(B18*B19*($B$53-24),0)+IFERROR(D18*D19*($B$53-24),0))","v":0},null,null,"W",{"$f":"IF(F10=\"Nee\",0,IFERROR(F18*F19*($B$53-24),0)+IFERROR(H18*H19*($B$53-24),0))","v":0},null,null,"W",{"$f":"IF(J10=\"Nee\",0,IFERROR(J18*J19*($B$53-24),0)+IFERROR(L18*L19*($B$53-24),0))","v":0},null,null,"W",{"$f":"IF(N10=\"Nee\",0,IFERROR(N18*N19*($B$53-24),0)+IFERROR(P18*P19*($B$53-24),0))","v":0},null,null,"W",{"$f":"IF(R10=\"Nee\",0,IFERROR(R18*R19*($B$53-24),0)+IFERROR(T18*T19*($B$53-24),0))","v":0},null,null,"W"]
["Totaal koellastbijdrage per gevel",{"$f":"SUM(B55:D57)","v":{"$error":"#NAME?"}},null,null,"W",{"$f":"SUM(F55:H57)","v":{"$error":"#NAME?"}},null,null,"W",{"$f":"SUM(J55:L57)","v":{"$error":"#NAME?"}},null,null,"W",{"$f":"SUM(N55:P57)","v":{"$error":"#NAME?"}},null,null,"W",{"$f":"SUM(R55:R57)","v":0},null,null,"W"]
[]
["Koellast door interne warmtelast Pint;calc;woon/overig;zi",{"$f":"IF(B5=0,0,IF(B4=\"Woonvertrek\",2*'Projectgegevens en Resultaten'!$B$33*B5,'Projectgegevens en Resultaten'!$B$33*B5))","v":0},null,null,"W"]
["Koellast door buitenluchttoetreding Pv;calc;vr;zi",{"$f":"IFERROR(MAX((SUM('Projectgegevens en Resultaten'!$B$21:$B$23)/3600*1.205*1005*(B53-24))/SUM('Projectgegevens en Resultaten'!$B$40:$T$40)*B5,0),0)","v":0},{"$f":"IFERROR(MAX(SUM(C57:C59)/3600*1.205*1005*(C60-24),0),0)","v":0},{"$f":"IFERROR(MAX(SUM(D57:D59)/3600*1.205*1005*(D60-24),0),0)","v":0},"W"]
[]
["Totaal koellastbijdrage",{"$f":"IFERROR(SUM(B58:T58)+B60+B61,0)","v":0},null,null,"W"]
["Koelbehoefte verblijfsruimte",{"$f":"IFERROR(B63/B5,0)","v":0},null,null,"W/m²"]
[]
[]
[]
[]
[]
[]
["Onderstaande tabellen worden verborgen in de uiteindelijke versie. De tabellen dienen om vast te stellen welk tijdstip tot de hoogste zonbelasting leidt"]
[]
["Isol max voor de orientatie",{"$f":"o_Isol_Max_Orientatie(B8,B11)","v":{"$error":"#NAME?"}},"W/m²",null,null,{"$f":"o_Isol_Max_Orientatie(F8,F11)","v":{"$error":"#NAME?"}},"W/m²",null,null,{"$f":"o_Isol_Max_Orientatie(J8,J11)","v":{"$error":"#NAME?"}},"W/m²",null,null,{"$f":"o_Isol_Max_Orientatie(N8,N11)","v":{"$error":"#NAME?"}},"W/m²",null,null,{"$f":"o_Isol_Max_Orientatie(R8,R11)","v":914.11856204111336},"W/m²"]
["Tijdstip bij Isol max bij orientatie",{"$f":"VALUE(o_Tijdstip_Isol_Max_Orientatie(B8,B11))","v":{"$error":"#NAME?"}},null,null,null,{"$f":"VALUE(o_Tijdstip_Isol_Max_Orientatie(F8,F11))","v":{"$error":"#NAME?"}},null,null,null,{"$f":"VALUE(o_Tijdstip_Isol_Max_Orientatie(J8,J11))","v":{"$error":"#NAME?"}},null,null,null,{"$f":"VALUE(o_Tijdstip_Isol_Max_Orientatie(N8,N11))","v":{"$error":"#NAME?"}},null,null,null,{"$f":"VALUE(o_Tijdstip_Isol_Max_Orientatie(R8,R11))","v":"12:00:00"}]
[]
["Koellastbijdrage zoninstraling transparante delen Psol;vr;zi"]
["09:00:00",{"$f":"(0.75*B$18*FLOOR(B$20,0.05)*0.9*B$35*B$38*o_Isol_Bij_Tijdstip($A77,B$8,B$11))+(0.75*D$18*FLOOR(D$20,0.05)*0.9*D$35*D$38*o_Isol_Bij_Tijdstip($A77,B$8,B$11))","v":{"$error":"#NAME?"}},"W",null,null,{"$f":"(0.75*F$18*FLOOR(F$20,0.05)*0.9*F$35*F$38*o_Isol_Bij_Tijdstip($A77,F$8,F$11))+(0.75*H$18*FLOOR(H$20,0.05)*0.9*H$35*H$38*o_Isol_Bij_Tijdstip($A77,F$8,F$11))","v":{"$error":"#NAME?"}},"W",null,null,{"$f":"(0.75*J$18*FLOOR(J$20,0.05)*0.9*J$35*J$38*o_Isol_Bij_Tijdstip($A77,J$8,J$11))+(0.75*L$18*FLOOR(L$20,0.05)*0.9*L$35*L$38*o_Isol_Bij_Tijdstip($A77,J$8,J$11))","v":{"$error":"#NAME?"}},"W",null,null,{"$f":"(0.75*N$18*FLOOR(N$20,0.05)*0.9*N$35*N$38*o_Isol_Bij_Tijdstip($A77,N$8,N$11))+(0.75*P$18*FLOOR(P$20,0.05)*0.9*P$35*P$38*o_Isol_Bij_Tijdstip($A77,N$8,N$11))","v":{"$error":"#NAME?"}},"W",null,null,{"$f":"(0.75*R$18*FLOOR(R$20,0.05)*0.9*R$35*R$38*o_Isol_Bij_Tijdstip($A77,R$8,R$11))+(0.75*T$18*FLOOR(T$20,0.05)*0.9*T$35*T$38*o_Isol_Bij_Tijdstip($A77,R$8,R$11))","v":0},"W",{"$f":"B77+F77+J77+N77+R77","v":{"$error":"#NAME?"}},"W"]
["10:00:00",{"$f":"(0.75*B$18*FLOOR(B$20,0.05)*0.9*B$35*B$38*o_Isol_Bij_Tijdstip($A78,B$8,B$11))+(0.75*D$18*FLOOR(D$20,0.05)*0.9*D$35*D$38*o_Isol_Bij_Tijdstip($A78,B$8,B$11))","v":{"$error":"#NAME?"}},"W",null,null,{"$f":"(0.75*F$18*FLOOR(F$20,0.05)*0.9*F$35*F$38*o_Isol_Bij_Tijdstip($A78,F$8,F$11))+(0.75*H$18*FLOOR(H$20,0.05)*0.9*H$35*H$38*o_Isol_Bij_Tijdstip($A78,F$8,F$11))","v":{"$error":"#NAME?"}},"W",null,null,{"$f":"(0.75*J$18*FLOOR(J$20,0.05)*0.9*J$35*J$38*o_Isol_Bij_Tijdstip($A78,J$8,J$11))+(0.75*L$18*FLOOR(L$20,0.05)*0.9*L$35*L$38*o_Isol_Bij_Tijdstip($A78,J$8,J$11))","v":{"$error":"#NAME?"}},"W",null,null,{"$f":"(0.75*N$18*FLOOR(N$20,0.05)*0.9*N$35*N$38*o_Isol_Bij_Tijdstip($A78,N$8,N$11))+(0.75*P$18*FLOOR(P$20,0.05)*0.9*P$35*P$38*o_Isol_Bij_Tijdstip($A78,N$8,N$11))","v":{"$error":"#NAME?"}},"W",null,null,{"$f":"(0.75*R$18*FLOOR(R$20,0.05)*0.9*R$35*R$38*o_Isol_Bij_Tijdstip($A78,R$8,R$11))+(0.75*T$18*FLOOR(T$20,0.05)*0.9*T$35*T$38*o_Isol_Bij_Tijdstip($A78,R$8,R$11))","v":0},"W",{"$error":"#NAME?"},"W"]
["11:00:00",{"$f":"(0.75*B$18*FLOOR(B$20,0.05)*0.9*B$35*B$38*o_Isol_Bij_Tijdstip($A79,B$8,B$11))+(0.75*D$18*FLOOR(D$20,0.05)*0.9*D$35*D$38*o_Isol_Bij_Tijdstip($A79,B$8,B$11))","v":{"$error":"#NAME?"}},"W",null,null,{"$f":"(0.75*F$18*FLOOR(F$20,0.05)*0.9*F$35*F$38*o_Isol_Bij_Tijdstip($A79,F$8,F$11))+(0.75*H$18*FLOOR(H$20,0.05)*0.9*H$35*H$38*o_Isol_Bij_Tijdstip($A79,F$8,F$11))","v":{"$error":"#NAME?"}},"W",null,null,{"$f":"(0.75*J$18*FLOOR(J$20,0.05)*0.9*J$35*J$38*o_Isol_Bij_Tijdstip($A79,J$8,J$11))+(0.75*L$18*FLOOR(L$20,0.05)*0.9*L$35*L$38*o_Isol_Bij_Tijdstip($A79,J$8,J$11))","v":{"$error":"#NAME?"}},"W",null,null,{"$f":"(0.75*N$18*FLOOR(N$20,0.05)*0.9*N$35*N$38*o_Isol_Bij_Tijdstip($A79,N$8,N$11))+(0.75*P$18*FLOOR(P$20,0.05)*0.9*P$35*P$38*o_Isol_Bij_Tijdstip($A79,N$8,N$11))","v":{"$error":"#NAME?"}},"W",null,null,{"$f":"(0.75*R$18*FLOOR(R$20,0.05)*0.9*R$35*R$38*o_Isol_Bij_Tijdstip($A79,R$8,R$11))+(0.75*T$18*FLOOR(T$20,0.05)*0.9*T$35*T$38*o_Isol_Bij_Tijdstip($A79,R$8,R$11))","v":0},"W",{"$error":"#NAME?"},"W"]
["12:00:00",{"$f":"(0.75*B$18*FLOOR(B$20,0.05)*0.9*B$35*B$38*o_Isol_Bij_Tijdstip($A80,B$8,B$11))+(0.75*D$18*FLOOR(D$20,0.05)*0.9*D$35*D$38*o_Isol_Bij_Tijdstip($A80,B$8,B$11))","v":{"$error":"#NAME?"}},"W",null,null,{"$f":"(0.75*F$18*FLOOR(F$20,0.05)*0.9*F$35*F$38*o_Isol_Bij_Tijdstip($A80,F$8,F$11))+(0.75*H$18*FLOOR(H$20,0.05)*0.9*H$35*H$38*o_Isol_Bij_Tijdstip($A80,F$8,F$11))","v":{"$error":"#NAME?"}},"W",null,null,{"$f":"(0.75*J$18*FLOOR(J$20,0.05)*0.9*J$35*J$38*o_Isol_Bij_Tijdstip($A80,J$8,J$11))+(0.75*L$18*FLOOR(L$20,0.05)*0.9*L$35*L$38*o_Isol_Bij_Tijdstip($A80,J$8,J$11))","v":{"$error":"#NAME?"}},"W",null,null,{"$f":"(0.75*N$18*FLOOR(N$20,0.05)*0.9*N$35*N$38*o_Isol_Bij_Tijdstip($A80,N$8,N$11))+(0.75*P$18*FLOOR(P$20,0.05)*0.9*P$35*P$38*o_Isol_Bij_Tijdstip($A80,N$8,N$11))","v":{"$error":"#NAME?"}},"W",null,null,{"$f":"(0.75*R$18*FLOOR(R$20,0.05)*0.9*R$35*R$38*o_Isol_Bij_Tijdstip($A80,R$8,R$11))+(0.75*T$18*FLOOR(T$20,0.05)*0.9*T$35*T$38*o_Isol_Bij_Tijdstip($A80,R$8,R$11))","v":0},"W",{"$error":"#NAME?"},"W"]
["13:00:00",{"$f":"(0.75*B$18*FLOOR(B$20,0.05)*0.9*B$35*B$38*o_Isol_Bij_Tijdstip($A81,B$8,B$11))+(0.75*D$18*FLOOR(D$20,0.05)*0.9*D$35*D$38*o_Isol_Bij_Tijdstip($A81,B$8,B$11))","v":{"$error":"#NAME?"}},"W",null,null,{"$f":"(0.75*F$18*FLOOR(F$20,0.05)*0.9*F$35*F$38*o_Isol_Bij_Tijdstip($A81,F$8,F$11))+(0.75*H$18*FLOOR(H$20,0.05)*0.9*H$35*H$38*o_Isol_Bij_Tijdstip($A81,F$8,F$11))","v":{"$error":"#NAME?"}},"W",null,null,{"$f":"(0.75*J$18*FLOOR(J$20,0.05)*0.9*J$35*J$38*o_Isol_Bij_Tijdstip($A81,J$8,J$11))+(0.75*L$18*FLOOR(L$20,0.05)*0.9*L$35*L$38*o_Isol_Bij_Tijdstip($A81,J$8,J$11))","v":{"$error":"#NAME?"}},"W",null,null,{"$f":"(0.75*N$18*FLOOR(N$20,0.05)*0.9*N$35*N$38*o_Isol_Bij_Tijdstip($A81,N$8,N$11))+(0.75*P$18*FLOOR(P$20,0.05)*0.9*P$35*P$38*o_Isol_Bij_Tijdstip($A81,N$8,N$11))","v":{"$error":"#NAME?"}},"W",null,null,{"$f":"(0.75*R$18*FLOOR(R$20,0.05)*0.9*R$35*R$38*o_Isol_Bij_Tijdstip($A81,R$8,R$11))+(0.75*T$18*FLOOR(T$20,0.05)*0.9*T$35*T$38*o_Isol_Bij_Tijdstip($A81,R$8,R$11))","v":0},"W",{"$error":"#NAME?"},"W"]
["14:00:00",{"$f":"(0.75*B$18*FLOOR(B$20,0.05)*0.9*B$35*B$38*o_Isol_Bij_Tijdstip($A82,B$8,B$11))+(0.75*D$18*FLOOR(D$20,0.05)*0.9*D$35*D$38*o_Isol_Bij_Tijdstip($A82,B$8,B$11))","v":{"$error":"#NAME?"}},"W",null,null,{"$f":"(0.75*F$18*FLOOR(F$20,0.05)*0.9*F$35*F$38*o_Isol_Bij_Tijdstip($A82,F$8,F$11))+(0.75*H$18*FLOOR(H$20,0.05)*0.9*H$35*H$38*o_Isol_Bij_Tijdstip($A82,F$8,F$11))","v":{"$error":"#NAME?"}},"W",null,null,{"$f":"(0.75*J$18*FLOOR(J$20,0.05)*0.9*J$35*J$38*o_Isol_Bij_Tijdstip($A82,J$8,J$11))+(0.75*L$18*FLOOR(L$20,0.05)*0.9*L$35*L$38*o_Isol_Bij_Tijdstip($A82,J$8,J$11))","v":{"$error":"#NAME?"}},"W",null,null,{"$f":"(0.75*N$18*FLOOR(N$20,0.05)*0.9*N$35*N$38*o_Isol_Bij_Tijdstip($A82,N$8,N$11))+(0.75*P$18*FLOOR(P$20,0.05)*0.9*P$35*P$38*o_Isol_Bij_Tijdstip($A82,N$8,N$11))","v":{"$error":"#NAME?"}},"W",null,null,{"$f":"(0.75*R$18*FLOOR(R$20,0.05)*0.9*R$35*R$38*o_Isol_Bij_Tijdstip($A82,R$8,R$11))+(0.75*T$18*FLOOR(T$20,0.05)*0.9*T$35*T$38*o_Isol_Bij_Tijdstip($A82,R$8,R$11))","v":0},"W",{"$error":"#NAME?"},"W"]
["15:00:00",{"$f":"(0.75*B$18*FLOOR(B$20,0.05)*0.9*B$35*B$38*o_Isol_Bij_Tijdstip($A83,B$8,B$11))+(0.75*D$18*FLOOR(D$20,0.05)*0.9*D$35*D$38*o_Isol_Bij_Tijdstip($A83,B$8,B$11))","v":{"$error":"#NAME?"}},"W",null,null,{"$f":"(0.75*F$18*FLOOR(F$20,0.05)*0.9*F$35*F$38*o_Isol_Bij_Tijdstip($A83,F$8,F$11))+(0.75*H$18*FLOOR(H$20,0.05)*0.9*H$35*H$38*o_Isol_Bij_Tijdstip($A83,F$8,F$11))","v":{"$error":"#NAME?"}},"W",null,null,{"$f":"(0.75*J$18*FLOOR(J$20,0.05)*0.9*J$35*J$38*o_Isol_Bij_Tijdstip($A83,J$8,J$11))+(0.75*L$18*FLOOR(L$20,0.05)*0.9*L$35*L$38*o_Isol_Bij_Tijdstip($A83,J$8,J$11))","v":{"$error":"#NAME?"}},"W",null,null,{"$f":"(0.75*N$18*FLOOR(N$20,0.05)*0.9*N$35*N$38*o_Isol_Bij_Tijdstip($A83,N$8,N$11))+(0.75*P$18*FLOOR(P$20,0.05)*0.9*P$35*P$38*o_Isol_Bij_Tijdstip($A83,N$8,N$11))","v":{"$error":"#NAME?"}},"W",null,null,{"$f":"(0.75*R$18*FLOOR(R$20,0.05)*0.9*R$35*R$38*o_Isol_Bij_Tijdstip($A83,R$8,R$11))+(0.75*T$18*FLOOR(T$20,0.05)*0.9*T$35*T$38*o_Isol_Bij_Tijdstip($A83,R$8,R$11))","v":0},"W",{"$error":"#NAME?"},"W"]
["16:00:00",{"$f":"(0.75*B$18*FLOOR(B$20,0.05)*0.9*B$35*B$38*o_Isol_Bij_Tijdstip($A84,B$8,B$11))+(0.75*D$18*FLOOR(D$20,0.05)*0.9*D$35*D$38*o_Isol_Bij_Tijdstip($A84,B$8,B$11))","v":{"$error":"#NAME?"}},"W",null,null,{"$f":"(0.75*F$18*FLOOR(F$20,0.05)*0.9*F$35*F$38*o_Isol_Bij_Tijdstip($A84,F$8,F$11))+(0.75*H$18*FLOOR(H$20,0.05)*0.9*H$35*H$38*o_Isol_Bij_Tijdstip($A84,F$8,F$11))","v":{"$error":"#NAME?"}},"W",null,null,{"$f":"(0.75*J$18*FLOOR(J$20,0.05)*0.9*J$35*J$38*o_Isol_Bij_Tijdstip($A84,J$8,J$11))+(0.75*L$18*FLOOR(L$20,0.05)*0.9*L$35*L$38*o_Isol_Bij_Tijdstip($A84,J$8,J$11))","v":{"$error":"#NAME?"}},"W",null,null,{"$f":"(0.75*N$18*FLOOR(N$20,0.05)*0.9*N$35*N$38*o_Isol_Bij_Tijdstip($A84,N$8,N$11))+(0.75*P$18*FLOOR(P$20,0.05)*0.9*P$35*P$38*o_Isol_Bij_Tijdstip($A84,N$8,N$11))","v":{"$error":"#NAME?"}},"W",null,null,{"$f":"(0.75*R$18*FLOOR(R$20,0.05)*0.9*R$35*R$38*o_Isol_Bij_Tijdstip($A84,R$8,R$11))+(0.75*T$18*FLOOR(T$20,0.05)*0.9*T$35*T$38*o_Isol_Bij_Tijdstip($A84,R$8,R$11))","v":0},"W",{"$error":"#NAME?"},"W"]
["17:00:00",{"$f":"(0.75*B$18*FLOOR(B$20,0.05)*0.9*B$35*B$38*o_Isol_Bij_Tijdstip($A85,B$8,B$11))+(0.75*D$18*FLOOR(D$20,0.05)*0.9*D$35*D$38*o_Isol_Bij_Tijdstip($A85,B$8,B$11))","v":{"$error":"#NAME?"}},"W",null,null,{"$f":"(0.75*F$18*FLOOR(F$20,0.05)*0.9*F$35*F$38*o_Isol_Bij_Tijdstip($A85,F$8,F$11))+(0.75*H$18*FLOOR(H$20,0.05)*0.9*H$35*H$38*o_Isol_Bij_Tijdstip($A85,F$8,F$11))","v":{"$error":"#NAME?"}},"W",null,null,{"$f":"(0.75*J$18*FLOOR(J$20,0.05)*0.9*J$35*J$38*o_Isol_Bij_Tijdstip($A85,J$8,J$11))+(0.75*L$18*FLOOR(L$20,0.05)*0.9*L$35*L$38*o_Isol_Bij_Tijdstip($A85,J$8,J$11))","v":{"$error":"#NAME?"}},"W",null,null,{"$f":"(0.75*N$18*FLOOR(N$20,0.05)*0.9*N$35*N$38*o_Isol_Bij_Tijdstip($A85,N$8,N$11))+(0.75*P$18*FLOOR(P$20,0.05)*0.9*P$35*P$38*o_Isol_Bij_Tijdstip($A85,N$8,N$11))","v":{"$error":"#NAME?"}},"W",null,null,{"$f":"(0.75*R$18*FLOOR(R$20,0.05)*0.9*R$35*R$38*o_Isol_Bij_Tijdstip($A85,R$8,R$11))+(0.75*T$18*FLOOR(T$20,0.05)*0.9*T$35*T$38*o_Isol_Bij_Tijdstip($A85,R$8,R$11))","v":0},"W",{"$error":"#NAME?"},"W"]
["18:00:00",{"$f":"(0.75*B$18*FLOOR(B$20,0.05)*0.9*B$35*B$38*o_Isol_Bij_Tijdstip($A86,B$8,B$11))+(0.75*D$18*FLOOR(D$20,0.05)*0.9*D$35*D$38*o_Isol_Bij_Tijdstip($A86,B$8,B$11))","v":{"$error":"#NAME?"}},"W",null,null,{"$f":"(0.75*F$18*FLOOR(F$20,0.05)*0.9*F$35*F$38*o_Isol_Bij_Tijdstip($A86,F$8,F$11))+(0.75*H$18*FLOOR(H$20,0.05)*0.9*H$35*H$38*o_Isol_Bij_Tijdstip($A86,F$8,F$11))","v":{"$error":"#NAME?"}},"W",null,null,{"$f":"(0.75*J$18*FLOOR(J$20,0.05)*0.9*J$35*J$38*o_Isol_Bij_Tijdstip($A86,J$8,J$11))+(0.75*L$18*FLOOR(L$20,0.05)*0.9*L$35*L$38*o_Isol_Bij_Tijdstip($A86,J$8,J$11))","v":{"$error":"#NAME?"}},"W",null,null,{"$f":"(0.75*N$18*FLOOR(N$20,0.05)*0.9*N$35*N$38*o_Isol_Bij_Tijdstip($A86,N$8,N$11))+(0.75*P$18*FLOOR(P$20,0.05)*0.9*P$35*P$38*o_Isol_Bij_Tijdstip($A86,N$8,N$11))","v":{"$error":"#NAME?"}},"W",null,null,{"$f":"(0.75*R$18*FLOOR(R$20,0.05)*0.9*R$35*R$38*o_Isol_Bij_Tijdstip($A86,R$8,R$11))+(0.75*T$18*FLOOR(T$20,0.05)*0.9*T$35*T$38*o_Isol_Bij_Tijdstip($A86,R$8,R$11))","v":0},"W",{"$error":"#NAME?"},"W"]
[]
["Maatgevende tijdstip",{"$f":"IF(MAX(T77:T86)=0,\"Geen glas aanwezig\",_xlfn.XLOOKUP(MAX(T77:T86),T77:T86,A77:A86,\"nvt\"))","v":{"$error":"#NAME?"}}]

{"sheet":"Ruimte 6","index":8,"n_rows":88,"n_cols":21,"rows_kept":88,"cut":false,"hidden":false,"merged":[[70,0,71,20],[0,0,0,20],[6,1,6,3],[6,5,6,7],[6,9,6,11],[6,13,6,15],[6,17,6,20],[41,1,41,3],[41,5,41,7],[41,9,41,11],[41,13,41,15],[41,17,41,19],[40,1,40,3],[40,5,40,7],[40,9,40,11],[40,13,40,15],[40,17,40,19],[55,1,55,3],[55,5,55,7],[55,9,55,11],[55,13,55,15],[55,17,55,19],[54,1,54,3],[54,5,54,7],[54,9,54,11],[54,13,54,15],[54,17,54,19],[56,5,56,7],[56,9,56,11],[56,13,56,15],[56,17,56,19],[57,1,57,3],[57,5,57,7],[57,9,57,11],[57,13,57,15],[57,17,57,19],[59,1,59,3],[60,1,60,3],[62,1,62,3],[63,1,63,3],[56,1,56,3]]}
["RUIMTE 6"]
[]
["Ruimtenaam",6]
["Type verblijfsruimte","Andere verblijfsruimte"]
["Vloeroppervlak verblijfsruimte Avr  (gebruiksoppervlak)",0,"m²"]
[]
[null,"Voorzijde woning",null,null,null,"Linker zijde woning",null,null,null,"Achterzijde woning",null,null,null,"Rechter zijde woning",null,null,null,"Platdak"]
["Orientatie gevel / dakvlak (Helling > 15°C)",{"$f":"'Projectgegevens en Resultaten'!$B$17","v":0},null,null,null,{"$f":"o_Orientatie(F9)","v":{"$error":"#NAME?"}},null,null,null,{"$f":"o_Orientatie(J9)","v":{"$error":"#NAME?"}},null,null,null,{"$f":"o_Orientatie(N9)","v":{"$error":"#NAME?"}},null,null,null,"Horizontaal"]
["Orientatiehoek gevel Ƴ",{"$f":"o_OrientatiehOEK(B8)","v":{"$error":"#NAME?"}},null,null,null,{"$f":"IF(B9+90>360,B9+90-360,B9+90)","v":{"$error":"#NAME?"}},null,null,null,{"$f":"IF(F9+90>360,F9+90-360,F9+90)","v":{"$error":"#NAME?"}},null,null,null,{"$f":"IF(J9+90>360,J9+90-360,J9+90)","v":{"$error":"#NAME?"}}]
["Grenst aan buitenlucht ja of nee","Nee",null,null,null,"Nee",null,null,null,"Nee",null,null,null,"Nee",null,null,null,"Nee"]
["Hellingshoek constructie ≥ 15° = hellenddak 90° = gevel",90,"°",null,null,90,"°",null,null,90,"°",null,null,90,"°",null,null,0,"°"]
["Type constructie",{"$f":"o_TypeConstructie(B10,B11)","v":"Woningscheidend"},null,null,null,{"$f":"o_TypeConstructie(F10,F11)","v":"Woningscheidend"},null,null,null,{"$f":"o_TypeConstructie(J10,J11)","v":"Woningscheidend"},null,null,null,{"$f":"o_TypeConstructie(N10,N11)","v":"Woningscheidend"},null,null,null,{"$f":"o_TypeConstructie(R10,R11)","v":"Woningscheidend"}]
["Gevel lengte (binnenwerks)",null,"m",null,null,null,"m",null,null,null,"m",null,null,null,"m",null,null,null,"m"]
["Gevel hoogte / Dak breedte (binnenwerks)",null,"m",null,null,null,"m",null,null,null,"m",null,null,null,"m",null,null,null,"m"]
["Constructie oppervlak (binnenwerks)",{"$f":"B13*B14","v":0},"m²",null,null,{"$f":"F13*F14","v":0},"m²",null,null,{"$f":"J13*J14","v":0},"m²",null,null,{"$f":"N13*N14","v":0},"m²",null,null,{"$f":"R13*R14","v":0},"m²"]
["Gesloten constructie oppervlak",{"$f":"MAX(0,B15-B18-D18)","v":0},"m²",null,null,{"$f":"MAX(0,F15-F18-H18)","v":0},"m²",null,null,{"$f":"MAX(0,J15-J18-L18)","v":0},"m²",null,null,{"$f":"MAX(0,N15-N18-P18)","v":0},"m²",null,null,{"$f":"MAX(0,R15-R18-T18)","v":0},"m²"]
[null,"Glasvlak type 1",null,"Glasvlak type 2",null,"Glasvlak type 1",null,"Glasvlak type 2",null,"Glasvlak type 1",null,"Glasvlak type 2",null,"Glasvlak type 1",null,"Glasvlak type 2",null,"Glasvlak type 1",null,"Glasvlak type 2"]
["Totaal oppervlak van raamtype Aw,k (inclusief kozijn)",null,"m²",null,"m²",null,"m²",null,"m²",null,"m²",null,"m²",null,"m²",null,"m²",null,"m²",null,"m²"]
["Warmtedoorgangscoefficient (U-waarde) van het raam Uw;wi;k",null,"W/m².K",null,"W/m².K",null,"W/m².K",null,"W/m².K",null,"W/m².K",null,"W/m².K",null,"W/m².K",null,"W/m².K",null,"W/m².K",null,"W/m².K"]
["Zontoetredingsfactor (g_waarde) van het glas Ggl;n;wi;k;C;juli",1,null,1,null,1,null,1,null,1,null,1,null,1,null,1,null,1,null,1]
["Beschaduwing situatie bij het raamtype","Minimale belemmering",null,"Minimale belemmering",null,"Minimale belemmering",null,"Minimale belemmering",null,"Minimale belemmering",null,"Minimale belemmering",null,"Minimale belemmering",null,"Minimale belemmering",null,"Minimale belemmering",null,"Minimale belemmering"]
[]
[null,"Overstek",null,"Overstek",null,"Overstek",null,"Overstek",null,"Overstek",null,"Overstek",null,"Overstek",null,"Overstek"]
["Hoogte verschil midden raam onderzijde overstek",0,"m",0,"m",0,"m",0,"m",0,"m",0,"m",0,"m",0,"m",0,null,0,"m"]
["Horizontale afstand glas tot eindpunt overstek",0,"m",0,"m",0,"m",0,"m",0,"m",0,"m",0,"m",0,"m",0,null,0,"m"]
["Overstekhoek",{"$f":"IFERROR(180/PI()*ATAN(B24/B25),0)","v":0},"°",{"$f":"IFERROR(180/PI()*ATAN(D24/D25),0)","v":0},"°",{"$f":"IFERROR(180/PI()*ATAN(F24/F25),0)","v":0},"°",{"$f":"IFERROR(180/PI()*ATAN(H24/H25),0)","v":0},"°",{"$f":"IFERROR(180/PI()*ATAN(J24/J25),0)","v":0},"°",{"$f":"IFERROR(180/PI()*ATAN(L24/L25),0)","v":0},"°",{"$f":"IFERROR(180/PI()*ATAN(N24/N25),0)","v":0},"°",{"$f":"IFERROR(180/PI()*ATAN(P24/P25),0)","v":0},"°",null,null,null,"°"]
["Relatieve hoogte van overstek",{"$f":"IFERROR(B24/B25,1)","v":1},null,{"$f":"IFERROR(D24/D25,1)","v":1},null,{"$f":"IFERROR(F24/F25,1)","v":1},null,{"$f":"IFERROR(H24/H25,1)","v":1},null,{"$f":"IFERROR(J24/J25,1)","v":1},null,{"$f":"IFERROR(L24/L25,1)","v":1},null,{"$f":"IFERROR(N24/N25,1)","v":1},null,{"$f":"IFERROR(P24/P25,1)","v":1}]
[]
[null,"Zijbelemmering",null,"Zijbelemmering",null,"Zijbelemmering",null,"Zijbelemmering",null,"Zijbelemmering",null,"Zijbelemmering",null,"Zijbelemmering",null,"Zijbelemmering"]
["Positie zijbelemmering irt zichtveld (naar buitengericht)","Links",null,"Links",null,"Links",null,"Links",null,"Links",null,"Links",null,"Links",null,"Links",null,"Links",null,"Links"]
["Horizontale afstand midden raam verste punt belemmering",0,"m",0,"m",0,"m",0,"m",0,"m",0,"m",0,"m",0,"m",0,null,0,"m"]
["Horizontale breedte glas tot eindpunt belemmering",0,"m",0,"m",0,"m",0,"m",0,"m",0,"m",0,"m",0,"m",0,null,0,"m"]
["Relatieve breedte van de zijbelemmering bb",{"$f":"IFERROR(B31/B32,999)","v":999},null,{"$f":"IFERROR(D31/D32,999)","v":999},null,{"$f":"IFERROR(F31/F32,999)","v":999},null,{"$f":"IFERROR(H31/H32,999)","v":999},null,{"$f":"IFERROR(J31/J32,999)","v":999},null,{"$f":"IFERROR(L31/L32,999)","v":999},null,{"$f":"IFERROR(N31/N32,999)","v":999},null,{"$f":"IFERROR(P31/P32,999)","v":999}]
[]
["De beschaduwingsreductiefactor Fsh;obst;wi;k;juli",{"$f":"IFERROR(o_Beschaduwingreductie(B21,B8,B27,B30,B33,B11),1)","v":1},null,{"$f":"IFERROR(o_Beschaduwingreductie(D21,B8,D27,D30,D33,B11),1)","v":1},null,{"$f":"IFERROR(o_Beschaduwingreductie(F21,F8,F27,F30,F33,F11),1)","v":1},null,{"$f":"IFERROR(o_Beschaduwingreductie(H21,F8,H27,H30,H33,F11),1)","v":1},null,{"$f":"IFERROR(o_Beschaduwingreductie(J21,J8,J27,J30,J33,J11),1)","v":1},null,{"$f":"IFERROR(o_Beschaduwingreductie(L21,J8,L27,L30,L33,J11),1)","v":1},null,{"$f":"IFERROR(o_Beschaduwingreductie(N21,N8,N27,N30,N33,N11),1)","v":1},null,{"$f":"IFERROR(o_Beschaduwingreductie(P21,N8,P27,P30,P33,N11),1)","v":1},null,{"$f":"o_Beschaduwingreductie(R21,R8,R27,R30,R33,R11)","v":1},null,{"$f":"o_Beschaduwingreductie(T21,R8,T27,T30,T33,R11)","v":1}]
[]
["Type zonwering","Geen zonwering",null,"Geen zonwering",null,"Geen zonwering",null,"Geen zonwering",null,"Geen zonwering",null,"Geen zonwering",null,"Geen zonwering",null,"Geen zonwering",null,"Geen zonwering",null,"Geen zonwering"]
["De reductiefactor voor zonwering Fc;wi;k",{"$f":"o_Zonweringreductie(B37,B8)","v":{"$error":"#NAME?"}},null,{"$f":"o_Zonweringreductie(D37,B8)","v":{"$error":"#NAME?"}},null,{"$f":"o_Zonweringreductie(F37,F8)","v":{"$error":"#NAME?"}},null,{"$f":"o_Zonweringreductie(H37,F8)","v":{"$error":"#NAME?"}},null,{"$f":"o_Zonweringreductie(J37,J8)","v":{"$error":"#NAME?"}},null,{"$f":"o_Zonweringreductie(L37,J8)","v":{"$error":"#NAME?"}},null,{"$f":"o_Zonweringreductie(N37,N8)","v":{"$error":"#NAME?"}},null,{"$f":"o_Zonweringreductie(P37,N8)","v":{"$error":"#NAME?"}},null,{"$f":"o_Zonweringreductie(R37,R8)","v":1},null,{"$f":"o_Zonweringreductie(T37,R8)","v":1}]
["Totaal opvallende zonnestraling van het raam Isol;wi;k;juli",{"$f":"IF(B10=\"Nee\",0,o_Isol_Bij_Tijdstip($B$52,B8,B11))","v":0},"W/m²",{"$f":"IF(B10=\"Nee\",0,o_Isol_Bij_Tijdstip($B$52,B8,B11))","v":0},"W/m²",{"$f":"IF(F10=\"Nee\",0,o_Isol_Bij_Tijdstip($B$52,F8,F11))","v":0},"W/m²",{"$f":"IF(F10=\"Nee\",0,o_Isol_Bij_Tijdstip($B$52,F8,F11))","v":0},"W/m²",{"$f":"IF(J10=\"Nee\",0,o_Isol_Bij_Tijdstip($B$52,J8,J11))","v":0},"W/m²",{"$f":"IF(J10=\"Nee\",0,o_Isol_Bij_Tijdstip($B$52,J8,J11))","v":0},"W/m²",{"$f":"IF(N10=\"Nee\",0,o_Isol_Bij_Tijdstip($B$52,N8,N11))","v":0},"W/m²",{"$f":"IF(N10=\"Nee\",0,o_Isol_Bij_Tijdstip($B$52,N8,N11))","v":0},"W/m²",{"$f":"IF(R10=\"Nee\",0,o_Isol_Bij_Tijdstip($B$52,R8,R11))","v":0},"W/m²",{"$f":"IF(R10=\"Nee\",0,o_Isol_Bij_Tijdstip($B$52,R8,R11))","v":0},"W/m²"]
[]
["Tijdstip maximale koellastbijdrage tmax;zi",{"$f":"VALUE(o_Tijdstip_Isol_Max_Orientatie(B8,B11))","v":{"$error":"#NAME?"}},null,null,null,{"$f":"VALUE(o_Tijdstip_Isol_Max_Orientatie(F8,F11))","v":{"$error":"#NAME?"}},null,null,null,{"$f":"VALUE(o_Tijdstip_Isol_Max_Orientatie(J8,J11))","v":{"$error":"#NAME?"}},null,null,null,{"$f":"VALUE(o_Tijdstip_Isol_Max_Orientatie(N8,N11))","v":{"$error":"#NAME?"}},null,null,null,{"$f":"o_Tijdstip_Isol_Max_Orientatie(R8,R11)","v":"12:00:00 PM"}]
["Buitenluchttemperatuur op tijdstip max koellast Θe",{"$f":"o_maxTemp(VALUE(B41))","v":{"$error":"#NAME?"}},null,null,"°C",{"$f":"o_maxTemp(VALUE(F41))","v":{"$error":"#NAME?"}},null,null,"°C",{"$f":"o_maxTemp(VALUE(J41))","v":{"$error":"#NAME?"}},null,null,"°C",{"$f":"o_maxTemp(VALUE(N41))","v":{"$error":"#NAME?"}},null,null,"°C",{"$f":"o_maxTemp(VALUE(R41))","v":29.5}]
[]
["Glasopppervlak",{"$f":"IF(B10=\"Ja\",B18+D18,0)","v":0},"m²",null,null,{"$f":"IF(F10=\"Ja\",F18+H18,0)","v":0},"m²",null,null,{"$f":"IF(J10=\"Ja\",J18+L18,0)","v":0},"m²",null,null,{"$f":"IF(N10=\"Ja\",N18+P18,0)","v":0},"m²",null,null,{"$f":"IF(R10=\"Ja\",R18+T18,0)","v":0},"m²"]
["Uitwendigescheidingsconstructie niet op Noord?",{"$f":"IF(B10=\"Ja\",IF(B8=\"Noord\",FALSE,TRUE),FALSE)","v":false},null,null,null,{"$f":"IF(F10=\"Ja\",IF(F8=\"Noord\",FALSE,TRUE),FALSE)","v":false},null,null,null,{"$f":"IF(J10=\"Ja\",IF(J8=\"Noord\",FALSE,TRUE),FALSE)","v":false},null,null,null,{"$f":"IF(N10=\"Ja\",IF(N8=\"Noord\",FALSE,TRUE),FALSE)","v":false},null,null,null,{"$f":"IF(R10=\"Ja\",IF(R8=\"Noord\",FALSE,TRUE),FALSE)","v":false}]
["De enige uitwendigescheidingscontructie?",{"$f":"IF(AND(B45=TRUE,COUNTIF($B$45:$R$45,TRUE)=1),TRUE,FALSE)","v":false},null,null,null,{"$f":"IF(AND(F45=TRUE,COUNTIF($B$45:$R$45,TRUE)=1),TRUE,FALSE)","v":false},null,null,null,{"$f":"IF(AND(J45=TRUE,COUNTIF($B$45:$R$45,TRUE)=1),TRUE,FALSE)","v":false},null,null,null,{"$f":"IF(AND(N45=TRUE,COUNTIF($B$45:$R$45,TRUE)=1),TRUE,FALSE)","v":false},null,null,null,{"$f":"IF(AND(R45=TRUE,COUNTIF($B$45:$R$45,TRUE)=1),TRUE,FALSE)","v":false}]
["Totaal glasoppervlak",{"$f":"IF(B8<>\"Noord\",B44,0)","v":0},"m²",null,null,{"$f":"IF(F8<>\"Noord\",F44,0)","v":{"$error":"#NAME?"}},"m²",null,null,{"$f":"IF(J8<>\"Noord\",J44,0)","v":{"$error":"#NAME?"}},"m²",null,null,{"$f":"IF(N8<>\"Noord\",N44,0)","v":{"$error":"#NAME?"}},"m²",null,null,{"$f":"R44","v":0},"m²"]
["Grootste glasoppervlak ",{"$f":"IF(AND(B45,B47=MAX($B$47:$R$47)),TRUE,FALSE)","v":{"$error":"#NAME?"}},null,null,null,{"$f":"IF(AND(F45,F47=MAX($B$47:$R$47)),TRUE,FALSE)","v":{"$error":"#NAME?"}},null,null,null,{"$f":"IF(AND(J45,J47=MAX($B$47:$R$47)),TRUE,FALSE)","v":{"$error":"#NAME?"}},null,null,null,{"$f":"IF(AND(N45,N47=MAX($B$47:$R$47)),TRUE,FALSE)","v":{"$error":"#NAME?"}},null,null,null,{"$f":"IF(AND(R45,R47=MAX($B$47:$R$47)),TRUE,FALSE)","v":{"$error":"#NAME?"}}]
["Dakvlak maatgevend?",{"$f":"IF(AND(B11<90,B15>3*(B18+D18),'Projectgegevens en Resultaten'!#REF!<65),TRUE,FALSE)","v":{"$error":"#REF!"}},null,null,null,{"$f":"IF(AND(F11<90,F15>3*(F18+H18),'Projectgegevens en Resultaten'!#REF!<65),TRUE,FALSE)","v":{"$error":"#REF!"}},null,null,null,{"$f":"IF(AND(J11<90,J15>3*(J18+L18),'Projectgegevens en Resultaten'!#REF!<65),TRUE,FALSE)","v":{"$error":"#REF!"}},null,null,null,{"$f":"IF(AND(N11<90,N15>3*(N18+P18),'Projectgegevens en Resultaten'!#REF!<65),TRUE,FALSE)","v":{"$error":"#REF!"}},null,null,null,{"$f":"IF(AND(R11<90,R15>3*(R18+T18),'Projectgegevens en Resultaten'!#REF!<65),TRUE,FALSE)","v":{"$error":"#REF!"}}]
["is er een maatgevend dakoppervlak",{"$f":"IF(COUNTIF($B$49:$R$49,TRUE)>0,TRUE,FALSE)","v":false},null,null,null,{"$f":"IF(COUNTIF($B$49:$R$49,TRUE)>0,TRUE,FALSE)","v":false},null,null,null,{"$f":"IF(COUNTIF($B$49:$R$49,TRUE)>0,TRUE,FALSE)","v":false},null,null,null,{"$f":"IF(COUNTIF($B$49:$R$49,TRUE)>0,TRUE,FALSE)","v":false},null,null,null,{"$f":"IF(COUNTIF($B$49:$R$49,TRUE)>0,TRUE,FALSE)","v":false}]
["Maatgevende tijdstip",{"$f":"IF(OR(B46,AND(B45,B50,B49),AND(B45,B48,NOT(B50))),B41)","v":{"$error":"#REF!"}},null,null,null,{"$f":"IF(OR(F46,AND(F45,F50,F49),AND(F45,F48,NOT(F50))),F41)","v":{"$error":"#REF!"}},null,null,null,{"$f":"IF(OR(J46,AND(J45,J50,J49),AND(J45,J48,NOT(J50))),J41)","v":{"$error":"#REF!"}},null,null,null,{"$f":"IF(OR(N46,AND(N45,N50,N49),AND(N45,N48,NOT(N50))),N41)","v":{"$error":"#REF!"}},null,null,null,{"$f":"IF(OR(R46,AND(R45,R50,R49),AND(R45,R48,NOT(R50))),R41)","v":{"$error":"#REF!"}}]
["Maatgevende tijdstip tmax;zi",{"$f":"IFERROR(B88,\"geen glas ingevoerd\")","v":"geen glas ingevoerd"}]
["Buitenluchttemperatuur op tijdstip max koellast Θe",{"$f":"o_maxTemp(VALUE(B52))","v":{"$error":"#NAME?"}},"°C"]
[]
["Koellastbijdrage transmissie ondoorzichtige delen Ptr;ntr;vr;zi",{"$f":"IF(B10=\"Nee\",0,B16*'Projectgegevens en Resultaten'!$B$16)","v":0},null,null,"W",{"$f":"IF(F10=\"Nee\",0,F16*'Projectgegevens en Resultaten'!$B$16)","v":0},null,null,"W",{"$f":"IF(J10=\"Nee\",0,J16*'Projectgegevens en Resultaten'!$B$16)","v":0},null,null,"W",{"$f":"IF(N10=\"Nee\",0,N16*'Projectgegevens en Resultaten'!$B$16)","v":0},null,null,"W",{"$f":"IF(R10=\"Nee\",0,R16*'Projectgegevens en Resultaten'!$B$16)","v":0},null,null,"W"]
["Koellastbijdrage zoninstraling transparante delen Psol;vr;zi",{"$f":"(0.75*B18*FLOOR(B20,0.05)*0.9*B35*B38*B39)+(0.75*D18*FLOOR(D20,0.05)*0.9*D35*D38*D39)","v":{"$error":"#NAME?"}},null,null,"W",{"$f":"(0.75*F18*FLOOR(F20,0.05)*0.9*F35*F38*F39)+(0.75*H18*FLOOR(H20,0.05)*0.9*H35*H38*H39)","v":{"$error":"#NAME?"}},null,null,"W",{"$f":"(0.75*J18*FLOOR(J20,0.05)*0.9*J35*J38*J39)+(0.75*L18*FLOOR(L20,0.05)*0.9*L35*L38*L39)","v":{"$error":"#NAME?"}},null,null,"W",{"$f":"(0.75*N18*FLOOR(N20,0.05)*0.9*N35*N38*N39)+(0.75*P18*FLOOR(P20,0.05)*0.9*P35*P38*P39)","v":{"$error":"#NAME?"}},null,null,"W",{"$f":"(0.75*R18*FLOOR(R20,0.05)*0.9*R35*R38*R39)+(0.75*T18*FLOOR(T20,0.05)*0.9*T35*T38*T39)","v":0},null,null,"W"]
["Koellastbijdrage transmissie transparante delen Ptr;gl;vr;zi",{"$f":"IF(B10=\"Nee\",0,IFERROR(B18*B19*($B$53-24),0)+IFERROR(D18*D19*($B$53-24),0))","v":0},null,null,"W",{"$f":"IF(F10=\"Nee\",0,IFERROR(F18*F19*($B$53-24),0)+IFERROR(H18*H19*($B$53-24),0))","v":0},null,null,"W",{"$f":"IF(J10=\"Nee\",0,IFERROR(J18*J19*($B$53-24),0)+IFERROR(L18*L19*($B$53-24),0))","v":0},null,null,"W",{"$f":"IF(N10=\"Nee\",0,IFERROR(N18*N19*($B$53-24),0)+IFERROR(P18*P19*($B$53-24),0))","v":0},null,null,"W",{"$f":"IF(R10=\"Nee\",0,IFERROR(R18*R19*($B$53-24),0)+IFERROR(T18*T19*($B$53-24),0))","v":0},null,null,"W"]
["Totaal koellastbijdrage per gevel",{"$f":"SUM(B55:D57)","v":{"$error":"#NAME?"}},null,null,"W",{"$f":"SUM(F55:H57)","v":{"$error":"#NAME?"}},null,null,"W",{"$f":"SUM(J55:L57)","v":{"$error":"#NAME?"}},null,null,"W",{"$f":"SUM(N55:P57)","v":{"$error":"#NAME?"}},null,null,"W",{"$f":"SUM(R55:R57)","v":0},null,null,"W"]
[]
["Koellast door interne warmtelast Pint;calc;woon/overig;zi",{"$f":"IF(B5=0,0,IF(B4=\"Woonvertrek\",2*'Projectgegevens en Resultaten'!$B$33*B5,'Projectgegevens en Resultaten'!$B$33*B5))","v":0},null,null,"W"]
["Koellast door buitenluchttoetreding Pv;calc;vr;zi",{"$f":"IFERROR(MAX((SUM('Projectgegevens en Resultaten'!$B$21:$B$23)/3600*1.205*1005*(B53-24))/SUM('Projectgegevens en Resultaten'!$B$40:$T$40)*B5,0),0)","v":0},{"$f":"IFERROR(MAX(SUM(C57:C59)/3600*1.205*1005*(C60-24),0),0)","v":0},{"$f":"IFERROR(MAX(SUM(D57:D59)/3600*1.205*1005*(D60-24),0),0)","v":0},"W"]
[]
["Totaal koellastbijdrage",{"$f":"IFERROR(SUM(B58:T58)+B60+B61,0)","v":0},null,null,"W"]
["Koelbehoefte verblijfsruimte",{"$f":"IFERROR(B63/B5,0)","v":0},null,null,"W/m²"]
[]
[]
[]
[]
[]
[]
["Onderstaande tabellen worden verborgen in de uiteindelijke versie. De tabellen dienen om vast te stellen welk tijdstip tot de hoogste zonbelasting leidt"]
[]
["Isol max voor de orientatie",{"$f":"o_Isol_Max_Orientatie(B8,B11)","v":{"$error":"#NAME?"}},"W/m²",null,null,{"$f":"o_Isol_Max_Orientatie(F8,F11)","v":{"$error":"#NAME?"}},"W/m²",null,null,{"$f":"o_Isol_Max_Orientatie(J8,J11)","v":{"$error":"#NAME?"}},"W/m²",null,null,{"$f":"o_Isol_Max_Orientatie(N8,N11)","v":{"$error":"#NAME?"}},"W/m²",null,null,{"$f":"o_Isol_Max_Orientatie(R8,R11)","v":914.11856204111336},"W/m²"]
["Tijdstip bij Isol max bij orientatie",{"$f":"VALUE(o_Tijdstip_Isol_Max_Orientatie(B8,B11))","v":{"$error":"#NAME?"}},null,null,null,{"$f":"VALUE(o_Tijdstip_Isol_Max_Orientatie(F8,F11))","v":{"$error":"#NAME?"}},null,null,null,{"$f":"VALUE(o_Tijdstip_Isol_Max_Orientatie(J8,J11))","v":{"$error":"#NAME?"}},null,null,null,{"$f":"VALUE(o_Tijdstip_Isol_Max_Orientatie(N8,N11))","v":{"$error":"#NAME?"}},null,null,null,{"$f":"VALUE(o_Tijdstip_Isol_Max_Orientatie(R8,R11))","v":"12:00:00"}]
[]
["Koellastbijdrage zoninstraling transparante delen Psol;vr;zi"]
["09:00:00",{"$f":"(0.75*B$18*FLOOR(B$20,0.05)*0.9*B$35*B$38*o_Isol_Bij_Tijdstip($A77,B$8,B$11))+(0.75*D$18*FLOOR(D$20,0.05)*0.9*D$35*D$38*o_Isol_Bij_Tijdstip($A77,B$8,B$11))","v":{"$error":"#NAME?"}},"W",null,null,{"$f":"(0.75*F$18*FLOOR(F$20,0.05)*0.9*F$35*F$38*o_Isol_Bij_Tijdstip($A77,F$8,F$11))+(0.75*H$18*FLOOR(H$20,0.05)*0.9*H$35*H$38*o_Isol_Bij_Tijdstip($A77,F$8,F$11))","v":{"$error":"#NAME?"}},"W",null,null,{"$f":"(0.75*J$18*FLOOR(J$20,0.05)*0.9*J$35*J$38*o_Isol_Bij_Tijdstip($A77,J$8,J$11))+(0.75*L$18*FLOOR(L$20,0.05)*0.9*L$35*L$38*o_Isol_Bij_Tijdstip($A77,J$8,J$11))","v":{"$error":"#NAME?"}},"W",null,null,{"$f":"(0.75*N$18*FLOOR(N$20,0.05)*0.9*N$35*N$38*o_Isol_Bij_Tijdstip($A77,N$8,N$11))+(0.75*P$18*FLOOR(P$20,0.05)*0.9*P$35*P$38*o_Isol_Bij_Tijdstip($A77,N$8,N$11))","v":{"$error":"#NAME?"}},"W",null,null,{"$f":"(0.75*R$18*FLOOR(R$20,0.05)*0.9*R$35*R$38*o_Isol_Bij_Tijdstip($A77,R$8,R$11))+(0.75*T$18*FLOOR(T$20,0.05)*0.9*T$35*T$38*o_Isol_Bij_Tijdstip($A77,R$8,R$11))","v":0},"W",{"$f":"B77+F77+J77+N77+R77","v":{"$error":"#NAME?"}},"W"]
["10:00:00",{"$f":"(0.75*B$18*FLOOR(B$20,0.05)*0.9*B$35*B$38*o_Isol_Bij_Tijdstip($A78,B$8,B$11))+(0.75*D$18*FLOOR(D$20,0.05)*0.9*D$35*D$38*o_Isol_Bij_Tijdstip($A78,B$8,B$11))","v":{"$error":"#NAME?"}},"W",null,null,{"$f":"(0.75*F$18*FLOOR(F$20,0.05)*0.9*F$35*F$38*o_Isol_Bij_Tijdstip($A78,F$8,F$11))+(0.75*H$18*FLOOR(H$20,0.05)*0.9*H$35*H$38*o_Isol_Bij_Tijdstip($A78,F$8,F$11))","v":{"$error":"#NAME?"}},"W",null,null,{"$f":"(0.75*J$18*FLOOR(J$20,0.05)*0.9*J$35*J$38*o_Isol_Bij_Tijdstip($A78,J$8,J$11))+(0.75*L$18*FLOOR(L$20,0.05)*0.9*L$35*L$38*o_Isol_Bij_Tijdstip($A78,J$8,J$11))","v":{"$error":"#NAME?"}},"W",null,null,{"$f":"(0.75*N$18*FLOOR(N$20,0.05)*0.9*N$35*N$38*o_Isol_Bij_Tijdstip($A78,N$8,N$11))+(0.75*P$18*FLOOR(P$20,0.05)*0.9*P$35*P$38*o_Isol_Bij_Tijdstip($A78,N$8,N$11))","v":{"$error":"#NAME?"}},"W",null,null,{"$f":"(0.75*R$18*FLOOR(R$20,0.05)*0.9*R$35*R$38*o_Isol_Bij_Tijdstip($A78,R$8,R$11))+(0.75*T$18*FLOOR(T$20,0.05)*0.9*T$35*T$38*o_Isol_Bij_Tijdstip($A78,R$8,R$11))","v":0},"W",{"$error":"#NAME?"},"W"]
["11:00:00",{"$f":"(0.75*B$18*FLOOR(B$20,0.05)*0.9*B$35*B$38*o_Isol_Bij_Tijdstip($A79,B$8,B$11))+(0.75*D$18*FLOOR(D$20,0.05)*0.9*D$35*D$38*o_Isol_Bij_Tijdstip($A79,B$8,B$11))","v":{"$error":"#NAME?"}},"W",null,null,{"$f":"(0.75*F$18*FLOOR(F$20,0.05)*0.9*F$35*F$38*o_Isol_Bij_Tijdstip($A79,F$8,F$11))+(0.75*H$18*FLOOR(H$20,0.05)*0.9*H$35*H$38*o_Isol_Bij_Tijdstip($A79,F$8,F$11))","v":{"$error":"#NAME?"}},"W",null,null,{"$f":"(0.75*J$18*FLOOR(J$20,0.05)*0.9*J$35*J$38*o_Isol_Bij_Tijdstip($A79,J$8,J$11))+(0.75*L$18*FLOOR(L$20,0.05)*0.9*L$35*L$38*o_Isol_Bij_Tijdstip($A79,J$8,J$11))","v":{"$error":"#NAME?"}},"W",null,null,{"$f":"(0.75*N$18*FLOOR(N$20,0.05)*0.9*N$35*N$38*o_Isol_Bij_Tijdstip($A79,N$8,N$11))+(0.75*P$18*FLOOR(P$20,0.05)*0.9*P$35*P$38*o_Isol_Bij_Tijdstip($A79,N$8,N$11))","v":{"$error":"#NAME?"}},"W",null,null,{"$f":"(0.75*R$18*FLOOR(R$20,0.05)*0.9*R$35*R$38*o_Isol_Bij_Tijdstip($A79,R$8,R$11))+(0.75*T$18*FLOOR(T$20,0.05)*0.9*T$35*T$38*o_Isol_Bij_Tijdstip($A79,R$8,R$11))","v":0},"W",{"$error":"#NAME?"},"W"]
["12:00:00",{"$f":"(0.75*B$18*FLOOR(B$20,0.05)*0.9*B$35*B$38*o_Isol_Bij_Tijdstip($A80,B$8,B$11))+(0.75*D$18*FLOOR(D$20,0.05)*0.9*D$35*D$38*o_Isol_Bij_Tijdstip($A80,B$8,B$11))","v":{"$error":"#NAME?"}},"W",null,null,{"$f":"(0.75*F$18*FLOOR(F$20,0.05)*0.9*F$35*F$38*o_Isol_Bij_Tijdstip($A80,F$8,F$11))+(0.75*H$18*FLOOR(H$20,0.05)*0.9*H$35*H$38*o_Isol_Bij_Tijdstip($A80,F$8,F$11))","v":{"$error":"#NAME?"}},"W",null,null,{"$f":"(0.75*J$18*FLOOR(J$20,0.05)*0.9*J$35*J$38*o_Isol_Bij_Tijdstip($A80,J$8,J$11))+(0.75*L$18*FLOOR(L$20,0.05)*0.9*L$35*L$38*o_Isol_Bij_Tijdstip($A80,J$8,J$11))","v":{"$error":"#NAME?"}},"W",null,null,{"$f":"(0.75*N$18*FLOOR(N$20,0.05)*0.9*N$35*N$38*o_Isol_Bij_Tijdstip($A80,N$8,N$11))+(0.75*P$18*FLOOR(P$20,0.05)*0.9*P$35*P$38*o_Isol_Bij_Tijdstip($A80,N$8,N$11))","v":{"$error":"#NAME?"}},"W",null,null,{"$f":"(0.75*R$18*FLOOR(R$20,0.05)*0.9*R$35*R$38*o_Isol_Bij_Tijdstip($A80,R$8,R$11))+(0.75*T$18*FLOOR(T$20,0.05)*0.9*T$35*T$38*o_Isol_Bij_Tijdstip($A80,R$8,R$11))","v":0},"W",{"$error":"#NAME?"},"W"]
["13:00:00",{"$f":"(0.75*B$18*FLOOR(B$20,0.05)*0.9*B$35*B$38*o_Isol_Bij_Tijdstip($A81,B$8,B$11))+(0.75*D$18*FLOOR(D$20,0.05)*0.9*D$35*D$38*o_Isol_Bij_Tijdstip($A81,B$8,B$11))","v":{"$error":"#NAME?"}},"W",null,null,{"$f":"(0.75*F$18*FLOOR(F$20,0.05)*0.9*F$35*F$38*o_Isol_Bij_Tijdstip($A81,F$8,F$11))+(0.75*H$18*FLOOR(H$20,0.05)*0.9*H$35*H$38*o_Isol_Bij_Tijdstip($A81,F$8,F$11))","v":{"$error":"#NAME?"}},"W",null,null,{"$f":"(0.75*J$18*FLOOR(J$20,0.05)*0.9*J$35*J$38*o_Isol_Bij_Tijdstip($A81,J$8,J$11))+(0.75*L$18*FLOOR(L$20,0.05)*0.9*L$35*L$38*o_Isol_Bij_Tijdstip($A81,J$8,J$11))","v":{"$error":"#NAME?"}},"W",null,null,{"$f":"(0.75*N$18*FLOOR(N$20,0.05)*0.9*N$35*N$38*o_Isol_Bij_Tijdstip($A81,N$8,N$11))+(0.75*P$18*FLOOR(P$20,0.05)*0.9*P$35*P$38*o_Isol_Bij_Tijdstip($A81,N$8,N$11))","v":{"$error":"#NAME?"}},"W",null,null,{"$f":"(0.75*R$18*FLOOR(R$20,0.05)*0.9*R$35*R$38*o_Isol_Bij_Tijdstip($A81,R$8,R$11))+(0.75*T$18*FLOOR(T$20,0.05)*0.9*T$35*T$38*o_Isol_Bij_Tijdstip($A81,R$8,R$11))","v":0},"W",{"$error":"#NAME?"},"W"]
["14:00:00",{"$f":"(0.75*B$18*FLOOR(B$20,0.05)*0.9*B$35*B$38*o_Isol_Bij_Tijdstip($A82,B$8,B$11))+(0.75*D$18*FLOOR(D$20,0.05)*0.9*D$35*D$38*o_Isol_Bij_Tijdstip($A82,B$8,B$11))","v":{"$error":"#NAME?"}},"W",null,null,{"$f":"(0.75*F$18*FLOOR(F$20,0.05)*0.9*F$35*F$38*o_Isol_Bij_Tijdstip($A82,F$8,F$11))+(0.75*H$18*FLOOR(H$20,0.05)*0.9*H$35*H$38*o_Isol_Bij_Tijdstip($A82,F$8,F$11))","v":{"$error":"#NAME?"}},"W",null,null,{"$f":"(0.75*J$18*FLOOR(J$20,0.05)*0.9*J$35*J$38*o_Isol_Bij_Tijdstip($A82,J$8,J$11))+(0.75*L$18*FLOOR(L$20,0.05)*0.9*L$35*L$38*o_Isol_Bij_Tijdstip($A82,J$8,J$11))","v":{"$error":"#NAME?"}},"W",null,null,{"$f":"(0.75*N$18*FLOOR(N$20,0.05)*0.9*N$35*N$38*o_Isol_Bij_Tijdstip($A82,N$8,N$11))+(0.75*P$18*FLOOR(P$20,0.05)*0.9*P$35*P$38*o_Isol_Bij_Tijdstip($A82,N$8,N$11))","v":{"$error":"#NAME?"}},"W",null,null,{"$f":"(0.75*R$18*FLOOR(R$20,0.05)*0.9*R$35*R$38*o_Isol_Bij_Tijdstip($A82,R$8,R$11))+(0.75*T$18*FLOOR(T$20,0.05)*0.9*T$35*T$38*o_Isol_Bij_Tijdstip($A82,R$8,R$11))","v":0},"W",{"$error":"#NAME?"},"W"]
["15:00:00",{"$f":"(0.75*B$18*FLOOR(B$20,0.05)*0.9*B$35*B$38*o_Isol_Bij_Tijdstip($A83,B$8,B$11))+(0.75*D$18*FLOOR(D$20,0.05)*0.9*D$35*D$38*o_Isol_Bij_Tijdstip($A83,B$8,B$11))","v":{"$error":"#NAME?"}},"W",null,null,{"$f":"(0.75*F$18*FLOOR(F$20,0.05)*0.9*F$35*F$38*o_Isol_Bij_Tijdstip($A83,F$8,F$11))+(0.75*H$18*FLOOR(H$20,0.05)*0.9*H$35*H$38*o_Isol_Bij_Tijdstip($A83,F$8,F$11))","v":{"$error":"#NAME?"}},"W",null,null,{"$f":"(0.75*J$18*FLOOR(J$20,0.05)*0.9*J$35*J$38*o_Isol_Bij_Tijdstip($A83,J$8,J$11))+(0.75*L$18*FLOOR(L$20,0.05)*0.9*L$35*L$38*o_Isol_Bij_Tijdstip($A83,J$8,J$11))","v":{"$error":"#NAME?"}},"W",null,null,{"$f":"(0.75*N$18*FLOOR(N$20,0.05)*0.9*N$35*N$38*o_Isol_Bij_Tijdstip($A83,N$8,N$11))+(0.75*P$18*FLOOR(P$20,0.05)*0.9*P$35*P$38*o_Isol_Bij_Tijdstip($A83,N$8,N$11))","v":{"$error":"#NAME?"}},"W",null,null,{"$f":"(0.75*R$18*FLOOR(R$20,0.05)*0.9*R$35*R$38*o_Isol_Bij_Tijdstip($A83,R$8,R$11))+(0.75*T$18*FLOOR(T$20,0.05)*0.9*T$35*T$38*o_Isol_Bij_Tijdstip($A83,R$8,R$11))","v":0},"W",{"$error":"#NAME?"},"W"]
["16:00:00",{"$f":"(0.75*B$18*FLOOR(B$20,0.05)*0.9*B$35*B$38*o_Isol_Bij_Tijdstip($A84,B$8,B$11))+(0.75*D$18*FLOOR(D$20,0.05)*0.9*D$35*D$38*o_Isol_Bij_Tijdstip($A84,B$8,B$11))","v":{"$error":"#NAME?"}},"W",null,null,{"$f":"(0.75*F$18*FLOOR(F$20,0.05)*0.9*F$35*F$38*o_Isol_Bij_Tijdstip($A84,F$8,F$11))+(0.75*H$18*FLOOR(H$20,0.05)*0.9*H$35*H$38*o_Isol_Bij_Tijdstip($A84,F$8,F$11))","v":{"$error":"#NAME?"}},"W",null,null,{"$f":"(0.75*J$18*FLOOR(J$20,0.05)*0.9*J$35*J$38*o_Isol_Bij_Tijdstip($A84,J$8,J$11))+(0.75*L$18*FLOOR(L$20,0.05)*0.9*L$35*L$38*o_Isol_Bij_Tijdstip($A84,J$8,J$11))","v":{"$error":"#NAME?"}},"W",null,null,{"$f":"(0.75*N$18*FLOOR(N$20,0.05)*0.9*N$35*N$38*o_Isol_Bij_Tijdstip($A84,N$8,N$11))+(0.75*P$18*FLOOR(P$20,0.05)*0.9*P$35*P$38*o_Isol_Bij_Tijdstip($A84,N$8,N$11))","v":{"$error":"#NAME?"}},"W",null,null,{"$f":"(0.75*R$18*FLOOR(R$20,0.05)*0.9*R$35*R$38*o_Isol_Bij_Tijdstip($A84,R$8,R$11))+(0.75*T$18*FLOOR(T$20,0.05)*0.9*T$35*T$38*o_Isol_Bij_Tijdstip($A84,R$8,R$11))","v":0},"W",{"$error":"#NAME?"},"W"]
["17:00:00",{"$f":"(0.75*B$18*FLOOR(B$20,0.05)*0.9*B$35*B$38*o_Isol_Bij_Tijdstip($A85,B$8,B$11))+(0.75*D$18*FLOOR(D$20,0.05)*0.9*D$35*D$38*o_Isol_Bij_Tijdstip($A85,B$8,B$11))","v":{"$error":"#NAME?"}},"W",null,null,{"$f":"(0.75*F$18*FLOOR(F$20,0.05)*0.9*F$35*F$38*o_Isol_Bij_Tijdstip($A85,F$8,F$11))+(0.75*H$18*FLOOR(H$20,0.05)*0.9*H$35*H$38*o_Isol_Bij_Tijdstip($A85,F$8,F$11))","v":{"$error":"#NAME?"}},"W",null,null,{"$f":"(0.75*J$18*FLOOR(J$20,0.05)*0.9*J$35*J$38*o_Isol_Bij_Tijdstip($A85,J$8,J$11))+(0.75*L$18*FLOOR(L$20,0.05)*0.9*L$35*L$38*o_Isol_Bij_Tijdstip($A85,J$8,J$11))","v":{"$error":"#NAME?"}},"W",null,null,{"$f":"(0.75*N$18*FLOOR(N$20,0.05)*0.9*N$35*N$38*o_Isol_Bij_Tijdstip($A85,N$8,N$11))+(0.75*P$18*FLOOR(P$20,0.05)*0.9*P$35*P$38*o_Isol_Bij_Tijdstip($A85,N$8,N$11))","v":{"$error":"#NAME?"}},"W",null,null,{"$f":"(0.75*R$18*FLOOR(R$20,0.05)*0.9*R$35*R$38*o_Isol_Bij_Tijdstip($A85,R$8,R$11))+(0.75*T$18*FLOOR(T$20,0.05)*0.9*T$35*T$38*o_Isol_Bij_Tijdstip($A85,R$8,R$11))","v":0},"W",{"$error":"#NAME?"},"W"]
["18:00:00",{"$f":"(0.75*B$18*FLOOR(B$20,0.05)*0.9*B$35*B$38*o_Isol_Bij_Tijdstip($A86,B$8,B$11))+(0.75*D$18*FLOOR(D$20,0.05)*0.9*D$35*D$38*o_Isol_Bij_Tijdstip($A86,B$8,B$11))","v":{"$error":"#NAME?"}},"W",null,null,{"$f":"(0.75*F$18*FLOOR(F$20,0.05)*0.9*F$35*F$38*o_Isol_Bij_Tijdstip($A86,F$8,F$11))+(0.75*H$18*FLOOR(H$20,0.05)*0.9*H$35*H$38*o_Isol_Bij_Tijdstip($A86,F$8,F$11))","v":{"$error":"#NAME?"}},"W",null,null,{"$f":"(0.75*J$18*FLOOR(J$20,0.05)*0.9*J$35*J$38*o_Isol_Bij_Tijdstip($A86,J$8,J$11))+(0.75*L$18*FLOOR(L$20,0.05)*0.9*L$35*L$38*o_Isol_Bij_Tijdstip($A86,J$8,J$11))","v":{"$error":"#NAME?"}},"W",null,null,{"$f":"(0.75*N$18*FLOOR(N$20,0.05)*0.9*N$35*N$38*o_Isol_Bij_Tijdstip($A86,N$8,N$11))+(0.75*P$18*FLOOR(P$20,0.05)*0.9*P$35*P$38*o_Isol_Bij_Tijdstip($A86,N$8,N$11))","v":{"$error":"#NAME?"}},"W",null,null,{"$f":"(0.75*R$18*FLOOR(R$20,0.05)*0.9*R$35*R$38*o_Isol_Bij_Tijdstip($A86,R$8,R$11))+(0.75*T$18*FLOOR(T$20,0.05)*0.9*T$35*T$38*o_Isol_Bij_Tijdstip($A86,R$8,R$11))","v":0},"W",{"$error":"#NAME?"},"W"]
[]
["Maatgevende tijdstip",{"$f":"IF(MAX(T77:T86)=0,\"Geen glas aanwezig\",_xlfn.XLOOKUP(MAX(T77:T86),T77:T86,A77:A86,\"nvt\"))","v":{"$error":"#NAME?"}}]

{"sheet":"Ruimte 7","index":9,"n_rows":88,"n_cols":21,"rows_kept":88,"cut":false,"hidden":false,"merged":[[70,0,71,20],[0,0,0,20],[6,1,6,3],[6,5,6,7],[6,9,6,11],[6,13,6,15],[6,17,6,20],[41,1,41,3],[41,5,41,7],[41,9,41,11],[41,13,41,15],[41,17,41,19],[40,1,40,3],[40,5,40,7],[40,9,40,11],[40,13,40,15],[40,17,40,19],[55,1,55,3],[55,5,55,7],[55,9,55,11],[55,13,55,15],[55,17,55,19],[54,1,54,3],[54,5,54,7],[54,9,54,11],[54,13,54,15],[54,17,54,19],[56,5,56,7],[56,9,56,11],[56,13,56,15],[56,17,56,19],[57,1,57,3],[57,5,57,7],[57,9,57,11],[57,13,57,15],[57,17,57,19],[59,1,59,3],[60,1,60,3],[62,1,62,3],[63,1,63,3],[56,1,56,3]]}
["RUIMTE 7"]
[]
["Ruimtenaam",7]
["Type verblijfsruimte","Andere verblijfsruimte"]
["Vloeroppervlak verblijfsruimte Avr  (gebruiksoppervlak)",0,"m²"]
[]
[null,"Voorzijde woning",null,null,null,"Linker zijde woning",null,null,null,"Achterzijde woning",null,null,null,"Rechter zijde woning",null,null,null,"Platdak"]
["Orientatie gevel / dakvlak (Helling > 15°C)",{"$f":"'Projectgegevens en Resultaten'!$B$17","v":0},null,null,null,{"$f":"o_Orientatie(F9)","v":{"$error":"#NAME?"}},null,null,null,{"$f":"o_Orientatie(J9)","v":{"$error":"#NAME?"}},null,null,null,{"$f":"o_Orientatie(N9)","v":{"$error":"#NAME?"}},null,null,null,"Horizontaal"]
["Orientatiehoek gevel Ƴ",{"$f":"o_OrientatiehOEK(B8)","v":{"$error":"#NAME?"}},null,null,null,{"$f":"IF(B9+90>360,B9+90-360,B9+90)","v":{"$error":"#NAME?"}},null,null,null,{"$f":"IF(F9+90>360,F9+90-360,F9+90)","v":{"$error":"#NAME?"}},null,null,null,{"$f":"IF(J9+90>360,J9+90-360,J9+90)","v":{"$error":"#NAME?"}}]
["Grenst aan buitenlucht ja of nee","Nee",null,null,null,"Nee",null,null,null,"Nee",null,null,null,"Nee",null,null,null,"Nee"]
["Hellingshoek constructie ≥ 15° = hellenddak 90° = gevel",90,"°",null,null,90,"°",null,null,90,"°",null,null,90,"°",null,null,0,"°"]
["Type constructie",{"$f":"o_TypeConstructie(B10,B11)","v":"Woningscheidend"},null,null,null,{"$f":"o_TypeConstructie(F10,F11)","v":"Woningscheidend"},null,null,null,{"$f":"o_TypeConstructie(J10,J11)","v":"Woningscheidend"},null,null,null,{"$f":"o_TypeConstructie(N10,N11)","v":"Woningscheidend"},null,null,null,{"$f":"o_TypeConstructie(R10,R11)","v":"Woningscheidend"}]
["Gevel lengte (binnenwerks)",null,"m",null,null,null,"m",null,null,null,"m",null,null,null,"m",null,null,null,"m"]
["Gevel hoogte / Dak breedte (binnenwerks)",null,"m",null,null,null,"m",null,null,null,"m",null,null,null,"m",null,null,null,"m"]
["Constructie oppervlak (binnenwerks)",{"$f":"B13*B14","v":0},"m²",null,null,{"$f":"F13*F14","v":0},"m²",null,null,{"$f":"J13*J14","v":0},"m²",null,null,{"$f":"N13*N14","v":0},"m²",null,null,{"$f":"R13*R14","v":0},"m²"]
["Gesloten constructie oppervlak",{"$f":"MAX(0,B15-B18-D18)","v":0},"m²",null,null,{"$f":"MAX(0,F15-F18-H18)","v":0},"m²",null,null,{"$f":"MAX(0,J15-J18-L18)","v":0},"m²",null,null,{"$f":"MAX(0,N15-N18-P18)","v":0},"m²",null,null,{"$f":"MAX(0,R15-R18-T18)","v":0},"m²"]
[null,"Glasvlak type 1",null,"Glasvlak type 2",null,"Glasvlak type 1",null,"Glasvlak type 2",null,"Glasvlak type 1",null,"Glasvlak type 2",null,"Glasvlak type 1",null,"Glasvlak type 2",null,"Glasvlak type 1",null,"Glasvlak type 2"]
["Totaal oppervlak van raamtype Aw,k (inclusief kozijn)",null,"m²",null,"m²",null,"m²",null,"m²",null,"m²",null,"m²",null,"m²",null,"m²",null,"m²",null,"m²"]
["Warmtedoorgangscoefficient (U-waarde) van het raam Uw;wi;k",null,"W/m².K",null,"W/m².K",null,"W/m².K",null,"W/m².K",null,"W/m².K",null,"W/m².K",null,"W/m².K",null,"W/m².K",null,"W/m².K",null,"W/m².K"]
["Zontoetredingsfactor (g_waarde) van het glas Ggl;n;wi;k;C;juli",1,null,1,null,1,null,1,null,1,null,1,null,1,null,1,null,1,null,1]
["Beschaduwing situatie bij het raamtype","Minimale belemmering",null,"Minimale belemmering",null,"Minimale belemmering",null,"Minimale belemmering",null,"Minimale belemmering",null,"Minimale belemmering",null,"Minimale belemmering",null,"Minimale belemmering",null,"Minimale belemmering",null,"Minimale belemmering"]
[]
[null,"Overstek",null,"Overstek",null,"Overstek",null,"Overstek",null,"Overstek",null,"Overstek",null,"Overstek",null,"Overstek"]
["Hoogte verschil midden raam onderzijde overstek",0,"m",0,"m",0,"m",0,"m",0,"m",0,"m",0,"m",0,"m",0,null,0,"m"]
["Horizontale afstand glas tot eindpunt overstek",0,"m",0,"m",0,"m",0,"m",0,"m",0,"m",0,"m",0,"m",0,null,0,"m"]
["Overstekhoek",{"$f":"IFERROR(180/PI()*ATAN(B24/B25),0)","v":0},"°",{"$f":"IFERROR(180/PI()*ATAN(D24/D25),0)","v":0},"°",{"$f":"IFERROR(180/PI()*ATAN(F24/F25),0)","v":0},"°",{"$f":"IFERROR(180/PI()*ATAN(H24/H25),0)","v":0},"°",{"$f":"IFERROR(180/PI()*ATAN(J24/J25),0)","v":0},"°",{"$f":"IFERROR(180/PI()*ATAN(L24/L25),0)","v":0},"°",{"$f":"IFERROR(180/PI()*ATAN(N24/N25),0)","v":0},"°",{"$f":"IFERROR(180/PI()*ATAN(P24/P25),0)","v":0},"°",null,null,null,"°"]
["Relatieve hoogte van overstek",{"$f":"IFERROR(B24/B25,1)","v":1},null,{"$f":"IFERROR(D24/D25,1)","v":1},null,{"$f":"IFERROR(F24/F25,1)","v":1},null,{"$f":"IFERROR(H24/H25,1)","v":1},null,{"$f":"IFERROR(J24/J25,1)","v":1},null,{"$f":"IFERROR(L24/L25,1)","v":1},null,{"$f":"IFERROR(N24/N25,1)","v":1},null,{"$f":"IFERROR(P24/P25,1)","v":1}]
[]
[null,"Zijbelemmering",null,"Zijbelemmering",null,"Zijbelemmering",null,"Zijbelemmering",null,"Zijbelemmering",null,"Zijbelemmering",null,"Zijbelemmering",null,"Zijbelemmering"]
["Positie zijbelemmering irt zichtveld (naar buitengericht)","Links",null,"Links",null,"Links",null,"Links",null,"Links",null,"Links",null,"Links",null,"Links",null,"Links",null,"Links"]
["Horizontale afstand midden raam verste punt belemmering",0,"m",0,"m",0,"m",0,"m",0,"m",0,"m",0,"m",0,"m",0,null,0,"m"]
["Horizontale breedte glas tot eindpunt belemmering",0,"m",0,"m",0,"m",0,"m",0,"m",0,"m",0,"m",0,"m",0,null,0,"m"]
["Relatieve breedte van de zijbelemmering bb",{"$f":"IFERROR(B31/B32,999)","v":999},null,{"$f":"IFERROR(D31/D32,999)","v":999},null,{"$f":"IFERROR(F31/F32,999)","v":999},null,{"$f":"IFERROR(H31/H32,999)","v":999},null,{"$f":"IFERROR(J31/J32,999)","v":999},null,{"$f":"IFERROR(L31/L32,999)","v":999},null,{"$f":"IFERROR(N31/N32,999)","v":999},null,{"$f":"IFERROR(P31/P32,999)","v":999}]
[]
["De beschaduwingsreductiefactor Fsh;obst;wi;k;juli",{"$f":"IFERROR(o_Beschaduwingreductie(B21,B8,B27,B30,B33,B11),1)","v":1},null,{"$f":"IFERROR(o_Beschaduwingreductie(D21,B8,D27,D30,D33,B11),1)","v":1},null,{"$f":"IFERROR(o_Beschaduwingreductie(F21,F8,F27,F30,F33,F11),1)","v":1},null,{"$f":"IFERROR(o_Beschaduwingreductie(H21,F8,H27,H30,H33,F11),1)","v":1},null,{"$f":"IFERROR(o_Beschaduwingreductie(J21,J8,J27,J30,J33,J11),1)","v":1},null,{"$f":"IFERROR(o_Beschaduwingreductie(L21,J8,L27,L30,L33,J11),1)","v":1},null,{"$f":"IFERROR(o_Beschaduwingreductie(N21,N8,N27,N30,N33,N11),1)","v":1},null,{"$f":"IFERROR(o_Beschaduwingreductie(P21,N8,P27,P30,P33,N11),1)","v":1},null,{"$f":"o_Beschaduwingreductie(R21,R8,R27,R30,R33,R11)","v":1},null,{"$f":"o_Beschaduwingreductie(T21,R8,T27,T30,T33,R11)","v":1}]
[]
["Type zonwering","Geen zonwering",null,"Geen zonwering",null,"Geen zonwering",null,"Geen zonwering",null,"Geen zonwering",null,"Geen zonwering",null,"Geen zonwering",null,"Geen zonwering",null,"Geen zonwering",null,"Geen zonwering"]
["De reductiefactor voor zonwering Fc;wi;k",{"$f":"o_Zonweringreductie(B37,B8)","v":{"$error":"#NAME?"}},null,{"$f":"o_Zonweringreductie(D37,B8)","v":{"$error":"#NAME?"}},null,{"$f":"o_Zonweringreductie(F37,F8)","v":{"$error":"#NAME?"}},null,{"$f":"o_Zonweringreductie(H37,F8)","v":{"$error":"#NAME?"}},null,{"$f":"o_Zonweringreductie(J37,J8)","v":{"$error":"#NAME?"}},null,{"$f":"o_Zonweringreductie(L37,J8)","v":{"$error":"#NAME?"}},null,{"$f":"o_Zonweringreductie(N37,N8)","v":{"$error":"#NAME?"}},null,{"$f":"o_Zonweringreductie(P37,N8)","v":{"$error":"#NAME?"}},null,{"$f":"o_Zonweringreductie(R37,R8)","v":1},null,{"$f":"o_Zonweringreductie(T37,R8)","v":1}]
["Totaal opvallende zonnestraling van het raam Isol;wi;k;juli",{"$f":"IF(B10=\"Nee\",0,o_Isol_Bij_Tijdstip($B$52,B8,B11))","v":0},"W/m²",{"$f":"IF(B10=\"Nee\",0,o_Isol_Bij_Tijdstip($B$52,B8,B11))","v":0},"W/m²",{"$f":"IF(F10=\"Nee\",0,o_Isol_Bij_Tijdstip($B$52,F8,F11))","v":0},"W/m²",{"$f":"IF(F10=\"Nee\",0,o_Isol_Bij_Tijdstip($B$52,F8,F11))","v":0},"W/m²",{"$f":"IF(J10=\"Nee\",0,o_Isol_Bij_Tijdstip($B$52,J8,J11))","v":0},"W/m²",{"$f":"IF(J10=\"Nee\",0,o_Isol_Bij_Tijdstip($B$52,J8,J11))","v":0},"W/m²",{"$f":"IF(N10=\"Nee\",0,o_Isol_Bij_Tijdstip($B$52,N8,N11))","v":0},"W/m²",{"$f":"IF(N10=\"Nee\",0,o_Isol_Bij_Tijdstip($B$52,N8,N11))","v":0},"W/m²",{"$f":"IF(R10=\"Nee\",0,o_Isol_Bij_Tijdstip($B$52,R8,R11))","v":0},"W/m²",{"$f":"IF(R10=\"Nee\",0,o_Isol_Bij_Tijdstip($B$52,R8,R11))","v":0},"W/m²"]
[]
["Tijdstip maximale koellastbijdrage tmax;zi",{"$f":"VALUE(o_Tijdstip_Isol_Max_Orientatie(B8,B11))","v":{"$error":"#NAME?"}},null,null,null,{"$f":"VALUE(o_Tijdstip_Isol_Max_Orientatie(F8,F11))","v":{"$error":"#NAME?"}},null,null,null,{"$f":"VALUE(o_Tijdstip_Isol_Max_Orientatie(J8,J11))","v":{"$error":"#NAME?"}},null,null,null,{"$f":"VALUE(o_Tijdstip_Isol_Max_Orientatie(N8,N11))","v":{"$error":"#NAME?"}},null,null,null,{"$f":"o_Tijdstip_Isol_Max_Orientatie(R8,R11)","v":"12:00:00 PM"}]
["Buitenluchttemperatuur op tijdstip max koellast Θe",{"$f":"o_maxTemp(VALUE(B41))","v":{"$error":"#NAME?"}},null,null,"°C",{"$f":"o_maxTemp(VALUE(F41))","v":{"$error":"#NAME?"}},null,null,"°C",{"$f":"o_maxTemp(VALUE(J41))","v":{"$error":"#NAME?"}},null,null,"°C",{"$f":"o_maxTemp(VALUE(N41))","v":{"$error":"#NAME?"}},null,null,"°C",{"$f":"o_maxTemp(VALUE(R41))","v":29.5}]
[]
["Glasopppervlak",{"$f":"IF(B10=\"Ja\",B18+D18,0)","v":0},"m²",null,null,{"$f":"IF(F10=\"Ja\",F18+H18,0)","v":0},"m²",null,null,{"$f":"IF(J10=\"Ja\",J18+L18,0)","v":0},"m²",null,null,{"$f":"IF(N10=\"Ja\",N18+P18,0)","v":0},"m²",null,null,{"$f":"IF(R10=\"Ja\",R18+T18,0)","v":0},"m²"]
["Uitwendigescheidingsconstructie niet op Noord?",{"$f":"IF(B10=\"Ja\",IF(B8=\"Noord\",FALSE,TRUE),FALSE)","v":false},null,null,null,{"$f":"IF(F10=\"Ja\",IF(F8=\"Noord\",FALSE,TRUE),FALSE)","v":false},null,null,null,{"$f":"IF(J10=\"Ja\",IF(J8=\"Noord\",FALSE,TRUE),FALSE)","v":false},null,null,null,{"$f":"IF(N10=\"Ja\",IF(N8=\"Noord\",FALSE,TRUE),FALSE)","v":false},null,null,null,{"$f":"IF(R10=\"Ja\",IF(R8=\"Noord\",FALSE,TRUE),FALSE)","v":false}]
["De enige uitwendigescheidingscontructie?",{"$f":"IF(AND(B45=TRUE,COUNTIF($B$45:$R$45,TRUE)=1),TRUE,FALSE)","v":false},null,null,null,{"$f":"IF(AND(F45=TRUE,COUNTIF($B$45:$R$45,TRUE)=1),TRUE,FALSE)","v":false},null,null,null,{"$f":"IF(AND(J45=TRUE,COUNTIF($B$45:$R$45,TRUE)=1),TRUE,FALSE)","v":false},null,null,null,{"$f":"IF(AND(N45=TRUE,COUNTIF($B$45:$R$45,TRUE)=1),TRUE,FALSE)","v":false},null,null,null,{"$f":"IF(AND(R45=TRUE,COUNTIF($B$45:$R$45,TRUE)=1),TRUE,FALSE)","v":false}]
["Totaal glasoppervlak",{"$f":"IF(B8<>\"Noord\",B44,0)","v":0},"m²",null,null,{"$f":"IF(F8<>\"Noord\",F44,0)","v":{"$error":"#NAME?"}},"m²",null,null,{"$f":"IF(J8<>\"Noord\",J44,0)","v":{"$error":"#NAME?"}},"m²",null,null,{"$f":"IF(N8<>\"Noord\",N44,0)","v":{"$error":"#NAME?"}},"m²",null,null,{"$f":"R44","v":0},"m²"]
["Grootste glasoppervlak ",{"$f":"IF(AND(B45,B47=MAX($B$47:$R$47)),TRUE,FALSE)","v":{"$error":"#NAME?"}},null,null,null,{"$f":"IF(AND(F45,F47=MAX($B$47:$R$47)),TRUE,FALSE)","v":{"$error":"#NAME?"}},null,null,null,{"$f":"IF(AND(J45,J47=MAX($B$47:$R$47)),TRUE,FALSE)","v":{"$error":"#NAME?"}},null,null,null,{"$f":"IF(AND(N45,N47=MAX($B$47:$R$47)),TRUE,FALSE)","v":{"$error":"#NAME?"}},null,null,null,{"$f":"IF(AND(R45,R47=MAX($B$47:$R$47)),TRUE,FALSE)","v":{"$error":"#NAME?"}}]
["Dakvlak maatgevend?",{"$f":"IF(AND(B11<90,B15>3*(B18+D18),'Projectgegevens en Resultaten'!#REF!<65),TRUE,FALSE)","v":{"$error":"#REF!"}},null,null,null,{"$f":"IF(AND(F11<90,F15>3*(F18+H18),'Projectgegevens en Resultaten'!#REF!<65),TRUE,FALSE)","v":{"$error":"#REF!"}},null,null,null,{"$f":"IF(AND(J11<90,J15>3*(J18+L18),'Projectgegevens en Resultaten'!#REF!<65),TRUE,FALSE)","v":{"$error":"#REF!"}},null,null,null,{"$f":"IF(AND(N11<90,N15>3*(N18+P18),'Projectgegevens en Resultaten'!#REF!<65),TRUE,FALSE)","v":{"$error":"#REF!"}},null,null,null,{"$f":"IF(AND(R11<90,R15>3*(R18+T18),'Projectgegevens en Resultaten'!#REF!<65),TRUE,FALSE)","v":{"$error":"#REF!"}}]
["is er een maatgevend dakoppervlak",{"$f":"IF(COUNTIF($B$49:$R$49,TRUE)>0,TRUE,FALSE)","v":false},null,null,null,{"$f":"IF(COUNTIF($B$49:$R$49,TRUE)>0,TRUE,FALSE)","v":false},null,null,null,{"$f":"IF(COUNTIF($B$49:$R$49,TRUE)>0,TRUE,FALSE)","v":false},null,null,null,{"$f":"IF(COUNTIF($B$49:$R$49,TRUE)>0,TRUE,FALSE)","v":false},null,null,null,{"$f":"IF(COUNTIF($B$49:$R$49,TRUE)>0,TRUE,FALSE)","v":false}]
["Maatgevende tijdstip",{"$f":"IF(OR(B46,AND(B45,B50,B49),AND(B45,B48,NOT(B50))),B41)","v":{"$error":"#REF!"}},null,null,null,{"$f":"IF(OR(F46,AND(F45,F50,F49),AND(F45,F48,NOT(F50))),F41)","v":{"$error":"#REF!"}},null,null,null,{"$f":"IF(OR(J46,AND(J45,J50,J49),AND(J45,J48,NOT(J50))),J41)","v":{"$error":"#REF!"}},null,null,null,{"$f":"IF(OR(N46,AND(N45,N50,N49),AND(N45,N48,NOT(N50))),N41)","v":{"$error":"#REF!"}},null,null,null,{"$f":"IF(OR(R46,AND(R45,R50,R49),AND(R45,R48,NOT(R50))),R41)","v":{"$error":"#REF!"}}]
["Maatgevende tijdstip tmax;zi",{"$f":"IFERROR(B88,\"geen glas ingevoerd\")","v":"geen glas ingevoerd"}]
["Buitenluchttemperatuur op tijdstip max koellast Θe",{"$f":"o_maxTemp(VALUE(B52))","v":{"$error":"#NAME?"}},"°C"]
[]
["Koellastbijdrage transmissie ondoorzichtige delen Ptr;ntr;vr;zi",{"$f":"IF(B10=\"Nee\",0,B16*'Projectgegevens en Resultaten'!$B$16)","v":0},null,null,"W",{"$f":"IF(F10=\"Nee\",0,F16*'Projectgegevens en Resultaten'!$B$16)","v":0},null,null,"W",{"$f":"IF(J10=\"Nee\",0,J16*'Projectgegevens en Resultaten'!$B$16)","v":0},null,null,"W",{"$f":"IF(N10=\"Nee\",0,N16*'Projectgegevens en Resultaten'!$B$16)","v":0},null,null,"W",{"$f":"IF(R10=\"Nee\",0,R16*'Projectgegevens en Resultaten'!$B$16)","v":0},null,null,"W"]
["Koellastbijdrage zoninstraling transparante delen Psol;vr;zi",{"$f":"(0.75*B18*FLOOR(B20,0.05)*0.9*B35*B38*B39)+(0.75*D18*FLOOR(D20,0.05)*0.9*D35*D38*D39)","v":{"$error":"#NAME?"}},null,null,"W",{"$f":"(0.75*F18*FLOOR(F20,0.05)*0.9*F35*F38*F39)+(0.75*H18*FLOOR(H20,0.05)*0.9*H35*H38*H39)","v":{"$error":"#NAME?"}},null,null,"W",{"$f":"(0.75*J18*FLOOR(J20,0.05)*0.9*J35*J38*J39)+(0.75*L18*FLOOR(L20,0.05)*0.9*L35*L38*L39)","v":{"$error":"#NAME?"}},null,null,"W",{"$f":"(0.75*N18*FLOOR(N20,0.05)*0.9*N35*N38*N39)+(0.75*P18*FLOOR(P20,0.05)*0.9*P35*P38*P39)","v":{"$error":"#NAME?"}},null,null,"W",{"$f":"(0.75*R18*FLOOR(R20,0.05)*0.9*R35*R38*R39)+(0.75*T18*FLOOR(T20,0.05)*0.9*T35*T38*T39)","v":0},null,null,"W"]
["Koellastbijdrage transmissie transparante delen Ptr;gl;vr;zi",{"$f":"IF(B10=\"Nee\",0,IFERROR(B18*B19*($B$53-24),0)+IFERROR(D18*D19*($B$53-24),0))","v":0},null,null,"W",{"$f":"IF(F10=\"Nee\",0,IFERROR(F18*F19*($B$53-24),0)+IFERROR(H18*H19*($B$53-24),0))","v":0},null,null,"W",{"$f":"IF(J10=\"Nee\",0,IFERROR(J18*J19*($B$53-24),0)+IFERROR(L18*L19*($B$53-24),0))","v":0},null,null,"W",{"$f":"IF(N10=\"Nee\",0,IFERROR(N18*N19*($B$53-24),0)+IFERROR(P18*P19*($B$53-24),0))","v":0},null,null,"W",{"$f":"IF(R10=\"Nee\",0,IFERROR(R18*R19*($B$53-24),0)+IFERROR(T18*T19*($B$53-24),0))","v":0},null,null,"W"]
["Totaal koellastbijdrage per gevel",{"$f":"SUM(B55:D57)","v":{"$error":"#NAME?"}},null,null,"W",{"$f":"SUM(F55:H57)","v":{"$error":"#NAME?"}},null,null,"W",{"$f":"SUM(J55:L57)","v":{"$error":"#NAME?"}},null,null,"W",{"$f":"SUM(N55:P57)","v":{"$error":"#NAME?"}},null,null,"W",{"$f":"SUM(R55:R57)","v":0},null,null,"W"]
[]
["Koellast door interne warmtelast Pint;calc;woon/overig;zi",{"$f":"IF(B5=0,0,IF(B4=\"Woonvertrek\",2*'Projectgegevens en Resultaten'!$B$33*B5,'Projectgegevens en Resultaten'!$B$33*B5))","v":0},null,null,"W"]
["Koellast door buitenluchttoetreding Pv;calc;vr;zi",{"$f":"IFERROR(MAX((SUM('Projectgegevens en Resultaten'!$B$21:$B$23)/3600*1.205*1005*(B53-24))/SUM('Projectgegevens en Resultaten'!$B$40:$T$40)*B5,0),0)","v":0},{"$f":"IFERROR(MAX(SUM(C57:C59)/3600*1.205*1005*(C60-24),0),0)","v":0},{"$f":"IFERROR(MAX(SUM(D57:D59)/3600*1.205*1005*(D60-24),0),0)","v":0},"W"]
[]
["Totaal koellastbijdrage",{"$f":"IFERROR(SUM(B58:T58)+B60+B61,0)","v":0},null,null,"W"]
["Koelbehoefte verblijfsruimte",{"$f":"IFERROR(B63/B5,0)","v":0},null,null,"W/m²"]
[]
[]
[]
[]
[]
[]
["Onderstaande tabellen worden verborgen in de uiteindelijke versie. De tabellen dienen om vast te stellen welk tijdstip tot de hoogste zonbelasting leidt"]
[]
["Isol max voor de orientatie",{"$f":"o_Isol_Max_Orientatie(B8,B11)","v":{"$error":"#NAME?"}},"W/m²",null,null,{"$f":"o_Isol_Max_Orientatie(F8,F11)","v":{"$error":"#NAME?"}},"W/m²",null,null,{"$f":"o_Isol_Max_Orientatie(J8,J11)","v":{"$error":"#NAME?"}},"W/m²",null,null,{"$f":"o_Isol_Max_Orientatie(N8,N11)","v":{"$error":"#NAME?"}},"W/m²",null,null,{"$f":"o_Isol_Max_Orientatie(R8,R11)","v":914.11856204111336},"W/m²"]
["Tijdstip bij Isol max bij orientatie",{"$f":"VALUE(o_Tijdstip_Isol_Max_Orientatie(B8,B11))","v":{"$error":"#NAME?"}},null,null,null,{"$f":"VALUE(o_Tijdstip_Isol_Max_Orientatie(F8,F11))","v":{"$error":"#NAME?"}},null,null,null,{"$f":"VALUE(o_Tijdstip_Isol_Max_Orientatie(J8,J11))","v":{"$error":"#NAME?"}},null,null,null,{"$f":"VALUE(o_Tijdstip_Isol_Max_Orientatie(N8,N11))","v":{"$error":"#NAME?"}},null,null,null,{"$f":"VALUE(o_Tijdstip_Isol_Max_Orientatie(R8,R11))","v":"12:00:00"}]
[]
["Koellastbijdrage zoninstraling transparante delen Psol;vr;zi"]
["09:00:00",{"$f":"(0.75*B$18*FLOOR(B$20,0.05)*0.9*B$35*B$38*o_Isol_Bij_Tijdstip($A77,B$8,B$11))+(0.75*D$18*FLOOR(D$20,0.05)*0.9*D$35*D$38*o_Isol_Bij_Tijdstip($A77,B$8,B$11))","v":{"$error":"#NAME?"}},"W",null,null,{"$f":"(0.75*F$18*FLOOR(F$20,0.05)*0.9*F$35*F$38*o_Isol_Bij_Tijdstip($A77,F$8,F$11))+(0.75*H$18*FLOOR(H$20,0.05)*0.9*H$35*H$38*o_Isol_Bij_Tijdstip($A77,F$8,F$11))","v":{"$error":"#NAME?"}},"W",null,null,{"$f":"(0.75*J$18*FLOOR(J$20,0.05)*0.9*J$35*J$38*o_Isol_Bij_Tijdstip($A77,J$8,J$11))+(0.75*L$18*FLOOR(L$20,0.05)*0.9*L$35*L$38*o_Isol_Bij_Tijdstip($A77,J$8,J$11))","v":{"$error":"#NAME?"}},"W",null,null,{"$f":"(0.75*N$18*FLOOR(N$20,0.05)*0.9*N$35*N$38*o_Isol_Bij_Tijdstip($A77,N$8,N$11))+(0.75*P$18*FLOOR(P$20,0.05)*0.9*P$35*P$38*o_Isol_Bij_Tijdstip($A77,N$8,N$11))","v":{"$error":"#NAME?"}},"W",null,null,{"$f":"(0.75*R$18*FLOOR(R$20,0.05)*0.9*R$35*R$38*o_Isol_Bij_Tijdstip($A77,R$8,R$11))+(0.75*T$18*FLOOR(T$20,0.05)*0.9*T$35*T$38*o_Isol_Bij_Tijdstip($A77,R$8,R$11))","v":0},"W",{"$f":"B77+F77+J77+N77+R77","v":{"$error":"#NAME?"}},"W"]
["10:00:00",{"$f":"(0.75*B$18*FLOOR(B$20,0.05)*0.9*B$35*B$38*o_Isol_Bij_Tijdstip($A78,B$8,B$11))+(0.75*D$18*FLOOR(D$20,0.05)*0.9*D$35*D$38*o_Isol_Bij_Tijdstip($A78,B$8,B$11))","v":{"$error":"#NAME?"}},"W",null,null,{"$f":"(0.75*F$18*FLOOR(F$20,0.05)*0.9*F$35*F$38*o_Isol_Bij_Tijdstip($A78,F$8,F$11))+(0.75*H$18*FLOOR(H$20,0.05)*0.9*H$35*H$38*o_Isol_Bij_Tijdstip($A78,F$8,F$11))","v":{"$error":"#NAME?"}},"W",null,null,{"$f":"(0.75*J$18*FLOOR(J$20,0.05)*0.9*J$35*J$38*o_Isol_Bij_Tijdstip($A78,J$8,J$11))+(0.75*L$18*FLOOR(L$20,0.05)*0.9*L$35*L$38*o_Isol_Bij_Tijdstip($A78,J$8,J$11))","v":{"$error":"#NAME?"}},"W",null,null,{"$f":"(0.75*N$18*FLOOR(N$20,0.05)*0.9*N$35*N$38*o_Isol_Bij_Tijdstip($A78,N$8,N$11))+(0.75*P$18*FLOOR(P$20,0.05)*0.9*P$35*P$38*o_Isol_Bij_Tijdstip($A78,N$8,N$11))","v":{"$error":"#NAME?"}},"W",null,null,{"$f":"(0.75*R$18*FLOOR(R$20,0.05)*0.9*R$35*R$38*o_Isol_Bij_Tijdstip($A78,R$8,R$11))+(0.75*T$18*FLOOR(T$20,0.05)*0.9*T$35*T$38*o_Isol_Bij_Tijdstip($A78,R$8,R$11))","v":0},"W",{"$error":"#NAME?"},"W"]
["11:00:00",{"$f":"(0.75*B$18*FLOOR(B$20,0.05)*0.9*B$35*B$38*o_Isol_Bij_Tijdstip($A79,B$8,B$11))+(0.75*D$18*FLOOR(D$20,0.05)*0.9*D$35*D$38*o_Isol_Bij_Tijdstip($A79,B$8,B$11))","v":{"$error":"#NAME?"}},"W",null,null,{"$f":"(0.75*F$18*FLOOR(F$20,0.05)*0.9*F$35*F$38*o_Isol_Bij_Tijdstip($A79,F$8,F$11))+(0.75*H$18*FLOOR(H$20,0.05)*0.9*H$35*H$38*o_Isol_Bij_Tijdstip($A79,F$8,F$11))","v":{"$error":"#NAME?"}},"W",null,null,{"$f":"(0.75*J$18*FLOOR(J$20,0.05)*0.9*J$35*J$38*o_Isol_Bij_Tijdstip($A79,J$8,J$11))+(0.75*L$18*FLOOR(L$20,0.05)*0.9*L$35*L$38*o_Isol_Bij_Tijdstip($A79,J$8,J$11))","v":{"$error":"#NAME?"}},"W",null,null,{"$f":"(0.75*N$18*FLOOR(N$20,0.05)*0.9*N$35*N$38*o_Isol_Bij_Tijdstip($A79,N$8,N$11))+(0.75*P$18*FLOOR(P$20,0.05)*0.9*P$35*P$38*o_Isol_Bij_Tijdstip($A79,N$8,N$11))","v":{"$error":"#NAME?"}},"W",null,null,{"$f":"(0.75*R$18*FLOOR(R$20,0.05)*0.9*R$35*R$38*o_Isol_Bij_Tijdstip($A79,R$8,R$11))+(0.75*T$18*FLOOR(T$20,0.05)*0.9*T$35*T$38*o_Isol_Bij_Tijdstip($A79,R$8,R$11))","v":0},"W",{"$error":"#NAME?"},"W"]
["12:00:00",{"$f":"(0.75*B$18*FLOOR(B$20,0.05)*0.9*B$35*B$38*o_Isol_Bij_Tijdstip($A80,B$8,B$11))+(0.75*D$18*FLOOR(D$20,0.05)*0.9*D$35*D$38*o_Isol_Bij_Tijdstip($A80,B$8,B$11))","v":{"$error":"#NAME?"}},"W",null,null,{"$f":"(0.75*F$18*FLOOR(F$20,0.05)*0.9*F$35*F$38*o_Isol_Bij_Tijdstip($A80,F$8,F$11))+(0.75*H$18*FLOOR(H$20,0.05)*0.9*H$35*H$38*o_Isol_Bij_Tijdstip($A80,F$8,F$11))","v":{"$error":"#NAME?"}},"W",null,null,{"$f":"(0.75*J$18*FLOOR(J$20,0.05)*0.9*J$35*J$38*o_Isol_Bij_Tijdstip($A80,J$8,J$11))+(0.75*L$18*FLOOR(L$20,0.05)*0.9*L$35*L$38*o_Isol_Bij_Tijdstip($A80,J$8,J$11))","v":{"$error":"#NAME?"}},"W",null,null,{"$f":"(0.75*N$18*FLOOR(N$20,0.05)*0.9*N$35*N$38*o_Isol_Bij_Tijdstip($A80,N$8,N$11))+(0.75*P$18*FLOOR(P$20,0.05)*0.9*P$35*P$38*o_Isol_Bij_Tijdstip($A80,N$8,N$11))","v":{"$error":"#NAME?"}},"W",null,null,{"$f":"(0.75*R$18*FLOOR(R$20,0.05)*0.9*R$35*R$38*o_Isol_Bij_Tijdstip($A80,R$8,R$11))+(0.75*T$18*FLOOR(T$20,0.05)*0.9*T$35*T$38*o_Isol_Bij_Tijdstip($A80,R$8,R$11))","v":0},"W",{"$error":"#NAME?"},"W"]
["13:00:00",{"$f":"(0.75*B$18*FLOOR(B$20,0.05)*0.9*B$35*B$38*o_Isol_Bij_Tijdstip($A81,B$8,B$11))+(0.75*D$18*FLOOR(D$20,0.05)*0.9*D$35*D$38*o_Isol_Bij_Tijdstip($A81,B$8,B$11))","v":{"$error":"#NAME?"}},"W",null,null,{"$f":"(0.75*F$18*FLOOR(F$20,0.05)*0.9*F$35*F$38*o_Isol_Bij_Tijdstip($A81,F$8,F$11))+(0.75*H$18*FLOOR(H$20,0.05)*0.9*H$35*H$38*o_Isol_Bij_Tijdstip($A81,F$8,F$11))","v":{"$error":"#NAME?"}},"W",null,null,{"$f":"(0.75*J$18*FLOOR(J$20,0.05)*0.9*J$35*J$38*o_Isol_Bij_Tijdstip($A81,J$8,J$11))+(0.75*L$18*FLOOR(L$20,0.05)*0.9*L$35*L$38*o_Isol_Bij_Tijdstip($A81,J$8,J$11))","v":{"$error":"#NAME?"}},"W",null,null,{"$f":"(0.75*N$18*FLOOR(N$20,0.05)*0.9*N$35*N$38*o_Isol_Bij_Tijdstip($A81,N$8,N$11))+(0.75*P$18*FLOOR(P$20,0.05)*0.9*P$35*P$38*o_Isol_Bij_Tijdstip($A81,N$8,N$11))","v":{"$error":"#NAME?"}},"W",null,null,{"$f":"(0.75*R$18*FLOOR(R$20,0.05)*0.9*R$35*R$38*o_Isol_Bij_Tijdstip($A81,R$8,R$11))+(0.75*T$18*FLOOR(T$20,0.05)*0.9*T$35*T$38*o_Isol_Bij_Tijdstip($A81,R$8,R$11))","v":0},"W",{"$error":"#NAME?"},"W"]
["14:00:00",{"$f":"(0.75*B$18*FLOOR(B$20,0.05)*0.9*B$35*B$38*o_Isol_Bij_Tijdstip($A82,B$8,B$11))+(0.75*D$18*FLOOR(D$20,0.05)*0.9*D$35*D$38*o_Isol_Bij_Tijdstip($A82,B$8,B$11))","v":{"$error":"#NAME?"}},"W",null,null,{"$f":"(0.75*F$18*FLOOR(F$20,0.05)*0.9*F$35*F$38*o_Isol_Bij_Tijdstip($A82,F$8,F$11))+(0.75*H$18*FLOOR(H$20,0.05)*0.9*H$35*H$38*o_Isol_Bij_Tijdstip($A82,F$8,F$11))","v":{"$error":"#NAME?"}},"W",null,null,{"$f":"(0.75*J$18*FLOOR(J$20,0.05)*0.9*J$35*J$38*o_Isol_Bij_Tijdstip($A82,J$8,J$11))+(0.75*L$18*FLOOR(L$20,0.05)*0.9*L$35*L$38*o_Isol_Bij_Tijdstip($A82,J$8,J$11))","v":{"$error":"#NAME?"}},"W",null,null,{"$f":"(0.75*N$18*FLOOR(N$20,0.05)*0.9*N$35*N$38*o_Isol_Bij_Tijdstip($A82,N$8,N$11))+(0.75*P$18*FLOOR(P$20,0.05)*0.9*P$35*P$38*o_Isol_Bij_Tijdstip($A82,N$8,N$11))","v":{"$error":"#NAME?"}},"W",null,null,{"$f":"(0.75*R$18*FLOOR(R$20,0.05)*0.9*R$35*R$38*o_Isol_Bij_Tijdstip($A82,R$8,R$11))+(0.75*T$18*FLOOR(T$20,0.05)*0.9*T$35*T$38*o_Isol_Bij_Tijdstip($A82,R$8,R$11))","v":0},"W",{"$error":"#NAME?"},"W"]
["15:00:00",{"$f":"(0.75*B$18*FLOOR(B$20,0.05)*0.9*B$35*B$38*o_Isol_Bij_Tijdstip($A83,B$8,B$11))+(0.75*D$18*FLOOR(D$20,0.05)*0.9*D$35*D$38*o_Isol_Bij_Tijdstip($A83,B$8,B$11))","v":{"$error":"#NAME?"}},"W",null,null,{"$f":"(0.75*F$18*FLOOR(F$20,0.05)*0.9*F$35*F$38*o_Isol_Bij_Tijdstip($A83,F$8,F$11))+(0.75*H$18*FLOOR(H$20,0.05)*0.9*H$35*H$38*o_Isol_Bij_Tijdstip($A83,F$8,F$11))","v":{"$error":"#NAME?"}},"W",null,null,{"$f":"(0.75*J$18*FLOOR(J$20,0.05)*0.9*J$35*J$38*o_Isol_Bij_Tijdstip($A83,J$8,J$11))+(0.75*L$18*FLOOR(L$20,0.05)*0.9*L$35*L$38*o_Isol_Bij_Tijdstip($A83,J$8,J$11))","v":{"$error":"#NAME?"}},"W",null,null,{"$f":"(0.75*N$18*FLOOR(N$20,0.05)*0.9*N$35*N$38*o_Isol_Bij_Tijdstip($A83,N$8,N$11))+(0.75*P$18*FLOOR(P$20,0.05)*0.9*P$35*P$38*o_Isol_Bij_Tijdstip($A83,N$8,N$11))","v":{"$error":"#NAME?"}},"W",null,null,{"$f":"(0.75*R$18*FLOOR(R$20,0.05)*0.9*R$35*R$38*o_Isol_Bij_Tijdstip($A83,R$8,R$11))+(0.75*T$18*FLOOR(T$20,0.05)*0.9*T$35*T$38*o_Isol_Bij_Tijdstip($A83,R$8,R$11))","v":0},"W",{"$error":"#NAME?"},"W"]
["16:00:00",{"$f":"(0.75*B$18*FLOOR(B$20,0.05)*0.9*B$35*B$38*o_Isol_Bij_Tijdstip($A84,B$8,B$11))+(0.75*D$18*FLOOR(D$20,0.05)*0.9*D$35*D$38*o_Isol_Bij_Tijdstip($A84,B$8,B$11))","v":{"$error":"#NAME?"}},"W",null,null,{"$f":"(0.75*F$18*FLOOR(F$20,0.05)*0.9*F$35*F$38*o_Isol_Bij_Tijdstip($A84,F$8,F$11))+(0.75*H$18*FLOOR(H$20,0.05)*0.9*H$35*H$38*o_Isol_Bij_Tijdstip($A84,F$8,F$11))","v":{"$error":"#NAME?"}},"W",null,null,{"$f":"(0.75*J$18*FLOOR(J$20,0.05)*0.9*J$35*J$38*o_Isol_Bij_Tijdstip($A84,J$8,J$11))+(0.75*L$18*FLOOR(L$20,0.05)*0.9*L$35*L$38*o_Isol_Bij_Tijdstip($A84,J$8,J$11))","v":{"$error":"#NAME?"}},"W",null,null,{"$f":"(0.75*N$18*FLOOR(N$20,0.05)*0.9*N$35*N$38*o_Isol_Bij_Tijdstip($A84,N$8,N$11))+(0.75*P$18*FLOOR(P$20,0.05)*0.9*P$35*P$38*o_Isol_Bij_Tijdstip($A84,N$8,N$11))","v":{"$error":"#NAME?"}},"W",null,null,{"$f":"(0.75*R$18*FLOOR(R$20,0.05)*0.9*R$35*R$38*o_Isol_Bij_Tijdstip($A84,R$8,R$11))+(0.75*T$18*FLOOR(T$20,0.05)*0.9*T$35*T$38*o_Isol_Bij_Tijdstip($A84,R$8,R$11))","v":0},"W",{"$error":"#NAME?"},"W"]
["17:00:00",{"$f":"(0.75*B$18*FLOOR(B$20,0.05)*0.9*B$35*B$38*o_Isol_Bij_Tijdstip($A85,B$8,B$11))+(0.75*D$18*FLOOR(D$20,0.05)*0.9*D$35*D$38*o_Isol_Bij_Tijdstip($A85,B$8,B$11))","v":{"$error":"#NAME?"}},"W",null,null,{"$f":"(0.75*F$18*FLOOR(F$20,0.05)*0.9*F$35*F$38*o_Isol_Bij_Tijdstip($A85,F$8,F$11))+(0.75*H$18*FLOOR(H$20,0.05)*0.9*H$35*H$38*o_Isol_Bij_Tijdstip($A85,F$8,F$11))","v":{"$error":"#NAME?"}},"W",null,null,{"$f":"(0.75*J$18*FLOOR(J$20,0.05)*0.9*J$35*J$38*o_Isol_Bij_Tijdstip($A85,J$8,J$11))+(0.75*L$18*FLOOR(L$20,0.05)*0.9*L$35*L$38*o_Isol_Bij_Tijdstip($A85,J$8,J$11))","v":{"$error":"#NAME?"}},"W",null,null,{"$f":"(0.75*N$18*FLOOR(N$20,0.05)*0.9*N$35*N$38*o_Isol_Bij_Tijdstip($A85,N$8,N$11))+(0.75*P$18*FLOOR(P$20,0.05)*0.9*P$35*P$38*o_Isol_Bij_Tijdstip($A85,N$8,N$11))","v":{"$error":"#NAME?"}},"W",null,null,{"$f":"(0.75*R$18*FLOOR(R$20,0.05)*0.9*R$35*R$38*o_Isol_Bij_Tijdstip($A85,R$8,R$11))+(0.75*T$18*FLOOR(T$20,0.05)*0.9*T$35*T$38*o_Isol_Bij_Tijdstip($A85,R$8,R$11))","v":0},"W",{"$error":"#NAME?"},"W"]
["18:00:00",{"$f":"(0.75*B$18*FLOOR(B$20,0.05)*0.9*B$35*B$38*o_Isol_Bij_Tijdstip($A86,B$8,B$11))+(0.75*D$18*FLOOR(D$20,0.05)*0.9*D$35*D$38*o_Isol_Bij_Tijdstip($A86,B$8,B$11))","v":{"$error":"#NAME?"}},"W",null,null,{"$f":"(0.75*F$18*FLOOR(F$20,0.05)*0.9*F$35*F$38*o_Isol_Bij_Tijdstip($A86,F$8,F$11))+(0.75*H$18*FLOOR(H$20,0.05)*0.9*H$35*H$38*o_Isol_Bij_Tijdstip($A86,F$8,F$11))","v":{"$error":"#NAME?"}},"W",null,null,{"$f":"(0.75*J$18*FLOOR(J$20,0.05)*0.9*J$35*J$38*o_Isol_Bij_Tijdstip($A86,J$8,J$11))+(0.75*L$18*FLOOR(L$20,0.05)*0.9*L$35*L$38*o_Isol_Bij_Tijdstip($A86,J$8,J$11))","v":{"$error":"#NAME?"}},"W",null,null,{"$f":"(0.75*N$18*FLOOR(N$20,0.05)*0.9*N$35*N$38*o_Isol_Bij_Tijdstip($A86,N$8,N$11))+(0.75*P$18*FLOOR(P$20,0.05)*0.9*P$35*P$38*o_Isol_Bij_Tijdstip($A86,N$8,N$11))","v":{"$error":"#NAME?"}},"W",null,null,{"$f":"(0.75*R$18*FLOOR(R$20,0.05)*0.9*R$35*R$38*o_Isol_Bij_Tijdstip($A86,R$8,R$11))+(0.75*T$18*FLOOR(T$20,0.05)*0.9*T$35*T$38*o_Isol_Bij_Tijdstip($A86,R$8,R$11))","v":0},"W",{"$error":"#NAME?"},"W"]
[]
["Maatgevende tijdstip",{"$f":"IF(MAX(T77:T86)=0,\"Geen glas aanwezig\",_xlfn.XLOOKUP(MAX(T77:T86),T77:T86,A77:A86,\"nvt\"))","v":{"$error":"#NAME?"}}]

{"sheet":"Ruimte 8","index":10,"n_rows":88,"n_cols":21,"rows_kept":88,"cut":false,"hidden":false,"merged":[[70,0,71,20],[0,0,0,20],[6,1,6,3],[6,5,6,7],[6,9,6,11],[6,13,6,15],[6,17,6,20],[41,1,41,3],[41,5,41,7],[41,9,41,11],[41,13,41,15],[41,17,41,19],[40,1,40,3],[40,5,40,7],[40,9,40,11],[40,13,40,15],[40,17,40,19],[55,1,55,3],[55,5,55,7],[55,9,55,11],[55,13,55,15],[55,17,55,19],[54,1,54,3],[54,5,54,7],[54,9,54,11],[54,13,54,15],[54,17,54,19],[56,5,56,7],[56,9,56,11],[56,13,56,15],[56,17,56,19],[57,1,57,3],[57,5,57,7],[57,9,57,11],[57,13,57,15],[57,17,57,19],[59,1,59,3],[60,1,60,3],[62,1,62,3],[63,1,63,3],[56,1,56,3]]}
["RUIMTE 8"]
[]
["Ruimtenaam",8]
["Type verblijfsruimte","Andere verblijfsruimte"]
["Vloeroppervlak verblijfsruimte Avr  (gebruiksoppervlak)",0,"m²"]
[]
[null,"Voorzijde woning",null,null,null,"Linker zijde woning",null,null,null,"Achterzijde woning",null,null,null,"Rechter zijde woning",null,null,null,"Platdak"]
["Orientatie gevel / dakvlak (Helling > 15°C)",{"$f":"'Projectgegevens en Resultaten'!$B$17","v":0},null,null,null,{"$f":"o_Orientatie(F9)","v":{"$error":"#NAME?"}},null,null,null,{"$f":"o_Orientatie(J9)","v":{"$error":"#NAME?"}},null,null,null,{"$f":"o_Orientatie(N9)","v":{"$error":"#NAME?"}},null,null,null,"Horizontaal"]
["Orientatiehoek gevel Ƴ",{"$f":"o_OrientatiehOEK(B8)","v":{"$error":"#NAME?"}},null,null,null,{"$f":"IF(B9+90>360,B9+90-360,B9+90)","v":{"$error":"#NAME?"}},null,null,null,{"$f":"IF(F9+90>360,F9+90-360,F9+90)","v":{"$error":"#NAME?"}},null,null,null,{"$f":"IF(J9+90>360,J9+90-360,J9+90)","v":{"$error":"#NAME?"}}]
["Grenst aan buitenlucht ja of nee","Nee",null,null,null,"Nee",null,null,null,"Nee",null,null,null,"Nee",null,null,null,"Nee"]
["Hellingshoek constructie ≥ 15° = hellenddak 90° = gevel",90,"°",null,null,90,"°",null,null,90,"°",null,null,90,"°",null,null,0,"°"]
["Type constructie",{"$f":"o_TypeConstructie(B10,B11)","v":"Woningscheidend"},null,null,null,{"$f":"o_TypeConstructie(F10,F11)","v":"Woningscheidend"},null,null,null,{"$f":"o_TypeConstructie(J10,J11)","v":"Woningscheidend"},null,null,null,{"$f":"o_TypeConstructie(N10,N11)","v":"Woningscheidend"},null,null,null,{"$f":"o_TypeConstructie(R10,R11)","v":"Woningscheidend"}]
["Gevel lengte (binnenwerks)",null,"m",null,null,null,"m",null,null,null,"m",null,null,null,"m",null,null,null,"m"]
["Gevel hoogte / Dak breedte (binnenwerks)",null,"m",null,null,null,"m",null,null,null,"m",null,null,null,"m",null,null,null,"m"]
["Constructie oppervlak (binnenwerks)",{"$f":"B13*B14","v":0},"m²",null,null,{"$f":"F13*F14","v":0},"m²",null,null,{"$f":"J13*J14","v":0},"m²",null,null,{"$f":"N13*N14","v":0},"m²",null,null,{"$f":"R13*R14","v":0},"m²"]
["Gesloten constructie oppervlak",{"$f":"MAX(0,B15-B18-D18)","v":0},"m²",null,null,{"$f":"MAX(0,F15-F18-H18)","v":0},"m²",null,null,{"$f":"MAX(0,J15-J18-L18)","v":0},"m²",null,null,{"$f":"MAX(0,N15-N18-P18)","v":0},"m²",null,null,{"$f":"MAX(0,R15-R18-T18)","v":0},"m²"]
[null,"Glasvlak type 1",null,"Glasvlak type 2",null,"Glasvlak type 1",null,"Glasvlak type 2",null,"Glasvlak type 1",null,"Glasvlak type 2",null,"Glasvlak type 1",null,"Glasvlak type 2",null,"Glasvlak type 1",null,"Glasvlak type 2"]
["Totaal oppervlak van raamtype Aw,k (inclusief kozijn)",null,"m²",null,"m²",null,"m²",null,"m²",null,"m²",null,"m²",null,"m²",null,"m²",null,"m²",null,"m²"]
["Warmtedoorgangscoefficient (U-waarde) van het raam Uw;wi;k",null,"W/m².K",null,"W/m².K",null,"W/m².K",null,"W/m².K",null,"W/m².K",null,"W/m².K",null,"W/m².K",null,"W/m².K",null,"W/m².K",null,"W/m².K"]
["Zontoetredingsfactor (g_waarde) van het glas Ggl;n;wi;k;C;juli",1,null,1,null,1,null,1,null,1,null,1,null,1,null,1,null,1,null,1]
["Beschaduwing situatie bij het raamtype","Minimale belemmering",null,"Minimale belemmering",null,"Minimale belemmering",null,"Minimale belemmering",null,"Minimale belemmering",null,"Minimale belemmering",null,"Minimale belemmering",null,"Minimale belemmering",null,"Minimale belemmering",null,"Minimale belemmering"]
[]
[null,"Overstek",null,"Overstek",null,"Overstek",null,"Overstek",null,"Overstek",null,"Overstek",null,"Overstek",null,"Overstek"]
["Hoogte verschil midden raam onderzijde overstek",0,"m",0,"m",0,"m",0,"m",0,"m",0,"m",0,"m",0,"m",0,null,0,"m"]
["Horizontale afstand glas tot eindpunt overstek",0,"m",0,"m",0,"m",0,"m",0,"m",0,"m",0,"m",0,"m",0,null,0,"m"]
["Overstekhoek",{"$f":"IFERROR(180/PI()*ATAN(B24/B25),0)","v":0},"°",{"$f":"IFERROR(180/PI()*ATAN(D24/D25),0)","v":0},"°",{"$f":"IFERROR(180/PI()*ATAN(F24/F25),0)","v":0},"°",{"$f":"IFERROR(180/PI()*ATAN(H24/H25),0)","v":0},"°",{"$f":"IFERROR(180/PI()*ATAN(J24/J25),0)","v":0},"°",{"$f":"IFERROR(180/PI()*ATAN(L24/L25),0)","v":0},"°",{"$f":"IFERROR(180/PI()*ATAN(N24/N25),0)","v":0},"°",{"$f":"IFERROR(180/PI()*ATAN(P24/P25),0)","v":0},"°",null,null,null,"°"]
["Relatieve hoogte van overstek",{"$f":"IFERROR(B24/B25,1)","v":1},null,{"$f":"IFERROR(D24/D25,1)","v":1},null,{"$f":"IFERROR(F24/F25,1)","v":1},null,{"$f":"IFERROR(H24/H25,1)","v":1},null,{"$f":"IFERROR(J24/J25,1)","v":1},null,{"$f":"IFERROR(L24/L25,1)","v":1},null,{"$f":"IFERROR(N24/N25,1)","v":1},null,{"$f":"IFERROR(P24/P25,1)","v":1}]
[]
[null,"Zijbelemmering",null,"Zijbelemmering",null,"Zijbelemmering",null,"Zijbelemmering",null,"Zijbelemmering",null,"Zijbelemmering",null,"Zijbelemmering",null,"Zijbelemmering"]
["Positie zijbelemmering irt zichtveld (naar buitengericht)","Links",null,"Links",null,"Links",null,"Links",null,"Links",null,"Links",null,"Links",null,"Links",null,"Links",null,"Links"]
["Horizontale afstand midden raam verste punt belemmering",0,"m",0,"m",0,"m",0,"m",0,"m",0,"m",0,"m",0,"m",0,null,0,"m"]
["Horizontale breedte glas tot eindpunt belemmering",0,"m",0,"m",0,"m",0,"m",0,"m",0,"m",0,"m",0,"m",0,null,0,"m"]
["Relatieve breedte van de zijbelemmering bb",{"$f":"IFERROR(B31/B32,999)","v":999},null,{"$f":"IFERROR(D31/D32,999)","v":999},null,{"$f":"IFERROR(F31/F32,999)","v":999},null,{"$f":"IFERROR(H31/H32,999)","v":999},null,{"$f":"IFERROR(J31/J32,999)","v":999},null,{"$f":"IFERROR(L31/L32,999)","v":999},null,{"$f":"IFERROR(N31/N32,999)","v":999},null,{"$f":"IFERROR(P31/P32,999)","v":999}]
[]
["De beschaduwingsreductiefactor Fsh;obst;wi;k;juli",{"$f":"IFERROR(o_Beschaduwingreductie(B21,B8,B27,B30,B33,B11),1)","v":1},null,{"$f":"IFERROR(o_Beschaduwingreductie(D21,B8,D27,D30,D33,B11),1)","v":1},null,{"$f":"IFERROR(o_Beschaduwingreductie(F21,F8,F27,F30,F33,F11),1)","v":1},null,{"$f":"IFERROR(o_Beschaduwingreductie(H21,F8,H27,H30,H33,F11),1)","v":1},null,{"$f":"IFERROR(o_Beschaduwingreductie(J21,J8,J27,J30,J33,J11),1)","v":1},null,{"$f":"IFERROR(o_Beschaduwingreductie(L21,J8,L27,L30,L33,J11),1)","v":1},null,{"$f":"IFERROR(o_Beschaduwingreductie(N21,N8,N27,N30,N33,N11),1)","v":1},null,{"$f":"IFERROR(o_Beschaduwingreductie(P21,N8,P27,P30,P33,N11),1)","v":1},null,{"$f":"o_Beschaduwingreductie(R21,R8,R27,R30,R33,R11)","v":1},null,{"$f":"o_Beschaduwingreductie(T21,R8,T27,T30,T33,R11)","v":1}]
[]
["Type zonwering","Geen zonwering",null,"Geen zonwering",null,"Geen zonwering",null,"Geen zonwering",null,"Geen zonwering",null,"Geen zonwering",null,"Geen zonwering",null,"Geen zonwering",null,"Geen zonwering",null,"Geen zonwering"]
["De reductiefactor voor zonwering Fc;wi;k",{"$f":"o_Zonweringreductie(B37,B8)","v":{"$error":"#NAME?"}},null,{"$f":"o_Zonweringreductie(D37,B8)","v":{"$error":"#NAME?"}},null,{"$f":"o_Zonweringreductie(F37,F8)","v":{"$error":"#NAME?"}},null,{"$f":"o_Zonweringreductie(H37,F8)","v":{"$error":"#NAME?"}},null,{"$f":"o_Zonweringreductie(J37,J8)","v":{"$error":"#NAME?"}},null,{"$f":"o_Zonweringreductie(L37,J8)","v":{"$error":"#NAME?"}},null,{"$f":"o_Zonweringreductie(N37,N8)","v":{"$error":"#NAME?"}},null,{"$f":"o_Zonweringreductie(P37,N8)","v":{"$error":"#NAME?"}},null,{"$f":"o_Zonweringreductie(R37,R8)","v":1},null,{"$f":"o_Zonweringreductie(T37,R8)","v":1}]
["Totaal opvallende zonnestraling van het raam Isol;wi;k;juli",{"$f":"IF(B10=\"Nee\",0,o_Isol_Bij_Tijdstip($B$52,B8,B11))","v":0},"W/m²",{"$f":"IF(B10=\"Nee\",0,o_Isol_Bij_Tijdstip($B$52,B8,B11))","v":0},"W/m²",{"$f":"IF(F10=\"Nee\",0,o_Isol_Bij_Tijdstip($B$52,F8,F11))","v":0},"W/m²",{"$f":"IF(F10=\"Nee\",0,o_Isol_Bij_Tijdstip($B$52,F8,F11))","v":0},"W/m²",{"$f":"IF(J10=\"Nee\",0,o_Isol_Bij_Tijdstip($B$52,J8,J11))","v":0},"W/m²",{"$f":"IF(J10=\"Nee\",0,o_Isol_Bij_Tijdstip($B$52,J8,J11))","v":0},"W/m²",{"$f":"IF(N10=\"Nee\",0,o_Isol_Bij_Tijdstip($B$52,N8,N11))","v":0},"W/m²",{"$f":"IF(N10=\"Nee\",0,o_Isol_Bij_Tijdstip($B$52,N8,N11))","v":0},"W/m²",{"$f":"IF(R10=\"Nee\",0,o_Isol_Bij_Tijdstip($B$52,R8,R11))","v":0},"W/m²",{"$f":"IF(R10=\"Nee\",0,o_Isol_Bij_Tijdstip($B$52,R8,R11))","v":0},"W/m²"]
[]
["Tijdstip maximale koellastbijdrage tmax;zi",{"$f":"VALUE(o_Tijdstip_Isol_Max_Orientatie(B8,B11))","v":{"$error":"#NAME?"}},null,null,null,{"$f":"VALUE(o_Tijdstip_Isol_Max_Orientatie(F8,F11))","v":{"$error":"#NAME?"}},null,null,null,{"$f":"VALUE(o_Tijdstip_Isol_Max_Orientatie(J8,J11))","v":{"$error":"#NAME?"}},null,null,null,{"$f":"VALUE(o_Tijdstip_Isol_Max_Orientatie(N8,N11))","v":{"$error":"#NAME?"}},null,null,null,{"$f":"o_Tijdstip_Isol_Max_Orientatie(R8,R11)","v":"12:00:00 PM"}]
["Buitenluchttemperatuur op tijdstip max koellast Θe",{"$f":"o_maxTemp(VALUE(B41))","v":{"$error":"#NAME?"}},null,null,"°C",{"$f":"o_maxTemp(VALUE(F41))","v":{"$error":"#NAME?"}},null,null,"°C",{"$f":"o_maxTemp(VALUE(J41))","v":{"$error":"#NAME?"}},null,null,"°C",{"$f":"o_maxTemp(VALUE(N41))","v":{"$error":"#NAME?"}},null,null,"°C",{"$f":"o_maxTemp(VALUE(R41))","v":29.5}]
[]
["Glasopppervlak",{"$f":"IF(B10=\"Ja\",B18+D18,0)","v":0},"m²",null,null,{"$f":"IF(F10=\"Ja\",F18+H18,0)","v":0},"m²",null,null,{"$f":"IF(J10=\"Ja\",J18+L18,0)","v":0},"m²",null,null,{"$f":"IF(N10=\"Ja\",N18+P18,0)","v":0},"m²",null,null,{"$f":"IF(R10=\"Ja\",R18+T18,0)","v":0},"m²"]
["Uitwendigescheidingsconstructie niet op Noord?",{"$f":"IF(B10=\"Ja\",IF(B8=\"Noord\",FALSE,TRUE),FALSE)","v":false},null,null,null,{"$f":"IF(F10=\"Ja\",IF(F8=\"Noord\",FALSE,TRUE),FALSE)","v":false},null,null,null,{"$f":"IF(J10=\"Ja\",IF(J8=\"Noord\",FALSE,TRUE),FALSE)","v":false},null,null,null,{"$f":"IF(N10=\"Ja\",IF(N8=\"Noord\",FALSE,TRUE),FALSE)","v":false},null,null,null,{"$f":"IF(R10=\"Ja\",IF(R8=\"Noord\",FALSE,TRUE),FALSE)","v":false}]
["De enige uitwendigescheidingscontructie?",{"$f":"IF(AND(B45=TRUE,COUNTIF($B$45:$R$45,TRUE)=1),TRUE,FALSE)","v":false},null,null,null,{"$f":"IF(AND(F45=TRUE,COUNTIF($B$45:$R$45,TRUE)=1),TRUE,FALSE)","v":false},null,null,null,{"$f":"IF(AND(J45=TRUE,COUNTIF($B$45:$R$45,TRUE)=1),TRUE,FALSE)","v":false},null,null,null,{"$f":"IF(AND(N45=TRUE,COUNTIF($B$45:$R$45,TRUE)=1),TRUE,FALSE)","v":false},null,null,null,{"$f":"IF(AND(R45=TRUE,COUNTIF($B$45:$R$45,TRUE)=1),TRUE,FALSE)","v":false}]
["Totaal glasoppervlak",{"$f":"IF(B8<>\"Noord\",B44,0)","v":0},"m²",null,null,{"$f":"IF(F8<>\"Noord\",F44,0)","v":{"$error":"#NAME?"}},"m²",null,null,{"$f":"IF(J8<>\"Noord\",J44,0)","v":{"$error":"#NAME?"}},"m²",null,null,{"$f":"IF(N8<>\"Noord\",N44,0)","v":{"$error":"#NAME?"}},"m²",null,null,{"$f":"R44","v":0},"m²"]
["Grootste glasoppervlak ",{"$f":"IF(AND(B45,B47=MAX($B$47:$R$47)),TRUE,FALSE)","v":{"$error":"#NAME?"}},null,null,null,{"$f":"IF(AND(F45,F47=MAX($B$47:$R$47)),TRUE,FALSE)","v":{"$error":"#NAME?"}},null,null,null,{"$f":"IF(AND(J45,J47=MAX($B$47:$R$47)),TRUE,FALSE)","v":{"$error":"#NAME?"}},null,null,null,{"$f":"IF(AND(N45,N47=MAX($B$47:$R$47)),TRUE,FALSE)","v":{"$error":"#NAME?"}},null,null,null,{"$f":"IF(AND(R45,R47=MAX($B$47:$R$47)),TRUE,FALSE)","v":{"$error":"#NAME?"}}]
["Dakvlak maatgevend?",{"$f":"IF(AND(B11<90,B15>3*(B18+D18),'Projectgegevens en Resultaten'!#REF!<65),TRUE,FALSE)","v":{"$error":"#REF!"}},null,null,null,{"$f":"IF(AND(F11<90,F15>3*(F18+H18),'Projectgegevens en Resultaten'!#REF!<65),TRUE,FALSE)","v":{"$error":"#REF!"}},null,null,null,{"$f":"IF(AND(J11<90,J15>3*(J18+L18),'Projectgegevens en Resultaten'!#REF!<65),TRUE,FALSE)","v":{"$error":"#REF!"}},null,null,null,{"$f":"IF(AND(N11<90,N15>3*(N18+P18),'Projectgegevens en Resultaten'!#REF!<65),TRUE,FALSE)","v":{"$error":"#REF!"}},null,null,null,{"$f":"IF(AND(R11<90,R15>3*(R18+T18),'Projectgegevens en Resultaten'!#REF!<65),TRUE,FALSE)","v":{"$error":"#REF!"}}]
["is er een maatgevend dakoppervlak",{"$f":"IF(COUNTIF($B$49:$R$49,TRUE)>0,TRUE,FALSE)","v":false},null,null,null,{"$f":"IF(COUNTIF($B$49:$R$49,TRUE)>0,TRUE,FALSE)","v":false},null,null,null,{"$f":"IF(COUNTIF($B$49:$R$49,TRUE)>0,TRUE,FALSE)","v":false},null,null,null,{"$f":"IF(COUNTIF($B$49:$R$49,TRUE)>0,TRUE,FALSE)","v":false},null,null,null,{"$f":"IF(COUNTIF($B$49:$R$49,TRUE)>0,TRUE,FALSE)","v":false}]
["Maatgevende tijdstip",{"$f":"IF(OR(B46,AND(B45,B50,B49),AND(B45,B48,NOT(B50))),B41)","v":{"$error":"#REF!"}},null,null,null,{"$f":"IF(OR(F46,AND(F45,F50,F49),AND(F45,F48,NOT(F50))),F41)","v":{"$error":"#REF!"}},null,null,null,{"$f":"IF(OR(J46,AND(J45,J50,J49),AND(J45,J48,NOT(J50))),J41)","v":{"$error":"#REF!"}},null,null,null,{"$f":"IF(OR(N46,AND(N45,N50,N49),AND(N45,N48,NOT(N50))),N41)","v":{"$error":"#REF!"}},null,null,null,{"$f":"IF(OR(R46,AND(R45,R50,R49),AND(R45,R48,NOT(R50))),R41)","v":{"$error":"#REF!"}}]
["Maatgevende tijdstip tmax;zi",{"$f":"IFERROR(B88,\"geen glas ingevoerd\")","v":"geen glas ingevoerd"}]
["Buitenluchttemperatuur op tijdstip max koellast Θe",{"$f":"o_maxTemp(VALUE(B52))","v":{"$error":"#NAME?"}},"°C"]
[]
["Koellastbijdrage transmissie ondoorzichtige delen Ptr;ntr;vr;zi",{"$f":"IF(B10=\"Nee\",0,B16*'Projectgegevens en Resultaten'!$B$16)","v":0},null,null,"W",{"$f":"IF(F10=\"Nee\",0,F16*'Projectgegevens en Resultaten'!$B$16)","v":0},null,null,"W",{"$f":"IF(J10=\"Nee\",0,J16*'Projectgegevens en Resultaten'!$B$16)","v":0},null,null,"W",{"$f":"IF(N10=\"Nee\",0,N16*'Projectgegevens en Resultaten'!$B$16)","v":0},null,null,"W",{"$f":"IF(R10=\"Nee\",0,R16*'Projectgegevens en Resultaten'!$B$16)","v":0},null,null,"W"]
["Koellastbijdrage zoninstraling transparante delen Psol;vr;zi",{"$f":"(0.75*B18*FLOOR(B20,0.05)*0.9*B35*B38*B39)+(0.75*D18*FLOOR(D20,0.05)*0.9*D35*D38*D39)","v":{"$error":"#NAME?"}},null,null,"W",{"$f":"(0.75*F18*FLOOR(F20,0.05)*0.9*F35*F38*F39)+(0.75*H18*FLOOR(H20,0.05)*0.9*H35*H38*H39)","v":{"$error":"#NAME?"}},null,null,"W",{"$f":"(0.75*J18*FLOOR(J20,0.05)*0.9*J35*J38*J39)+(0.75*L18*FLOOR(L20,0.05)*0.9*L35*L38*L39)","v":{"$error":"#NAME?"}},null,null,"W",{"$f":"(0.75*N18*FLOOR(N20,0.05)*0.9*N35*N38*N39)+(0.75*P18*FLOOR(P20,0.05)*0.9*P35*P38*P39)","v":{"$error":"#NAME?"}},null,null,"W",{"$f":"(0.75*R18*FLOOR(R20,0.05)*0.9*R35*R38*R39)+(0.75*T18*FLOOR(T20,0.05)*0.9*T35*T38*T39)","v":0},null,null,"W"]
["Koellastbijdrage transmissie transparante delen Ptr;gl;vr;zi",{"$f":"IF(B10=\"Nee\",0,IFERROR(B18*B19*($B$53-24),0)+IFERROR(D18*D19*($B$53-24),0))","v":0},null,null,"W",{"$f":"IF(F10=\"Nee\",0,IFERROR(F18*F19*($B$53-24),0)+IFERROR(H18*H19*($B$53-24),0))","v":0},null,null,"W",{"$f":"IF(J10=\"Nee\",0,IFERROR(J18*J19*($B$53-24),0)+IFERROR(L18*L19*($B$53-24),0))","v":0},null,null,"W",{"$f":"IF(N10=\"Nee\",0,IFERROR(N18*N19*($B$53-24),0)+IFERROR(P18*P19*($B$53-24),0))","v":0},null,null,"W",{"$f":"IF(R10=\"Nee\",0,IFERROR(R18*R19*($B$53-24),0)+IFERROR(T18*T19*($B$53-24),0))","v":0},null,null,"W"]
["Totaal koellastbijdrage per gevel",{"$f":"SUM(B55:D57)","v":{"$error":"#NAME?"}},null,null,"W",{"$f":"SUM(F55:H57)","v":{"$error":"#NAME?"}},null,null,"W",{"$f":"SUM(J55:L57)","v":{"$error":"#NAME?"}},null,null,"W",{"$f":"SUM(N55:P57)","v":{"$error":"#NAME?"}},null,null,"W",{"$f":"SUM(R55:R57)","v":0},null,null,"W"]
[]
["Koellast door interne warmtelast Pint;calc;woon/overig;zi",{"$f":"IF(B5=0,0,IF(B4=\"Woonvertrek\",2*'Projectgegevens en Resultaten'!$B$33*B5,'Projectgegevens en Resultaten'!$B$33*B5))","v":0},null,null,"W"]
["Koellast door buitenluchttoetreding Pv;calc;vr;zi",{"$f":"IFERROR(MAX((SUM('Projectgegevens en Resultaten'!$B$21:$B$23)/3600*1.205*1005*(B53-24))/SUM('Projectgegevens en Resultaten'!$B$40:$T$40)*B5,0),0)","v":0},{"$f":"IFERROR(MAX(SUM(C57:C59)/3600*1.205*1005*(C60-24),0),0)","v":0},{"$f":"IFERROR(MAX(SUM(D57:D59)/3600*1.205*1005*(D60-24),0),0)","v":0},"W"]
[]
["Totaal koellastbijdrage",{"$f":"IFERROR(SUM(B58:T58)+B60+B61,0)","v":0},null,null,"W"]
["Koelbehoefte verblijfsruimte",{"$f":"IFERROR(B63/B5,0)","v":0},null,null,"W/m²"]
[]
[]
[]
[]
[]
[]
["Onderstaande tabellen worden verborgen in de uiteindelijke versie. De tabellen dienen om vast te stellen welk tijdstip tot de hoogste zonbelasting leidt"]
[]
["Isol max voor de orientatie",{"$f":"o_Isol_Max_Orientatie(B8,B11)","v":{"$error":"#NAME?"}},"W/m²",null,null,{"$f":"o_Isol_Max_Orientatie(F8,F11)","v":{"$error":"#NAME?"}},"W/m²",null,null,{"$f":"o_Isol_Max_Orientatie(J8,J11)","v":{"$error":"#NAME?"}},"W/m²",null,null,{"$f":"o_Isol_Max_Orientatie(N8,N11)","v":{"$error":"#NAME?"}},"W/m²",null,null,{"$f":"o_Isol_Max_Orientatie(R8,R11)","v":914.11856204111336},"W/m²"]
["Tijdstip bij Isol max bij orientatie",{"$f":"VALUE(o_Tijdstip_Isol_Max_Orientatie(B8,B11))","v":{"$error":"#NAME?"}},null,null,null,{"$f":"VALUE(o_Tijdstip_Isol_Max_Orientatie(F8,F11))","v":{"$error":"#NAME?"}},null,null,null,{"$f":"VALUE(o_Tijdstip_Isol_Max_Orientatie(J8,J11))","v":{"$error":"#NAME?"}},null,null,null,{"$f":"VALUE(o_Tijdstip_Isol_Max_Orientatie(N8,N11))","v":{"$error":"#NAME?"}},null,null,null,{"$f":"VALUE(o_Tijdstip_Isol_Max_Orientatie(R8,R11))","v":"12:00:00"}]
[]
["Koellastbijdrage zoninstraling transparante delen Psol;vr;zi"]
["09:00:00",{"$f":"(0.75*B$18*FLOOR(B$20,0.05)*0.9*B$35*B$38*o_Isol_Bij_Tijdstip($A77,B$8,B$11))+(0.75*D$18*FLOOR(D$20,0.05)*0.9*D$35*D$38*o_Isol_Bij_Tijdstip($A77,B$8,B$11))","v":{"$error":"#NAME?"}},"W",null,null,{"$f":"(0.75*F$18*FLOOR(F$20,0.05)*0.9*F$35*F$38*o_Isol_Bij_Tijdstip($A77,F$8,F$11))+(0.75*H$18*FLOOR(H$20,0.05)*0.9*H$35*H$38*o_Isol_Bij_Tijdstip($A77,F$8,F$11))","v":{"$error":"#NAME?"}},"W",null,null,{"$f":"(0.75*J$18*FLOOR(J$20,0.05)*0.9*J$35*J$38*o_Isol_Bij_Tijdstip($A77,J$8,J$11))+(0.75*L$18*FLOOR(L$20,0.05)*0.9*L$35*L$38*o_Isol_Bij_Tijdstip($A77,J$8,J$11))","v":{"$error":"#NAME?"}},"W",null,null,{"$f":"(0.75*N$18*FLOOR(N$20,0.05)*0.9*N$35*N$38*o_Isol_Bij_Tijdstip($A77,N$8,N$11))+(0.75*P$18*FLOOR(P$20,0.05)*0.9*P$35*P$38*o_Isol_Bij_Tijdstip($A77,N$8,N$11))","v":{"$error":"#NAME?"}},"W",null,null,{"$f":"(0.75*R$18*FLOOR(R$20,0.05)*0.9*R$35*R$38*o_Isol_Bij_Tijdstip($A77,R$8,R$11))+(0.75*T$18*FLOOR(T$20,0.05)*0.9*T$35*T$38*o_Isol_Bij_Tijdstip($A77,R$8,R$11))","v":0},"W",{"$f":"B77+F77+J77+N77+R77","v":{"$error":"#NAME?"}},"W"]
["10:00:00",{"$f":"(0.75*B$18*FLOOR(B$20,0.05)*0.9*B$35*B$38*o_Isol_Bij_Tijdstip($A78,B$8,B$11))+(0.75*D$18*FLOOR(D$20,0.05)*0.9*D$35*D$38*o_Isol_Bij_Tijdstip($A78,B$8,B$11))","v":{"$error":"#NAME?"}},"W",null,null,{"$f":"(0.75*F$18*FLOOR(F$20,0.05)*0.9*F$35*F$38*o_Isol_Bij_Tijdstip($A78,F$8,F$11))+(0.75*H$18*FLOOR(H$20,0.05)*0.9*H$35*H$38*o_Isol_Bij_Tijdstip($A78,F$8,F$11))","v":{"$error":"#NAME?"}},"W",null,null,{"$f":"(0.75*J$18*FLOOR(J$20,0.05)*0.9*J$35*J$38*o_Isol_Bij_Tijdstip($A78,J$8,J$11))+(0.75*L$18*FLOOR(L$20,0.05)*0.9*L$35*L$38*o_Isol_Bij_Tijdstip($A78,J$8,J$11))","v":{"$error":"#NAME?"}},"W",null,null,{"$f":"(0.75*N$18*FLOOR(N$20,0.05)*0.9*N$35*N$38*o_Isol_Bij_Tijdstip($A78,N$8,N$11))+(0.75*P$18*FLOOR(P$20,0.05)*0.9*P$35*P$38*o_Isol_Bij_Tijdstip($A78,N$8,N$11))","v":{"$error":"#NAME?"}},"W",null,null,{"$f":"(0.75*R$18*FLOOR(R$20,0.05)*0.9*R$35*R$38*o_Isol_Bij_Tijdstip($A78,R$8,R$11))+(0.75*T$18*FLOOR(T$20,0.05)*0.9*T$35*T$38*o_Isol_Bij_Tijdstip($A78,R$8,R$11))","v":0},"W",{"$error":"#NAME?"},"W"]
["11:00:00",{"$f":"(0.75*B$18*FLOOR(B$20,0.05)*0.9*B$35*B$38*o_Isol_Bij_Tijdstip($A79,B$8,B$11))+(0.75*D$18*FLOOR(D$20,0.05)*0.9*D$35*D$38*o_Isol_Bij_Tijdstip($A79,B$8,B$11))","v":{"$error":"#NAME?"}},"W",null,null,{"$f":"(0.75*F$18*FLOOR(F$20,0.05)*0.9*F$35*F$38*o_Isol_Bij_Tijdstip($A79,F$8,F$11))+(0.75*H$18*FLOOR(H$20,0.05)*0.9*H$35*H$38*o_Isol_Bij_Tijdstip($A79,F$8,F$11))","v":{"$error":"#NAME?"}},"W",null,null,{"$f":"(0.75*J$18*FLOOR(J$20,0.05)*0.9*J$35*J$38*o_Isol_Bij_Tijdstip($A79,J$8,J$11))+(0.75*L$18*FLOOR(L$20,0.05)*0.9*L$35*L$38*o_Isol_Bij_Tijdstip($A79,J$8,J$11))","v":{"$error":"#NAME?"}},"W",null,null,{"$f":"(0.75*N$18*FLOOR(N$20,0.05)*0.9*N$35*N$38*o_Isol_Bij_Tijdstip($A79,N$8,N$11))+(0.75*P$18*FLOOR(P$20,0.05)*0.9*P$35*P$38*o_Isol_Bij_Tijdstip($A79,N$8,N$11))","v":{"$error":"#NAME?"}},"W",null,null,{"$f":"(0.75*R$18*FLOOR(R$20,0.05)*0.9*R$35*R$38*o_Isol_Bij_Tijdstip($A79,R$8,R$11))+(0.75*T$18*FLOOR(T$20,0.05)*0.9*T$35*T$38*o_Isol_Bij_Tijdstip($A79,R$8,R$11))","v":0},"W",{"$error":"#NAME?"},"W"]
["12:00:00",{"$f":"(0.75*B$18*FLOOR(B$20,0.05)*0.9*B$35*B$38*o_Isol_Bij_Tijdstip($A80,B$8,B$11))+(0.75*D$18*FLOOR(D$20,0.05)*0.9*D$35*D$38*o_Isol_Bij_Tijdstip($A80,B$8,B$11))","v":{"$error":"#NAME?"}},"W",null,null,{"$f":"(0.75*F$18*FLOOR(F$20,0.05)*0.9*F$35*F$38*o_Isol_Bij_Tijdstip($A80,F$8,F$11))+(0.75*H$18*FLOOR(H$20,0.05)*0.9*H$35*H$38*o_Isol_Bij_Tijdstip($A80,F$8,F$11))","v":{"$error":"#NAME?"}},"W",null,null,{"$f":"(0.75*J$18*FLOOR(J$20,0.05)*0.9*J$35*J$38*o_Isol_Bij_Tijdstip($A80,J$8,J$11))+(0.75*L$18*FLOOR(L$20,0.05)*0.9*L$35*L$38*o_Isol_Bij_Tijdstip($A80,J$8,J$11))","v":{"$error":"#NAME?"}},"W",null,null,{"$f":"(0.75*N$18*FLOOR(N$20,0.05)*0.9*N$35*N$38*o_Isol_Bij_Tijdstip($A80,N$8,N$11))+(0.75*P$18*FLOOR(P$20,0.05)*0.9*P$35*P$38*o_Isol_Bij_Tijdstip($A80,N$8,N$11))","v":{"$error":"#NAME?"}},"W",null,null,{"$f":"(0.75*R$18*FLOOR(R$20,0.05)*0.9*R$35*R$38*o_Isol_Bij_Tijdstip($A80,R$8,R$11))+(0.75*T$18*FLOOR(T$20,0.05)*0.9*T$35*T$38*o_Isol_Bij_Tijdstip($A80,R$8,R$11))","v":0},"W",{"$error":"#NAME?"},"W"]
["13:00:00",{"$f":"(0.75*B$18*FLOOR(B$20,0.05)*0.9*B$35*B$38*o_Isol_Bij_Tijdstip($A81,B$8,B$11))+(0.75*D$18*FLOOR(D$20,0.05)*0.9*D$35*D$38*o_Isol_Bij_Tijdstip($A81,B$8,B$11))","v":{"$error":"#NAME?"}},"W",null,null,{"$f":"(0.75*F$18*FLOOR(F$20,0.05)*0.9*F$35*F$38*o_Isol_Bij_Tijdstip($A81,F$8,F$11))+(0.75*H$18*FLOOR(H$20,0.05)*0.9*H$35*H$38*o_Isol_Bij_Tijdstip($A81,F$8,F$11))","v":{"$error":"#NAME?"}},"W",null,null,{"$f":"(0.75*J$18*FLOOR(J$20,0.05)*0.9*J$35*J$38*o_Isol_Bij_Tijdstip($A81,J$8,J$11))+(0.75*L$18*FLOOR(L$20,0.05)*0.9*L$35*L$38*o_Isol_Bij_Tijdstip($A81,J$8,J$11))","v":{"$error":"#NAME?"}},"W",null,null,{"$f":"(0.75*N$18*FLOOR(N$20,0.05)*0.9*N$35*N$38*o_Isol_Bij_Tijdstip($A81,N$8,N$11))+(0.75*P$18*FLOOR(P$20,0.05)*0.9*P$35*P$38*o_Isol_Bij_Tijdstip($A81,N$8,N$11))","v":{"$error":"#NAME?"}},"W",null,null,{"$f":"(0.75*R$18*FLOOR(R$20,0.05)*0.9*R$35*R$38*o_Isol_Bij_Tijdstip($A81,R$8,R$11))+(0.75*T$18*FLOOR(T$20,0.05)*0.9*T$35*T$38*o_Isol_Bij_Tijdstip($A81,R$8,R$11))","v":0},"W",{"$error":"#NAME?"},"W"]
["14:00:00",{"$f":"(0.75*B$18*FLOOR(B$20,0.05)*0.9*B$35*B$38*o_Isol_Bij_Tijdstip($A82,B$8,B$11))+(0.75*D$18*FLOOR(D$20,0.05)*0.9*D$35*D$38*o_Isol_Bij_Tijdstip($A82,B$8,B$11))","v":{"$error":"#NAME?"}},"W",null,null,{"$f":"(0.75*F$18*FLOOR(F$20,0.05)*0.9*F$35*F$38*o_Isol_Bij_Tijdstip($A82,F$8,F$11))+(0.75*H$18*FLOOR(H$20,0.05)*0.9*H$35*H$38*o_Isol_Bij_Tijdstip($A82,F$8,F$11))","v":{"$error":"#NAME?"}},"W",null,null,{"$f":"(0.75*J$18*FLOOR(J$20,0.05)*0.9*J$35*J$38*o_Isol_Bij_Tijdstip($A82,J$8,J$11))+(0.75*L$18*FLOOR(L$20,0.05)*0.9*L$35*L$38*o_Isol_Bij_Tijdstip($A82,J$8,J$11))","v":{"$error":"#NAME?"}},"W",null,null,{"$f":"(0.75*N$18*FLOOR(N$20,0.05)*0.9*N$35*N$38*o_Isol_Bij_Tijdstip($A82,N$8,N$11))+(0.75*P$18*FLOOR(P$20,0.05)*0.9*P$35*P$38*o_Isol_Bij_Tijdstip($A82,N$8,N$11))","v":{"$error":"#NAME?"}},"W",null,null,{"$f":"(0.75*R$18*FLOOR(R$20,0.05)*0.9*R$35*R$38*o_Isol_Bij_Tijdstip($A82,R$8,R$11))+(0.75*T$18*FLOOR(T$20,0.05)*0.9*T$35*T$38*o_Isol_Bij_Tijdstip($A82,R$8,R$11))","v":0},"W",{"$error":"#NAME?"},"W"]
["15:00:00",{"$f":"(0.75*B$18*FLOOR(B$20,0.05)*0.9*B$35*B$38*o_Isol_Bij_Tijdstip($A83,B$8,B$11))+(0.75*D$18*FLOOR(D$20,0.05)*0.9*D$35*D$38*o_Isol_Bij_Tijdstip($A83,B$8,B$11))","v":{"$error":"#NAME?"}},"W",null,null,{"$f":"(0.75*F$18*FLOOR(F$20,0.05)*0.9*F$35*F$38*o_Isol_Bij_Tijdstip($A83,F$8,F$11))+(0.75*H$18*FLOOR(H$20,0.05)*0.9*H$35*H$38*o_Isol_Bij_Tijdstip($A83,F$8,F$11))","v":{"$error":"#NAME?"}},"W",null,null,{"$f":"(0.75*J$18*FLOOR(J$20,0.05)*0.9*J$35*J$38*o_Isol_Bij_Tijdstip($A83,J$8,J$11))+(0.75*L$18*FLOOR(L$20,0.05)*0.9*L$35*L$38*o_Isol_Bij_Tijdstip($A83,J$8,J$11))","v":{"$error":"#NAME?"}},"W",null,null,{"$f":"(0.75*N$18*FLOOR(N$20,0.05)*0.9*N$35*N$38*o_Isol_Bij_Tijdstip($A83,N$8,N$11))+(0.75*P$18*FLOOR(P$20,0.05)*0.9*P$35*P$38*o_Isol_Bij_Tijdstip($A83,N$8,N$11))","v":{"$error":"#NAME?"}},"W",null,null,{"$f":"(0.75*R$18*FLOOR(R$20,0.05)*0.9*R$35*R$38*o_Isol_Bij_Tijdstip($A83,R$8,R$11))+(0.75*T$18*FLOOR(T$20,0.05)*0.9*T$35*T$38*o_Isol_Bij_Tijdstip($A83,R$8,R$11))","v":0},"W",{"$error":"#NAME?"},"W"]
["16:00:00",{"$f":"(0.75*B$18*FLOOR(B$20,0.05)*0.9*B$35*B$38*o_Isol_Bij_Tijdstip($A84,B$8,B$11))+(0.75*D$18*FLOOR(D$20,0.05)*0.9*D$35*D$38*o_Isol_Bij_Tijdstip($A84,B$8,B$11))","v":{"$error":"#NAME?"}},"W",null,null,{"$f":"(0.75*F$18*FLOOR(F$20,0.05)*0.9*F$35*F$38*o_Isol_Bij_Tijdstip($A84,F$8,F$11))+(0.75*H$18*FLOOR(H$20,0.05)*0.9*H$35*H$38*o_Isol_Bij_Tijdstip($A84,F$8,F$11))","v":{"$error":"#NAME?"}},"W",null,null,{"$f":"(0.75*J$18*FLOOR(J$20,0.05)*0.9*J$35*J$38*o_Isol_Bij_Tijdstip($A84,J$8,J$11))+(0.75*L$18*FLOOR(L$20,0.05)*0.9*L$35*L$38*o_Isol_Bij_Tijdstip($A84,J$8,J$11))","v":{"$error":"#NAME?"}},"W",null,null,{"$f":"(0.75*N$18*FLOOR(N$20,0.05)*0.9*N$35*N$38*o_Isol_Bij_Tijdstip($A84,N$8,N$11))+(0.75*P$18*FLOOR(P$20,0.05)*0.9*P$35*P$38*o_Isol_Bij_Tijdstip($A84,N$8,N$11))","v":{"$error":"#NAME?"}},"W",null,null,{"$f":"(0.75*R$18*FLOOR(R$20,0.05)*0.9*R$35*R$38*o_Isol_Bij_Tijdstip($A84,R$8,R$11))+(0.75*T$18*FLOOR(T$20,0.05)*0.9*T$35*T$38*o_Isol_Bij_Tijdstip($A84,R$8,R$11))","v":0},"W",{"$error":"#NAME?"},"W"]
["17:00:00",{"$f":"(0.75*B$18*FLOOR(B$20,0.05)*0.9*B$35*B$38*o_Isol_Bij_Tijdstip($A85,B$8,B$11))+(0.75*D$18*FLOOR(D$20,0.05)*0.9*D$35*D$38*o_Isol_Bij_Tijdstip($A85,B$8,B$11))","v":{"$error":"#NAME?"}},"W",null,null,{"$f":"(0.75*F$18*FLOOR(F$20,0.05)*0.9*F$35*F$38*o_Isol_Bij_Tijdstip($A85,F$8,F$11))+(0.75*H$18*FLOOR(H$20,0.05)*0.9*H$35*H$38*o_Isol_Bij_Tijdstip($A85,F$8,F$11))","v":{"$error":"#NAME?"}},"W",null,null,{"$f":"(0.75*J$18*FLOOR(J$20,0.05)*0.9*J$35*J$38*o_Isol_Bij_Tijdstip($A85,J$8,J$11))+(0.75*L$18*FLOOR(L$20,0.05)*0.9*L$35*L$38*o_Isol_Bij_Tijdstip($A85,J$8,J$11))","v":{"$error":"#NAME?"}},"W",null,null,{"$f":"(0.75*N$18*FLOOR(N$20,0.05)*0.9*N$35*N$38*o_Isol_Bij_Tijdstip($A85,N$8,N$11))+(0.75*P$18*FLOOR(P$20,0.05)*0.9*P$35*P$38*o_Isol_Bij_Tijdstip($A85,N$8,N$11))","v":{"$error":"#NAME?"}},"W",null,null,{"$f":"(0.75*R$18*FLOOR(R$20,0.05)*0.9*R$35*R$38*o_Isol_Bij_Tijdstip($A85,R$8,R$11))+(0.75*T$18*FLOOR(T$20,0.05)*0.9*T$35*T$38*o_Isol_Bij_Tijdstip($A85,R$8,R$11))","v":0},"W",{"$error":"#NAME?"},"W"]
["18:00:00",{"$f":"(0.75*B$18*FLOOR(B$20,0.05)*0.9*B$35*B$38*o_Isol_Bij_Tijdstip($A86,B$8,B$11))+(0.75*D$18*FLOOR(D$20,0.05)*0.9*D$35*D$38*o_Isol_Bij_Tijdstip($A86,B$8,B$11))","v":{"$error":"#NAME?"}},"W",null,null,{"$f":"(0.75*F$18*FLOOR(F$20,0.05)*0.9*F$35*F$38*o_Isol_Bij_Tijdstip($A86,F$8,F$11))+(0.75*H$18*FLOOR(H$20,0.05)*0.9*H$35*H$38*o_Isol_Bij_Tijdstip($A86,F$8,F$11))","v":{"$error":"#NAME?"}},"W",null,null,{"$f":"(0.75*J$18*FLOOR(J$20,0.05)*0.9*J$35*J$38*o_Isol_Bij_Tijdstip($A86,J$8,J$11))+(0.75*L$18*FLOOR(L$20,0.05)*0.9*L$35*L$38*o_Isol_Bij_Tijdstip($A86,J$8,J$11))","v":{"$error":"#NAME?"}},"W",null,null,{"$f":"(0.75*N$18*FLOOR(N$20,0.05)*0.9*N$35*N$38*o_Isol_Bij_Tijdstip($A86,N$8,N$11))+(0.75*P$18*FLOOR(P$20,0.05)*0.9*P$35*P$38*o_Isol_Bij_Tijdstip($A86,N$8,N$11))","v":{"$error":"#NAME?"}},"W",null,null,{"$f":"(0.75*R$18*FLOOR(R$20,0.05)*0.9*R$35*R$38*o_Isol_Bij_Tijdstip($A86,R$8,R$11))+(0.75*T$18*FLOOR(T$20,0.05)*0.9*T$35*T$38*o_Isol_Bij_Tijdstip($A86,R$8,R$11))","v":0},"W",{"$error":"#NAME?"},"W"]
[]
["Maatgevende tijdstip",{"$f":"IF(MAX(T77:T86)=0,\"Geen glas aanwezig\",_xlfn.XLOOKUP(MAX(T77:T86),T77:T86,A77:A86,\"nvt\"))","v":{"$error":"#NAME?"}}]

{"sheet":"Ruimte 9","index":11,"n_rows":88,"n_cols":21,"rows_kept":88,"cut":false,"hidden":false,"merged":[[70,0,71,20],[0,0,0,20],[6,1,6,3],[6,5,6,7],[6,9,6,11],[6,13,6,15],[6,17,6,20],[41,1,41,3],[41,5,41,7],[41,9,41,11],[41,13,41,15],[41,17,41,19],[40,1,40,3],[40,5,40,7],[40,9,40,11],[40,13,40,15],[40,17,40,19],[55,1,55,3],[55,5,55,7],[55,9,55,11],[55,13,55,15],[55,17,55,19],[54,1,54,3],[54,5,54,7],[54,9,54,11],[54,13,54,15],[54,17,54,19],[56,5,56,7],[56,9,56,11],[56,13,56,15],[56,17,56,19],[57,1,57,3],[57,5,57,7],[57,9,57,11],[57,13,57,15],[57,17,57,19],[59,1,59,3],[60,1,60,3],[62,1,62,3],[63,1,63,3],[56,1,56,3]]}
["RUIMTE 9"]
[]
["Ruimtenaam",9]
["Type verblijfsruimte","Andere verblijfsruimte"]
["Vloeroppervlak verblijfsruimte Avr  (gebruiksoppervlak)",0,"m²"]
[]
[null,"Voorzijde woning",null,null,null,"Linker zijde woning",null,null,null,"Achterzijde woning",null,null,null,"Rechter zijde woning",null,null,null,"Platdak"]
["Orientatie gevel / dakvlak (Helling > 15°C)",{"$f":"'Projectgegevens en Resultaten'!$B$17","v":0},null,null,null,{"$f":"o_Orientatie(F9)","v":{"$error":"#NAME?"}},null,null,null,{"$f":"o_Orientatie(J9)","v":{"$error":"#NAME?"}},null,null,null,{"$f":"o_Orientatie(N9)","v":{"$error":"#NAME?"}},null,null,null,"Horizontaal"]
["Orientatiehoek gevel Ƴ",{"$f":"o_OrientatiehOEK(B8)","v":{"$error":"#NAME?"}},null,null,null,{"$f":"IF(B9+90>360,B9+90-360,B9+90)","v":{"$error":"#NAME?"}},null,null,null,{"$f":"IF(F9+90>360,F9+90-360,F9+90)","v":{"$error":"#NAME?"}},null,null,null,{"$f":"IF(J9+90>360,J9+90-360,J9+90)","v":{"$error":"#NAME?"}}]
["Grenst aan buitenlucht ja of nee","Nee",null,null,null,"Nee",null,null,null,"Nee",null,null,null,"Nee",null,null,null,"Nee"]
["Hellingshoek constructie ≥ 15° = hellenddak 90° = gevel",90,"°",null,null,90,"°",null,null,90,"°",null,null,90,"°",null,null,0,"°"]
["Type constructie",{"$f":"o_TypeConstructie(B10,B11)","v":"Woningscheidend"},null,null,null,{"$f":"o_TypeConstructie(F10,F11)","v":"Woningscheidend"},null,null,null,{"$f":"o_TypeConstructie(J10,J11)","v":"Woningscheidend"},null,null,null,{"$f":"o_TypeConstructie(N10,N11)","v":"Woningscheidend"},null,null,null,{"$f":"o_TypeConstructie(R10,R11)","v":"Woningscheidend"}]
["Gevel lengte (binnenwerks)",null,"m",null,null,null,"m",null,null,null,"m",null,null,null,"m",null,null,null,"m"]
["Gevel hoogte / Dak breedte (binnenwerks)",null,"m",null,null,null,"m",null,null,null,"m",null,null,null,"m",null,null,null,"m"]
["Constructie oppervlak (binnenwerks)",{"$f":"B13*B14","v":0},"m²",null,null,{"$f":"F13*F14","v":0},"m²",null,null,{"$f":"J13*J14","v":0},"m²",null,null,{"$f":"N13*N14","v":0},"m²",null,null,{"$f":"R13*R14","v":0},"m²"]
["Gesloten constructie oppervlak",{"$f":"MAX(0,B15-B18-D18)","v":0},"m²",null,null,{"$f":"MAX(0,F15-F18-H18)","v":0},"m²",null,null,{"$f":"MAX(0,J15-J18-L18)","v":0},"m²",null,null,{"$f":"MAX(0,N15-N18-P18)","v":0},"m²",null,null,{"$f":"MAX(0,R15-R18-T18)","v":0},"m²"]
[null,"Glasvlak type 1",null,"Glasvlak type 2",null,"Glasvlak type 1",null,"Glasvlak type 2",null,"Glasvlak type 1",null,"Glasvlak type 2",null,"Glasvlak type 1",null,"Glasvlak type 2",null,"Glasvlak type 1",null,"Glasvlak type 2"]
["Totaal oppervlak van raamtype Aw,k (inclusief kozijn)",null,"m²",null,"m²",null,"m²",null,"m²",null,"m²",null,"m²",null,"m²",null,"m²",null,"m²",null,"m²"]
["Warmtedoorgangscoefficient (U-waarde) van het raam Uw;wi;k",null,"W/m².K",null,"W/m².K",null,"W/m².K",null,"W/m².K",null,"W/m².K",null,"W/m².K",null,"W/m².K",null,"W/m².K",null,"W/m².K",null,"W/m².K"]
["Zontoetredingsfactor (g_waarde) van het glas Ggl;n;wi;k;C;juli",1,null,1,null,1,null,1,null,1,null,1,null,1,null,1,null,1,null,1]
["Beschaduwing situatie bij het raamtype","Minimale belemmering",null,"Minimale belemmering",null,"Minimale belemmering",null,"Minimale belemmering",null,"Minimale belemmering",null,"Minimale belemmering",null,"Minimale belemmering",null,"Minimale belemmering",null,"Minimale belemmering",null,"Minimale belemmering"]
[]
[null,"Overstek",null,"Overstek",null,"Overstek",null,"Overstek",null,"Overstek",null,"Overstek",null,"Overstek",null,"Overstek"]
["Hoogte verschil midden raam onderzijde overstek",0,"m",0,"m",0,"m",0,"m",0,"m",0,"m",0,"m",0,"m",0,null,0,"m"]
["Horizontale afstand glas tot eindpunt overstek",0,"m",0,"m",0,"m",0,"m",0,"m",0,"m",0,"m",0,"m",0,null,0,"m"]
["Overstekhoek",{"$f":"IFERROR(180/PI()*ATAN(B24/B25),0)","v":0},"°",{"$f":"IFERROR(180/PI()*ATAN(D24/D25),0)","v":0},"°",{"$f":"IFERROR(180/PI()*ATAN(F24/F25),0)","v":0},"°",{"$f":"IFERROR(180/PI()*ATAN(H24/H25),0)","v":0},"°",{"$f":"IFERROR(180/PI()*ATAN(J24/J25),0)","v":0},"°",{"$f":"IFERROR(180/PI()*ATAN(L24/L25),0)","v":0},"°",{"$f":"IFERROR(180/PI()*ATAN(N24/N25),0)","v":0},"°",{"$f":"IFERROR(180/PI()*ATAN(P24/P25),0)","v":0},"°",null,null,null,"°"]
["Relatieve hoogte van overstek",{"$f":"IFERROR(B24/B25,1)","v":1},null,{"$f":"IFERROR(D24/D25,1)","v":1},null,{"$f":"IFERROR(F24/F25,1)","v":1},null,{"$f":"IFERROR(H24/H25,1)","v":1},null,{"$f":"IFERROR(J24/J25,1)","v":1},null,{"$f":"IFERROR(L24/L25,1)","v":1},null,{"$f":"IFERROR(N24/N25,1)","v":1},null,{"$f":"IFERROR(P24/P25,1)","v":1}]
[]
[null,"Zijbelemmering",null,"Zijbelemmering",null,"Zijbelemmering",null,"Zijbelemmering",null,"Zijbelemmering",null,"Zijbelemmering",null,"Zijbelemmering",null,"Zijbelemmering"]
["Positie zijbelemmering irt zichtveld (naar buitengericht)","Links",null,"Links",null,"Links",null,"Links",null,"Links",null,"Links",null,"Links",null,"Links",null,"Links",null,"Links"]
["Horizontale afstand midden raam verste punt belemmering",0,"m",0,"m",0,"m",0,"m",0,"m",0,"m",0,"m",0,"m",0,null,0,"m"]
["Horizontale breedte glas tot eindpunt belemmering",0,"m",0,"m",0,"m",0,"m",0,"m",0,"m",0,"m",0,"m",0,null,0,"m"]
["Relatieve breedte van de zijbelemmering bb",{"$f":"IFERROR(B31/B32,999)","v":999},null,{"$f":"IFERROR(D31/D32,999)","v":999},null,{"$f":"IFERROR(F31/F32,999)","v":999},null,{"$f":"IFERROR(H31/H32,999)","v":999},null,{"$f":"IFERROR(J31/J32,999)","v":999},null,{"$f":"IFERROR(L31/L32,999)","v":999},null,{"$f":"IFERROR(N31/N32,999)","v":999},null,{"$f":"IFERROR(P31/P32,999)","v":999}]
[]
["De beschaduwingsreductiefactor Fsh;obst;wi;k;juli",{"$f":"IFERROR(o_Beschaduwingreductie(B21,B8,B27,B30,B33,B11),1)","v":1},null,{"$f":"IFERROR(o_Beschaduwingreductie(D21,B8,D27,D30,D33,B11),1)","v":1},null,{"$f":"IFERROR(o_Beschaduwingreductie(F21,F8,F27,F30,F33,F11),1)","v":1},null,{"$f":"IFERROR(o_Beschaduwingreductie(H21,F8,H27,H30,H33,F11),1)","v":1},null,{"$f":"IFERROR(o_Beschaduwingreductie(J21,J8,J27,J30,J33,J11),1)","v":1},null,{"$f":"IFERROR(o_Beschaduwingreductie(L21,J8,L27,L30,L33,J11),1)","v":1},null,{"$f":"IFERROR(o_Beschaduwingreductie(N21,N8,N27,N30,N33,N11),1)","v":1},null,{"$f":"IFERROR(o_Beschaduwingreductie(P21,N8,P27,P30,P33,N11),1)","v":1},null,{"$f":"o_Beschaduwingreductie(R21,R8,R27,R30,R33,R11)","v":1},null,{"$f":"o_Beschaduwingreductie(T21,R8,T27,T30,T33,R11)","v":1}]
[]
["Type zonwering","Geen zonwering",null,"Geen zonwering",null,"Geen zonwering",null,"Geen zonwering",null,"Geen zonwering",null,"Geen zonwering",null,"Geen zonwering",null,"Geen zonwering",null,"Geen zonwering",null,"Geen zonwering"]
["De reductiefactor voor zonwering Fc;wi;k",{"$f":"o_Zonweringreductie(B37,B8)","v":{"$error":"#NAME?"}},null,{"$f":"o_Zonweringreductie(D37,B8)","v":{"$error":"#NAME?"}},null,{"$f":"o_Zonweringreductie(F37,F8)","v":{"$error":"#NAME?"}},null,{"$f":"o_Zonweringreductie(H37,F8)","v":{"$error":"#NAME?"}},null,{"$f":"o_Zonweringreductie(J37,J8)","v":{"$error":"#NAME?"}},null,{"$f":"o_Zonweringreductie(L37,J8)","v":{"$error":"#NAME?"}},null,{"$f":"o_Zonweringreductie(N37,N8)","v":{"$error":"#NAME?"}},null,{"$f":"o_Zonweringreductie(P37,N8)","v":{"$error":"#NAME?"}},null,{"$f":"o_Zonweringreductie(R37,R8)","v":1},null,{"$f":"o_Zonweringreductie(T37,R8)","v":1}]
["Totaal opvallende zonnestraling van het raam Isol;wi;k;juli",{"$f":"IF(B10=\"Nee\",0,o_Isol_Bij_Tijdstip($B$52,B8,B11))","v":0},"W/m²",{"$f":"IF(B10=\"Nee\",0,o_Isol_Bij_Tijdstip($B$52,B8,B11))","v":0},"W/m²",{"$f":"IF(F10=\"Nee\",0,o_Isol_Bij_Tijdstip($B$52,F8,F11))","v":0},"W/m²",{"$f":"IF(F10=\"Nee\",0,o_Isol_Bij_Tijdstip($B$52,F8,F11))","v":0},"W/m²",{"$f":"IF(J10=\"Nee\",0,o_Isol_Bij_Tijdstip($B$52,J8,J11))","v":0},"W/m²",{"$f":"IF(J10=\"Nee\",0,o_Isol_Bij_Tijdstip($B$52,J8,J11))","v":0},"W/m²",{"$f":"IF(N10=\"Nee\",0,o_Isol_Bij_Tijdstip($B$52,N8,N11))","v":0},"W/m²",{"$f":"IF(N10=\"Nee\",0,o_Isol_Bij_Tijdstip($B$52,N8,N11))","v":0},"W/m²",{"$f":"IF(R10=\"Nee\",0,o_Isol_Bij_Tijdstip($B$52,R8,R11))","v":0},"W/m²",{"$f":"IF(R10=\"Nee\",0,o_Isol_Bij_Tijdstip($B$52,R8,R11))","v":0},"W/m²"]
[]
["Tijdstip maximale koellastbijdrage tmax;zi",{"$f":"VALUE(o_Tijdstip_Isol_Max_Orientatie(B8,B11))","v":{"$error":"#NAME?"}},null,null,null,{"$f":"VALUE(o_Tijdstip_Isol_Max_Orientatie(F8,F11))","v":{"$error":"#NAME?"}},null,null,null,{"$f":"VALUE(o_Tijdstip_Isol_Max_Orientatie(J8,J11))","v":{"$error":"#NAME?"}},null,null,null,{"$f":"VALUE(o_Tijdstip_Isol_Max_Orientatie(N8,N11))","v":{"$error":"#NAME?"}},null,null,null,{"$f":"o_Tijdstip_Isol_Max_Orientatie(R8,R11)","v":"12:00:00 PM"}]
["Buitenluchttemperatuur op tijdstip max koellast Θe",{"$f":"o_maxTemp(VALUE(B41))","v":{"$error":"#NAME?"}},null,null,"°C",{"$f":"o_maxTemp(VALUE(F41))","v":{"$error":"#NAME?"}},null,null,"°C",{"$f":"o_maxTemp(VALUE(J41))","v":{"$error":"#NAME?"}},null,null,"°C",{"$f":"o_maxTemp(VALUE(N41))","v":{"$error":"#NAME?"}},null,null,"°C",{"$f":"o_maxTemp(VALUE(R41))","v":29.5}]
[]
["Glasopppervlak",{"$f":"IF(B10=\"Ja\",B18+D18,0)","v":0},"m²",null,null,{"$f":"IF(F10=\"Ja\",F18+H18,0)","v":0},"m²",null,null,{"$f":"IF(J10=\"Ja\",J18+L18,0)","v":0},"m²",null,null,{"$f":"IF(N10=\"Ja\",N18+P18,0)","v":0},"m²",null,null,{"$f":"IF(R10=\"Ja\",R18+T18,0)","v":0},"m²"]
["Uitwendigescheidingsconstructie niet op Noord?",{"$f":"IF(B10=\"Ja\",IF(B8=\"Noord\",FALSE,TRUE),FALSE)","v":false},null,null,null,{"$f":"IF(F10=\"Ja\",IF(F8=\"Noord\",FALSE,TRUE),FALSE)","v":false},null,null,null,{"$f":"IF(J10=\"Ja\",IF(J8=\"Noord\",FALSE,TRUE),FALSE)","v":false},null,null,null,{"$f":"IF(N10=\"Ja\",IF(N8=\"Noord\",FALSE,TRUE),FALSE)","v":false},null,null,null,{"$f":"IF(R10=\"Ja\",IF(R8=\"Noord\",FALSE,TRUE),FALSE)","v":false}]
["De enige uitwendigescheidingscontructie?",{"$f":"IF(AND(B45=TRUE,COUNTIF($B$45:$R$45,TRUE)=1),TRUE,FALSE)","v":false},null,null,null,{"$f":"IF(AND(F45=TRUE,COUNTIF($B$45:$R$45,TRUE)=1),TRUE,FALSE)","v":false},null,null,null,{"$f":"IF(AND(J45=TRUE,COUNTIF($B$45:$R$45,TRUE)=1),TRUE,FALSE)","v":false},null,null,null,{"$f":"IF(AND(N45=TRUE,COUNTIF($B$45:$R$45,TRUE)=1),TRUE,FALSE)","v":false},null,null,null,{"$f":"IF(AND(R45=TRUE,COUNTIF($B$45:$R$45,TRUE)=1),TRUE,FALSE)","v":false}]
["Totaal glasoppervlak",{"$f":"IF(B8<>\"Noord\",B44,0)","v":0},"m²",null,null,{"$f":"IF(F8<>\"Noord\",F44,0)","v":{"$error":"#NAME?"}},"m²",null,null,{"$f":"IF(J8<>\"Noord\",J44,0)","v":{"$error":"#NAME?"}},"m²",null,null,{"$f":"IF(N8<>\"Noord\",N44,0)","v":{"$error":"#NAME?"}},"m²",null,null,{"$f":"R44","v":0},"m²"]
["Grootste glasoppervlak ",{"$f":"IF(AND(B45,B47=MAX($B$47:$R$47)),TRUE,FALSE)","v":{"$error":"#NAME?"}},null,null,null,{"$f":"IF(AND(F45,F47=MAX($B$47:$R$47)),TRUE,FALSE)","v":{"$error":"#NAME?"}},null,null,null,{"$f":"IF(AND(J45,J47=MAX($B$47:$R$47)),TRUE,FALSE)","v":{"$error":"#NAME?"}},null,null,null,{"$f":"IF(AND(N45,N47=MAX($B$47:$R$47)),TRUE,FALSE)","v":{"$error":"#NAME?"}},null,null,null,{"$f":"IF(AND(R45,R47=MAX($B$47:$R$47)),TRUE,FALSE)","v":{"$error":"#NAME?"}}]
["Dakvlak maatgevend?",{"$f":"IF(AND(B11<90,B15>3*(B18+D18),'Projectgegevens en Resultaten'!#REF!<65),TRUE,FALSE)","v":{"$error":"#REF!"}},null,null,null,{"$f":"IF(AND(F11<90,F15>3*(F18+H18),'Projectgegevens en Resultaten'!#REF!<65),TRUE,FALSE)","v":{"$error":"#REF!"}},null,null,null,{"$f":"IF(AND(J11<90,J15>3*(J18+L18),'Projectgegevens en Resultaten'!#REF!<65),TRUE,FALSE)","v":{"$error":"#REF!"}},null,null,null,{"$f":"IF(AND(N11<90,N15>3*(N18+P18),'Projectgegevens en Resultaten'!#REF!<65),TRUE,FALSE)","v":{"$error":"#REF!"}},null,null,null,{"$f":"IF(AND(R11<90,R15>3*(R18+T18),'Projectgegevens en Resultaten'!#REF!<65),TRUE,FALSE)","v":{"$error":"#REF!"}}]
["is er een maatgevend dakoppervlak",{"$f":"IF(COUNTIF($B$49:$R$49,TRUE)>0,TRUE,FALSE)","v":false},null,null,null,{"$f":"IF(COUNTIF($B$49:$R$49,TRUE)>0,TRUE,FALSE)","v":false},null,null,null,{"$f":"IF(COUNTIF($B$49:$R$49,TRUE)>0,TRUE,FALSE)","v":false},null,null,null,{"$f":"IF(COUNTIF($B$49:$R$49,TRUE)>0,TRUE,FALSE)","v":false},null,null,null,{"$f":"IF(COUNTIF($B$49:$R$49,TRUE)>0,TRUE,FALSE)","v":false}]
["Maatgevende tijdstip",{"$f":"IF(OR(B46,AND(B45,B50,B49),AND(B45,B48,NOT(B50))),B41)","v":{"$error":"#REF!"}},null,null,null,{"$f":"IF(OR(F46,AND(F45,F50,F49),AND(F45,F48,NOT(F50))),F41)","v":{"$error":"#REF!"}},null,null,null,{"$f":"IF(OR(J46,AND(J45,J50,J49),AND(J45,J48,NOT(J50))),J41)","v":{"$error":"#REF!"}},null,null,null,{"$f":"IF(OR(N46,AND(N45,N50,N49),AND(N45,N48,NOT(N50))),N41)","v":{"$error":"#REF!"}},null,null,null,{"$f":"IF(OR(R46,AND(R45,R50,R49),AND(R45,R48,NOT(R50))),R41)","v":{"$error":"#REF!"}}]
["Maatgevende tijdstip tmax;zi",{"$f":"IFERROR(B88,\"geen glas ingevoerd\")","v":"geen glas ingevoerd"}]
["Buitenluchttemperatuur op tijdstip max koellast Θe",{"$f":"o_maxTemp(VALUE(B52))","v":{"$error":"#NAME?"}},"°C"]
[]
["Koellastbijdrage transmissie ondoorzichtige delen Ptr;ntr;vr;zi",{"$f":"IF(B10=\"Nee\",0,B16*'Projectgegevens en Resultaten'!$B$16)","v":0},null,null,"W",{"$f":"IF(F10=\"Nee\",0,F16*'Projectgegevens en Resultaten'!$B$16)","v":0},null,null,"W",{"$f":"IF(J10=\"Nee\",0,J16*'Projectgegevens en Resultaten'!$B$16)","v":0},null,null,"W",{"$f":"IF(N10=\"Nee\",0,N16*'Projectgegevens en Resultaten'!$B$16)","v":0},null,null,"W",{"$f":"IF(R10=\"Nee\",0,R16*'Projectgegevens en Resultaten'!$B$16)","v":0},null,null,"W"]
["Koellastbijdrage zoninstraling transparante delen Psol;vr;zi",{"$f":"(0.75*B18*FLOOR(B20,0.05)*0.9*B35*B38*B39)+(0.75*D18*FLOOR(D20,0.05)*0.9*D35*D38*D39)","v":{"$error":"#NAME?"}},null,null,"W",{"$f":"(0.75*F18*FLOOR(F20,0.05)*0.9*F35*F38*F39)+(0.75*H18*FLOOR(H20,0.05)*0.9*H35*H38*H39)","v":{"$error":"#NAME?"}},null,null,"W",{"$f":"(0.75*J18*FLOOR(J20,0.05)*0.9*J35*J38*J39)+(0.75*L18*FLOOR(L20,0.05)*0.9*L35*L38*L39)","v":{"$error":"#NAME?"}},null,null,"W",{"$f":"(0.75*N18*FLOOR(N20,0.05)*0.9*N35*N38*N39)+(0.75*P18*FLOOR(P20,0.05)*0.9*P35*P38*P39)","v":{"$error":"#NAME?"}},null,null,"W",{"$f":"(0.75*R18*FLOOR(R20,0.05)*0.9*R35*R38*R39)+(0.75*T18*FLOOR(T20,0.05)*0.9*T35*T38*T39)","v":0},null,null,"W"]
["Koellastbijdrage transmissie transparante delen Ptr;gl;vr;zi",{"$f":"IF(B10=\"Nee\",0,IFERROR(B18*B19*($B$53-24),0)+IFERROR(D18*D19*($B$53-24),0))","v":0},null,null,"W",{"$f":"IF(F10=\"Nee\",0,IFERROR(F18*F19*($B$53-24),0)+IFERROR(H18*H19*($B$53-24),0))","v":0},null,null,"W",{"$f":"IF(J10=\"Nee\",0,IFERROR(J18*J19*($B$53-24),0)+IFERROR(L18*L19*($B$53-24),0))","v":0},null,null,"W",{"$f":"IF(N10=\"Nee\",0,IFERROR(N18*N19*($B$53-24),0)+IFERROR(P18*P19*($B$53-24),0))","v":0},null,null,"W",{"$f":"IF(R10=\"Nee\",0,IFERROR(R18*R19*($B$53-24),0)+IFERROR(T18*T19*($B$53-24),0))","v":0},null,null,"W"]
["Totaal koellastbijdrage per gevel",{"$f":"SUM(B55:D57)","v":{"$error":"#NAME?"}},null,null,"W",{"$f":"SUM(F55:H57)","v":{"$error":"#NAME?"}},null,null,"W",{"$f":"SUM(J55:L57)","v":{"$error":"#NAME?"}},null,null,"W",{"$f":"SUM(N55:P57)","v":{"$error":"#NAME?"}},null,null,"W",{"$f":"SUM(R55:R57)","v":0},null,null,"W"]
[]
["Koellast door interne warmtelast Pint;calc;woon/overig;zi",{"$f":"IF(B5=0,0,IF(B4=\"Woonvertrek\",2*'Projectgegevens en Resultaten'!$B$33*B5,'Projectgegevens en Resultaten'!$B$33*B5))","v":0},null,null,"W"]
["Koellast door buitenluchttoetreding Pv;calc;vr;zi",{"$f":"IFERROR(MAX((SUM('Projectgegevens en Resultaten'!$B$21:$B$23)/3600*1.205*1005*(B53-24))/SUM('Projectgegevens en Resultaten'!$B$40:$T$40)*B5,0),0)","v":0},{"$f":"IFERROR(MAX(SUM(C57:C59)/3600*1.205*1005*(C60-24),0),0)","v":0},{"$f":"IFERROR(MAX(SUM(D57:D59)/3600*1.205*1005*(D60-24),0),0)","v":0},"W"]
[]
["Totaal koellastbijdrage",{"$f":"IFERROR(SUM(B58:T58)+B60+B61,0)","v":0},null,null,"W"]
["Koelbehoefte verblijfsruimte",{"$f":"IFERROR(B63/B5,0)","v":0},null,null,"W/m²"]
[]
[]
[]
[]
[]
[]
["Onderstaande tabellen worden verborgen in de uiteindelijke versie. De tabellen dienen om vast te stellen welk tijdstip tot de hoogste zonbelasting leidt"]
[]
["Isol max voor de orientatie",{"$f":"o_Isol_Max_Orientatie(B8,B11)","v":{"$error":"#NAME?"}},"W/m²",null,null,{"$f":"o_Isol_Max_Orientatie(F8,F11)","v":{"$error":"#NAME?"}},"W/m²",null,null,{"$f":"o_Isol_Max_Orientatie(J8,J11)","v":{"$error":"#NAME?"}},"W/m²",null,null,{"$f":"o_Isol_Max_Orientatie(N8,N11)","v":{"$error":"#NAME?"}},"W/m²",null,null,{"$f":"o_Isol_Max_Orientatie(R8,R11)","v":914.11856204111336},"W/m²"]
["Tijdstip bij Isol max bij orientatie",{"$f":"VALUE(o_Tijdstip_Isol_Max_Orientatie(B8,B11))","v":{"$error":"#NAME?"}},null,null,null,{"$f":"VALUE(o_Tijdstip_Isol_Max_Orientatie(F8,F11))","v":{"$error":"#NAME?"}},null,null,null,{"$f":"VALUE(o_Tijdstip_Isol_Max_Orientatie(J8,J11))","v":{"$error":"#NAME?"}},null,null,null,{"$f":"VALUE(o_Tijdstip_Isol_Max_Orientatie(N8,N11))","v":{"$error":"#NAME?"}},null,null,null,{"$f":"VALUE(o_Tijdstip_Isol_Max_Orientatie(R8,R11))","v":"12:00:00"}]
[]
["Koellastbijdrage zoninstraling transparante delen Psol;vr;zi"]
["09:00:00",{"$f":"(0.75*B$18*FLOOR(B$20,0.05)*0.9*B$35*B$38*o_Isol_Bij_Tijdstip($A77,B$8,B$11))+(0.75*D$18*FLOOR(D$20,0.05)*0.9*D$35*D$38*o_Isol_Bij_Tijdstip($A77,B$8,B$11))","v":{"$error":"#NAME?"}},"W",null,null,{"$f":"(0.75*F$18*FLOOR(F$20,0.05)*0.9*F$35*F$38*o_Isol_Bij_Tijdstip($A77,F$8,F$11))+(0.75*H$18*FLOOR(H$20,0.05)*0.9*H$35*H$38*o_Isol_Bij_Tijdstip($A77,F$8,F$11))","v":{"$error":"#NAME?"}},"W",null,null,{"$f":"(0.75*J$18*FLOOR(J$20,0.05)*0.9*J$35*J$38*o_Isol_Bij_Tijdstip($A77,J$8,J$11))+(0.75*L$18*FLOOR(L$20,0.05)*0.9*L$35*L$38*o_Isol_Bij_Tijdstip($A77,J$8,J$11))","v":{"$error":"#NAME?"}},"W",null,null,{"$f":"(0.75*N$18*FLOOR(N$20,0.05)*0.9*N$35*N$38*o_Isol_Bij_Tijdstip($A77,N$8,N$11))+(0.75*P$18*FLOOR(P$20,0.05)*0.9*P$35*P$38*o_Isol_Bij_Tijdstip($A77,N$8,N$11))","v":{"$error":"#NAME?"}},"W",null,null,{"$f":"(0.75*R$18*FLOOR(R$20,0.05)*0.9*R$35*R$38*o_Isol_Bij_Tijdstip($A77,R$8,R$11))+(0.75*T$18*FLOOR(T$20,0.05)*0.9*T$35*T$38*o_Isol_Bij_Tijdstip($A77,R$8,R$11))","v":0},"W",{"$f":"B77+F77+J77+N77+R77","v":{"$error":"#NAME?"}},"W"]
["10:00:00",{"$f":"(0.75*B$18*FLOOR(B$20,0.05)*0.9*B$35*B$38*o_Isol_Bij_Tijdstip($A78,B$8,B$11))+(0.75*D$18*FLOOR(D$20,0.05)*0.9*D$35*D$38*o_Isol_Bij_Tijdstip($A78,B$8,B$11))","v":{"$error":"#NAME?"}},"W",null,null,{"$f":"(0.75*F$18*FLOOR(F$20,0.05)*0.9*F$35*F$38*o_Isol_Bij_Tijdstip($A78,F$8,F$11))+(0.75*H$18*FLOOR(H$20,0.05)*0.9*H$35*H$38*o_Isol_Bij_Tijdstip($A78,F$8,F$11))","v":{"$error":"#NAME?"}},"W",null,null,{"$f":"(0.75*J$18*FLOOR(J$20,0.05)*0.9*J$35*J$38*o_Isol_Bij_Tijdstip($A78,J$8,J$11))+(0.75*L$18*FLOOR(L$20,0.05)*0.9*L$35*L$38*o_Isol_Bij_Tijdstip($A78,J$8,J$11))","v":{"$error":"#NAME?"}},"W",null,null,{"$f":"(0.75*N$18*FLOOR(N$20,0.05)*0.9*N$35*N$38*o_Isol_Bij_Tijdstip($A78,N$8,N$11))+(0.75*P$18*FLOOR(P$20,0.05)*0.9*P$35*P$38*o_Isol_Bij_Tijdstip($A78,N$8,N$11))","v":{"$error":"#NAME?"}},"W",null,null,{"$f":"(0.75*R$18*FLOOR(R$20,0.05)*0.9*R$35*R$38*o_Isol_Bij_Tijdstip($A78,R$8,R$11))+(0.75*T$18*FLOOR(T$20,0.05)*0.9*T$35*T$38*o_Isol_Bij_Tijdstip($A78,R$8,R$11))","v":0},"W",{"$error":"#NAME?"},"W"]
["11:00:00",{"$f":"(0.75*B$18*FLOOR(B$20,0.05)*0.9*B$35*B$38*o_Isol_Bij_Tijdstip($A79,B$8,B$11))+(0.75*D$18*FLOOR(D$20,0.05)*0.9*D$35*D$38*o_Isol_Bij_Tijdstip($A79,B$8,B$11))","v":{"$error":"#NAME?"}},"W",null,null,{"$f":"(0.75*F$18*FLOOR(F$20,0.05)*0.9*F$35*F$38*o_Isol_Bij_Tijdstip($A79,F$8,F$11))+(0.75*H$18*FLOOR(H$20,0.05)*0.9*H$35*H$38*o_Isol_Bij_Tijdstip($A79,F$8,F$11))","v":{"$error":"#NAME?"}},"W",null,null,{"$f":"(0.75*J$18*FLOOR(J$20,0.05)*0.9*J$35*J$38*o_Isol_Bij_Tijdstip($A79,J$8,J$11))+(0.75*L$18*FLOOR(L$20,0.05)*0.9*L$35*L$38*o_Isol_Bij_Tijdstip($A79,J$8,J$11))","v":{"$error":"#NAME?"}},"W",null,null,{"$f":"(0.75*N$18*FLOOR(N$20,0.05)*0.9*N$35*N$38*o_Isol_Bij_Tijdstip($A79,N$8,N$11))+(0.75*P$18*FLOOR(P$20,0.05)*0.9*P$35*P$38*o_Isol_Bij_Tijdstip($A79,N$8,N$11))","v":{"$error":"#NAME?"}},"W",null,null,{"$f":"(0.75*R$18*FLOOR(R$20,0.05)*0.9*R$35*R$38*o_Isol_Bij_Tijdstip($A79,R$8,R$11))+(0.75*T$18*FLOOR(T$20,0.05)*0.9*T$35*T$38*o_Isol_Bij_Tijdstip($A79,R$8,R$11))","v":0},"W",{"$error":"#NAME?"},"W"]
["12:00:00",{"$f":"(0.75*B$18*FLOOR(B$20,0.05)*0.9*B$35*B$38*o_Isol_Bij_Tijdstip($A80,B$8,B$11))+(0.75*D$18*FLOOR(D$20,0.05)*0.9*D$35*D$38*o_Isol_Bij_Tijdstip($A80,B$8,B$11))","v":{"$error":"#NAME?"}},"W",null,null,{"$f":"(0.75*F$18*FLOOR(F$20,0.05)*0.9*F$35*F$38*o_Isol_Bij_Tijdstip($A80,F$8,F$11))+(0.75*H$18*FLOOR(H$20,0.05)*0.9*H$35*H$38*o_Isol_Bij_Tijdstip($A80,F$8,F$11))","v":{"$error":"#NAME?"}},"W",null,null,{"$f":"(0.75*J$18*FLOOR(J$20,0.05)*0.9*J$35*J$38*o_Isol_Bij_Tijdstip($A80,J$8,J$11))+(0.75*L$18*FLOOR(L$20,0.05)*0.9*L$35*L$38*o_Isol_Bij_Tijdstip($A80,J$8,J$11))","v":{"$error":"#NAME?"}},"W",null,null,{"$f":"(0.75*N$18*FLOOR(N$20,0.05)*0.9*N$35*N$38*o_Isol_Bij_Tijdstip($A80,N$8,N$11))+(0.75*P$18*FLOOR(P$20,0.05)*0.9*P$35*P$38*o_Isol_Bij_Tijdstip($A80,N$8,N$11))","v":{"$error":"#NAME?"}},"W",null,null,{"$f":"(0.75*R$18*FLOOR(R$20,0.05)*0.9*R$35*R$38*o_Isol_Bij_Tijdstip($A80,R$8,R$11))+(0.75*T$18*FLOOR(T$20,0.05)*0.9*T$35*T$38*o_Isol_Bij_Tijdstip($A80,R$8,R$11))","v":0},"W",{"$error":"#NAME?"},"W"]
["13:00:00",{"$f":"(0.75*B$18*FLOOR(B$20,0.05)*0.9*B$35*B$38*o_Isol_Bij_Tijdstip($A81,B$8,B$11))+(0.75*D$18*FLOOR(D$20,0.05)*0.9*D$35*D$38*o_Isol_Bij_Tijdstip($A81,B$8,B$11))","v":{"$error":"#NAME?"}},"W",null,null,{"$f":"(0.75*F$18*FLOOR(F$20,0.05)*0.9*F$35*F$38*o_Isol_Bij_Tijdstip($A81,F$8,F$11))+(0.75*H$18*FLOOR(H$20,0.05)*0.9*H$35*H$38*o_Isol_Bij_Tijdstip($A81,F$8,F$11))","v":{"$error":"#NAME?"}},"W",null,null,{"$f":"(0.75*J$18*FLOOR(J$20,0.05)*0.9*J$35*J$38*o_Isol_Bij_Tijdstip($A81,J$8,J$11))+(0.75*L$18*FLOOR(L$20,0.05)*0.9*L$35*L$38*o_Isol_Bij_Tijdstip($A81,J$8,J$11))","v":{"$error":"#NAME?"}},"W",null,null,{"$f":"(0.75*N$18*FLOOR(N$20,0.05)*0.9*N$35*N$38*o_Isol_Bij_Tijdstip($A81,N$8,N$11))+(0.75*P$18*FLOOR(P$20,0.05)*0.9*P$35*P$38*o_Isol_Bij_Tijdstip($A81,N$8,N$11))","v":{"$error":"#NAME?"}},"W",null,null,{"$f":"(0.75*R$18*FLOOR(R$20,0.05)*0.9*R$35*R$38*o_Isol_Bij_Tijdstip($A81,R$8,R$11))+(0.75*T$18*FLOOR(T$20,0.05)*0.9*T$35*T$38*o_Isol_Bij_Tijdstip($A81,R$8,R$11))","v":0},"W",{"$error":"#NAME?"},"W"]
["14:00:00",{"$f":"(0.75*B$18*FLOOR(B$20,0.05)*0.9*B$35*B$38*o_Isol_Bij_Tijdstip($A82,B$8,B$11))+(0.75*D$18*FLOOR(D$20,0.05)*0.9*D$35*D$38*o_Isol_Bij_Tijdstip($A82,B$8,B$11))","v":{"$error":"#NAME?"}},"W",null,null,{"$f":"(0.75*F$18*FLOOR(F$20,0.05)*0.9*F$35*F$38*o_Isol_Bij_Tijdstip($A82,F$8,F$11))+(0.75*H$18*FLOOR(H$20,0.05)*0.9*H$35*H$38*o_Isol_Bij_Tijdstip($A82,F$8,F$11))","v":{"$error":"#NAME?"}},"W",null,null,{"$f":"(0.75*J$18*FLOOR(J$20,0.05)*0.9*J$35*J$38*o_Isol_Bij_Tijdstip($A82,J$8,J$11))+(0.75*L$18*FLOOR(L$20,0.05)*0.9*L$35*L$38*o_Isol_Bij_Tijdstip($A82,J$8,J$11))","v":{"$error":"#NAME?"}},"W",null,null,{"$f":"(0.75*N$18*FLOOR(N$20,0.05)*0.9*N$35*N$38*o_Isol_Bij_Tijdstip($A82,N$8,N$11))+(0.75*P$18*FLOOR(P$20,0.05)*0.9*P$35*P$38*o_Isol_Bij_Tijdstip($A82,N$8,N$11))","v":{"$error":"#NAME?"}},"W",null,null,{"$f":"(0.75*R$18*FLOOR(R$20,0.05)*0.9*R$35*R$38*o_Isol_Bij_Tijdstip($A82,R$8,R$11))+(0.75*T$18*FLOOR(T$20,0.05)*0.9*T$35*T$38*o_Isol_Bij_Tijdstip($A82,R$8,R$11))","v":0},"W",{"$error":"#NAME?"},"W"]
["15:00:00",{"$f":"(0.75*B$18*FLOOR(B$20,0.05)*0.9*B$35*B$38*o_Isol_Bij_Tijdstip($A83,B$8,B$11))+(0.75*D$18*FLOOR(D$20,0.05)*0.9*D$35*D$38*o_Isol_Bij_Tijdstip($A83,B$8,B$11))","v":{"$error":"#NAME?"}},"W",null,null,{"$f":"(0.75*F$18*FLOOR(F$20,0.05)*0.9*F$35*F$38*o_Isol_Bij_Tijdstip($A83,F$8,F$11))+(0.75*H$18*FLOOR(H$20,0.05)*0.9*H$35*H$38*o_Isol_Bij_Tijdstip($A83,F$8,F$11))","v":{"$error":"#NAME?"}},"W",null,null,{"$f":"(0.75*J$18*FLOOR(J$20,0.05)*0.9*J$35*J$38*o_Isol_Bij_Tijdstip($A83,J$8,J$11))+(0.75*L$18*FLOOR(L$20,0.05)*0.9*L$35*L$38*o_Isol_Bij_Tijdstip($A83,J$8,J$11))","v":{"$error":"#NAME?"}},"W",null,null,{"$f":"(0.75*N$18*FLOOR(N$20,0.05)*0.9*N$35*N$38*o_Isol_Bij_Tijdstip($A83,N$8,N$11))+(0.75*P$18*FLOOR(P$20,0.05)*0.9*P$35*P$38*o_Isol_Bij_Tijdstip($A83,N$8,N$11))","v":{"$error":"#NAME?"}},"W",null,null,{"$f":"(0.75*R$18*FLOOR(R$20,0.05)*0.9*R$35*R$38*o_Isol_Bij_Tijdstip($A83,R$8,R$11))+(0.75*T$18*FLOOR(T$20,0.05)*0.9*T$35*T$38*o_Isol_Bij_Tijdstip($A83,R$8,R$11))","v":0},"W",{"$error":"#NAME?"},"W"]
["16:00:00",{"$f":"(0.75*B$18*FLOOR(B$20,0.05)*0.9*B$35*B$38*o_Isol_Bij_Tijdstip($A84,B$8,B$11))+(0.75*D$18*FLOOR(D$20,0.05)*0.9*D$35*D$38*o_Isol_Bij_Tijdstip($A84,B$8,B$11))","v":{"$error":"#NAME?"}},"W",null,null,{"$f":"(0.75*F$18*FLOOR(F$20,0.05)*0.9*F$35*F$38*o_Isol_Bij_Tijdstip($A84,F$8,F$11))+(0.75*H$18*FLOOR(H$20,0.05)*0.9*H$35*H$38*o_Isol_Bij_Tijdstip($A84,F$8,F$11))","v":{"$error":"#NAME?"}},"W",null,null,{"$f":"(0.75*J$18*FLOOR(J$20,0.05)*0.9*J$35*J$38*o_Isol_Bij_Tijdstip($A84,J$8,J$11))+(0.75*L$18*FLOOR(L$20,0.05)*0.9*L$35*L$38*o_Isol_Bij_Tijdstip($A84,J$8,J$11))","v":{"$error":"#NAME?"}},"W",null,null,{"$f":"(0.75*N$18*FLOOR(N$20,0.05)*0.9*N$35*N$38*o_Isol_Bij_Tijdstip($A84,N$8,N$11))+(0.75*P$18*FLOOR(P$20,0.05)*0.9*P$35*P$38*o_Isol_Bij_Tijdstip($A84,N$8,N$11))","v":{"$error":"#NAME?"}},"W",null,null,{"$f":"(0.75*R$18*FLOOR(R$20,0.05)*0.9*R$35*R$38*o_Isol_Bij_Tijdstip($A84,R$8,R$11))+(0.75*T$18*FLOOR(T$20,0.05)*0.9*T$35*T$38*o_Isol_Bij_Tijdstip($A84,R$8,R$11))","v":0},"W",{"$error":"#NAME?"},"W"]
["17:00:00",{"$f":"(0.75*B$18*FLOOR(B$20,0.05)*0.9*B$35*B$38*o_Isol_Bij_Tijdstip($A85,B$8,B$11))+(0.75*D$18*FLOOR(D$20,0.05)*0.9*D$35*D$38*o_Isol_Bij_Tijdstip($A85,B$8,B$11))","v":{"$error":"#NAME?"}},"W",null,null,{"$f":"(0.75*F$18*FLOOR(F$20,0.05)*0.9*F$35*F$38*o_Isol_Bij_Tijdstip($A85,F$8,F$11))+(0.75*H$18*FLOOR(H$20,0.05)*0.9*H$35*H$38*o_Isol_Bij_Tijdstip($A85,F$8,F$11))","v":{"$error":"#NAME?"}},"W",null,null,{"$f":"(0.75*J$18*FLOOR(J$20,0.05)*0.9*J$35*J$38*o_Isol_Bij_Tijdstip($A85,J$8,J$11))+(0.75*L$18*FLOOR(L$20,0.05)*0.9*L$35*L$38*o_Isol_Bij_Tijdstip($A85,J$8,J$11))","v":{"$error":"#NAME?"}},"W",null,null,{"$f":"(0.75*N$18*FLOOR(N$20,0.05)*0.9*N$35*N$38*o_Isol_Bij_Tijdstip($A85,N$8,N$11))+(0.75*P$18*FLOOR(P$20,0.05)*0.9*P$35*P$38*o_Isol_Bij_Tijdstip($A85,N$8,N$11))","v":{"$error":"#NAME?"}},"W",null,null,{"$f":"(0.75*R$18*FLOOR(R$20,0.05)*0.9*R$35*R$38*o_Isol_Bij_Tijdstip($A85,R$8,R$11))+(0.75*T$18*FLOOR(T$20,0.05)*0.9*T$35*T$38*o_Isol_Bij_Tijdstip($A85,R$8,R$11))","v":0},"W",{"$error":"#NAME?"},"W"]
["18:00:00",{"$f":"(0.75*B$18*FLOOR(B$20,0.05)*0.9*B$35*B$38*o_Isol_Bij_Tijdstip($A86,B$8,B$11))+(0.75*D$18*FLOOR(D$20,0.05)*0.9*D$35*D$38*o_Isol_Bij_Tijdstip($A86,B$8,B$11))","v":{"$error":"#NAME?"}},"W",null,null,{"$f":"(0.75*F$18*FLOOR(F$20,0.05)*0.9*F$35*F$38*o_Isol_Bij_Tijdstip($A86,F$8,F$11))+(0.75*H$18*FLOOR(H$20,0.05)*0.9*H$35*H$38*o_Isol_Bij_Tijdstip($A86,F$8,F$11))","v":{"$error":"#NAME?"}},"W",null,null,{"$f":"(0.75*J$18*FLOOR(J$20,0.05)*0.9*J$35*J$38*o_Isol_Bij_Tijdstip($A86,J$8,J$11))+(0.75*L$18*FLOOR(L$20,0.05)*0.9*L$35*L$38*o_Isol_Bij_Tijdstip($A86,J$8,J$11))","v":{"$error":"#NAME?"}},"W",null,null,{"$f":"(0.75*N$18*FLOOR(N$20,0.05)*0.9*N$35*N$38*o_Isol_Bij_Tijdstip($A86,N$8,N$11))+(0.75*P$18*FLOOR(P$20,0.05)*0.9*P$35*P$38*o_Isol_Bij_Tijdstip($A86,N$8,N$11))","v":{"$error":"#NAME?"}},"W",null,null,{"$f":"(0.75*R$18*FLOOR(R$20,0.05)*0.9*R$35*R$38*o_Isol_Bij_Tijdstip($A86,R$8,R$11))+(0.75*T$18*FLOOR(T$20,0.05)*0.9*T$35*T$38*o_Isol_Bij_Tijdstip($A86,R$8,R$11))","v":0},"W",{"$error":"#NAME?"},"W"]
[]
["Maatgevende tijdstip",{"$f":"IF(MAX(T77:T86)=0,\"Geen glas aanwezig\",_xlfn.XLOOKUP(MAX(T77:T86),T77:T86,A77:A86,\"nvt\"))","v":{"$error":"#NAME?"}}]

{"sheet":"Ruimte 10","index":12,"n_rows":88,"n_cols":21,"rows_kept":88,"cut":false,"hidden":false,"merged":[[70,0,71,20],[0,0,0,20],[6,1,6,3],[6,5,6,7],[6,9,6,11],[6,13,6,15],[6,17,6,20],[41,1,41,3],[41,5,41,7],[41,9,41,11],[41,13,41,15],[41,17,41,19],[40,1,40,3],[40,5,40,7],[40,9,40,11],[40,13,40,15],[40,17,40,19],[55,1,55,3],[55,5,55,7],[55,9,55,11],[55,13,55,15],[55,17,55,19],[54,1,54,3],[54,5,54,7],[54,9,54,11],[54,13,54,15],[54,17,54,19],[56,5,56,7],[56,9,56,11],[56,13,56,15],[56,17,56,19],[57,1,57,3],[57,5,57,7],[57,9,57,11],[57,13,57,15],[57,17,57,19],[59,1,59,3],[60,1,60,3],[62,1,62,3],[63,1,63,3],[56,1,56,3]]}
["RUIMTE 10"]
[]
["Ruimtenaam",10]
["Type verblijfsruimte","Andere verblijfsruimte"]
["Vloeroppervlak verblijfsruimte Avr  (gebruiksoppervlak)",0,"m²"]
[]
[null,"Voorzijde woning",null,null,null,"Linker zijde woning",null,null,null,"Achterzijde woning",null,null,null,"Rechter zijde woning",null,null,null,"Platdak"]
["Orientatie gevel / dakvlak (Helling > 15°C)",{"$f":"'Projectgegevens en Resultaten'!$B$17","v":0},null,null,null,{"$f":"o_Orientatie(F9)","v":{"$error":"#NAME?"}},null,null,null,{"$f":"o_Orientatie(J9)","v":{"$error":"#NAME?"}},null,null,null,{"$f":"o_Orientatie(N9)","v":{"$error":"#NAME?"}},null,null,null,"Horizontaal"]
["Orientatiehoek gevel Ƴ",{"$f":"o_OrientatiehOEK(B8)","v":{"$error":"#NAME?"}},null,null,null,{"$f":"IF(B9+90>360,B9+90-360,B9+90)","v":{"$error":"#NAME?"}},null,null,null,{"$f":"IF(F9+90>360,F9+90-360,F9+90)","v":{"$error":"#NAME?"}},null,null,null,{"$f":"IF(J9+90>360,J9+90-360,J9+90)","v":{"$error":"#NAME?"}}]
["Grenst aan buitenlucht ja of nee","Nee",null,null,null,"Nee",null,null,null,"Nee",null,null,null,"Nee",null,null,null,"Nee"]
["Hellingshoek constructie ≥ 15° = hellenddak 90° = gevel",90,"°",null,null,90,"°",null,null,90,"°",null,null,90,"°",null,null,0,"°"]
["Type constructie",{"$f":"o_TypeConstructie(B10,B11)","v":"Woningscheidend"},null,null,null,{"$f":"o_TypeConstructie(F10,F11)","v":"Woningscheidend"},null,null,null,{"$f":"o_TypeConstructie(J10,J11)","v":"Woningscheidend"},null,null,null,{"$f":"o_TypeConstructie(N10,N11)","v":"Woningscheidend"},null,null,null,{"$f":"o_TypeConstructie(R10,R11)","v":"Woningscheidend"}]
["Gevel lengte (binnenwerks)",null,"m",null,null,null,"m",null,null,null,"m",null,null,null,"m",null,null,null,"m"]
["Gevel hoogte / Dak breedte (binnenwerks)",null,"m",null,null,null,"m",null,null,null,"m",null,null,null,"m",null,null,null,"m"]
["Constructie oppervlak (binnenwerks)",{"$f":"B13*B14","v":0},"m²",null,null,{"$f":"F13*F14","v":0},"m²",null,null,{"$f":"J13*J14","v":0},"m²",null,null,{"$f":"N13*N14","v":0},"m²",null,null,{"$f":"R13*R14","v":0},"m²"]
["Gesloten constructie oppervlak",{"$f":"MAX(0,B15-B18-D18)","v":0},"m²",null,null,{"$f":"MAX(0,F15-F18-H18)","v":0},"m²",null,null,{"$f":"MAX(0,J15-J18-L18)","v":0},"m²",null,null,{"$f":"MAX(0,N15-N18-P18)","v":0},"m²",null,null,{"$f":"MAX(0,R15-R18-T18)","v":0},"m²"]
[null,"Glasvlak type 1",null,"Glasvlak type 2",null,"Glasvlak type 1",null,"Glasvlak type 2",null,"Glasvlak type 1",null,"Glasvlak type 2",null,"Glasvlak type 1",null,"Glasvlak type 2",null,"Glasvlak type 1",null,"Glasvlak type 2"]
["Totaal oppervlak van raamtype Aw,k (inclusief kozijn)",null,"m²",null,"m²",null,"m²",null,"m²",null,"m²",null,"m²",null,"m²",null,"m²",null,"m²",null,"m²"]
["Warmtedoorgangscoefficient (U-waarde) van het raam Uw;wi;k",null,"W/m².K",null,"W/m².K",null,"W/m².K",null,"W/m².K",null,"W/m².K",null,"W/m².K",null,"W/m².K",null,"W/m².K",null,"W/m².K",null,"W/m².K"]
["Zontoetredingsfactor (g_waarde) van het glas Ggl;n;wi;k;C;juli",1,null,1,null,1,null,1,null,1,null,1,null,1,null,1,null,1,null,1]
["Beschaduwing situatie bij het raamtype","Minimale belemmering",null,"Minimale belemmering",null,"Minimale belemmering",null,"Minimale belemmering",null,"Minimale belemmering",null,"Minimale belemmering",null,"Minimale belemmering",null,"Minimale belemmering",null,"Minimale belemmering",null,"Minimale belemmering"]
[]
[null,"Overstek",null,"Overstek",null,"Overstek",null,"Overstek",null,"Overstek",null,"Overstek",null,"Overstek",null,"Overstek"]
["Hoogte verschil midden raam onderzijde overstek",0,"m",0,"m",0,"m",0,"m",0,"m",0,"m",0,"m",0,"m",0,null,0,"m"]
["Horizontale afstand glas tot eindpunt overstek",0,"m",0,"m",0,"m",0,"m",0,"m",0,"m",0,"m",0,"m",0,null,0,"m"]
["Overstekhoek",{"$f":"IFERROR(180/PI()*ATAN(B24/B25),0)","v":0},"°",{"$f":"IFERROR(180/PI()*ATAN(D24/D25),0)","v":0},"°",{"$f":"IFERROR(180/PI()*ATAN(F24/F25),0)","v":0},"°",{"$f":"IFERROR(180/PI()*ATAN(H24/H25),0)","v":0},"°",{"$f":"IFERROR(180/PI()*ATAN(J24/J25),0)","v":0},"°",{"$f":"IFERROR(180/PI()*ATAN(L24/L25),0)","v":0},"°",{"$f":"IFERROR(180/PI()*ATAN(N24/N25),0)","v":0},"°",{"$f":"IFERROR(180/PI()*ATAN(P24/P25),0)","v":0},"°",null,null,null,"°"]
["Relatieve hoogte van overstek",{"$f":"IFERROR(B24/B25,1)","v":1},null,{"$f":"IFERROR(D24/D25,1)","v":1},null,{"$f":"IFERROR(F24/F25,1)","v":1},null,{"$f":"IFERROR(H24/H25,1)","v":1},null,{"$f":"IFERROR(J24/J25,1)","v":1},null,{"$f":"IFERROR(L24/L25,1)","v":1},null,{"$f":"IFERROR(N24/N25,1)","v":1},null,{"$f":"IFERROR(P24/P25,1)","v":1}]
[]
[null,"Zijbelemmering",null,"Zijbelemmering",null,"Zijbelemmering",null,"Zijbelemmering",null,"Zijbelemmering",null,"Zijbelemmering",null,"Zijbelemmering",null,"Zijbelemmering"]
["Positie zijbelemmering irt zichtveld (naar buitengericht)","Links",null,"Links",null,"Links",null,"Links",null,"Links",null,"Links",null,"Links",null,"Links",null,"Links",null,"Links"]
["Horizontale afstand midden raam verste punt belemmering",0,"m",0,"m",0,"m",0,"m",0,"m",0,"m",0,"m",0,"m",0,null,0,"m"]
["Horizontale breedte glas tot eindpunt belemmering",0,"m",0,"m",0,"m",0,"m",0,"m",0,"m",0,"m",0,"m",0,null,0,"m"]
["Relatieve breedte van de zijbelemmering bb",{"$f":"IFERROR(B31/B32,999)","v":999},null,{"$f":"IFERROR(D31/D32,999)","v":999},null,{"$f":"IFERROR(F31/F32,999)","v":999},null,{"$f":"IFERROR(H31/H32,999)","v":999},null,{"$f":"IFERROR(J31/J32,999)","v":999},null,{"$f":"IFERROR(L31/L32,999)","v":999},null,{"$f":"IFERROR(N31/N32,999)","v":999},null,{"$f":"IFERROR(P31/P32,999)","v":999}]
[]
["De beschaduwingsreductiefactor Fsh;obst;wi;k;juli",{"$f":"IFERROR(o_Beschaduwingreductie(B21,B8,B27,B30,B33,B11),1)","v":1},null,{"$f":"IFERROR(o_Beschaduwingreductie(D21,B8,D27,D30,D33,B11),1)","v":1},null,{"$f":"IFERROR(o_Beschaduwingreductie(F21,F8,F27,F30,F33,F11),1)","v":1},null,{"$f":"IFERROR(o_Beschaduwingreductie(H21,F8,H27,H30,H33,F11),1)","v":1},null,{"$f":"IFERROR(o_Beschaduwingreductie(J21,J8,J27,J30,J33,J11),1)","v":1},null,{"$f":"IFERROR(o_Beschaduwingreductie(L21,J8,L27,L30,L33,J11),1)","v":1},null,{"$f":"IFERROR(o_Beschaduwingreductie(N21,N8,N27,N30,N33,N11),1)","v":1},null,{"$f":"IFERROR(o_Beschaduwingreductie(P21,N8,P27,P30,P33,N11),1)","v":1},null,{"$f":"o_Beschaduwingreductie(R21,R8,R27,R30,R33,R11)","v":1},null,{"$f":"o_Beschaduwingreductie(T21,R8,T27,T30,T33,R11)","v":1}]
[]
["Type zonwering","Geen zonwering",null,"Geen zonwering",null,"Geen zonwering",null,"Geen zonwering",null,"Geen zonwering",null,"Geen zonwering",null,"Geen zonwering",null,"Geen zonwering",null,"Geen zonwering",null,"Geen zonwering"]
["De reductiefactor voor zonwering Fc;wi;k",{"$f":"o_Zonweringreductie(B37,B8)","v":{"$error":"#NAME?"}},null,{"$f":"o_Zonweringreductie(D37,B8)","v":{"$error":"#NAME?"}},null,{"$f":"o_Zonweringreductie(F37,F8)","v":{"$error":"#NAME?"}},null,{"$f":"o_Zonweringreductie(H37,F8)","v":{"$error":"#NAME?"}},null,{"$f":"o_Zonweringreductie(J37,J8)","v":{"$error":"#NAME?"}},null,{"$f":"o_Zonweringreductie(L37,J8)","v":{"$error":"#NAME?"}},null,{"$f":"o_Zonweringreductie(N37,N8)","v":{"$error":"#NAME?"}},null,{"$f":"o_Zonweringreductie(P37,N8)","v":{"$error":"#NAME?"}},null,{"$f":"o_Zonweringreductie(R37,R8)","v":1},null,{"$f":"o_Zonweringreductie(T37,R8)","v":1}]
["Totaal opvallende zonnestraling van het raam Isol;wi;k;juli",{"$f":"IF(B10=\"Nee\",0,o_Isol_Bij_Tijdstip($B$52,B8,B11))","v":0},"W/m²",{"$f":"IF(B10=\"Nee\",0,o_Isol_Bij_Tijdstip($B$52,B8,B11))","v":0},"W/m²",{"$f":"IF(F10=\"Nee\",0,o_Isol_Bij_Tijdstip($B$52,F8,F11))","v":0},"W/m²",{"$f":"IF(F10=\"Nee\",0,o_Isol_Bij_Tijdstip($B$52,F8,F11))","v":0},"W/m²",{"$f":"IF(J10=\"Nee\",0,o_Isol_Bij_Tijdstip($B$52,J8,J11))","v":0},"W/m²",{"$f":"IF(J10=\"Nee\",0,o_Isol_Bij_Tijdstip($B$52,J8,J11))","v":0},"W/m²",{"$f":"IF(N10=\"Nee\",0,o_Isol_Bij_Tijdstip($B$52,N8,N11))","v":0},"W/m²",{"$f":"IF(N10=\"Nee\",0,o_Isol_Bij_Tijdstip($B$52,N8,N11))","v":0},"W/m²",{"$f":"IF(R10=\"Nee\",0,o_Isol_Bij_Tijdstip($B$52,R8,R11))","v":0},"W/m²",{"$f":"IF(R10=\"Nee\",0,o_Isol_Bij_Tijdstip($B$52,R8,R11))","v":0},"W/m²"]
[]
["Tijdstip maximale koellastbijdrage tmax;zi",{"$f":"VALUE(o_Tijdstip_Isol_Max_Orientatie(B8,B11))","v":{"$error":"#NAME?"}},null,null,null,{"$f":"VALUE(o_Tijdstip_Isol_Max_Orientatie(F8,F11))","v":{"$error":"#NAME?"}},null,null,null,{"$f":"VALUE(o_Tijdstip_Isol_Max_Orientatie(J8,J11))","v":{"$error":"#NAME?"}},null,null,null,{"$f":"VALUE(o_Tijdstip_Isol_Max_Orientatie(N8,N11))","v":{"$error":"#NAME?"}},null,null,null,{"$f":"o_Tijdstip_Isol_Max_Orientatie(R8,R11)","v":"12:00:00 PM"}]
["Buitenluchttemperatuur op tijdstip max koellast Θe",{"$f":"o_maxTemp(VALUE(B41))","v":{"$error":"#NAME?"}},null,null,"°C",{"$f":"o_maxTemp(VALUE(F41))","v":{"$error":"#NAME?"}},null,null,"°C",{"$f":"o_maxTemp(VALUE(J41))","v":{"$error":"#NAME?"}},null,null,"°C",{"$f":"o_maxTemp(VALUE(N41))","v":{"$error":"#NAME?"}},null,null,"°C",{"$f":"o_maxTemp(VALUE(R41))","v":29.5}]
[]
["Glasopppervlak",{"$f":"IF(B10=\"Ja\",B18+D18,0)","v":0},"m²",null,null,{"$f":"IF(F10=\"Ja\",F18+H18,0)","v":0},"m²",null,null,{"$f":"IF(J10=\"Ja\",J18+L18,0)","v":0},"m²",null,null,{"$f":"IF(N10=\"Ja\",N18+P18,0)","v":0},"m²",null,null,{"$f":"IF(R10=\"Ja\",R18+T18,0)","v":0},"m²"]
["Uitwendigescheidingsconstructie niet op Noord?",{"$f":"IF(B10=\"Ja\",IF(B8=\"Noord\",FALSE,TRUE),FALSE)","v":false},null,null,null,{"$f":"IF(F10=\"Ja\",IF(F8=\"Noord\",FALSE,TRUE),FALSE)","v":false},null,null,null,{"$f":"IF(J10=\"Ja\",IF(J8=\"Noord\",FALSE,TRUE),FALSE)","v":false},null,null,null,{"$f":"IF(N10=\"Ja\",IF(N8=\"Noord\",FALSE,TRUE),FALSE)","v":false},null,null,null,{"$f":"IF(R10=\"Ja\",IF(R8=\"Noord\",FALSE,TRUE),FALSE)","v":false}]
["De enige uitwendigescheidingscontructie?",{"$f":"IF(AND(B45=TRUE,COUNTIF($B$45:$R$45,TRUE)=1),TRUE,FALSE)","v":false},null,null,null,{"$f":"IF(AND(F45=TRUE,COUNTIF($B$45:$R$45,TRUE)=1),TRUE,FALSE)","v":false},null,null,null,{"$f":"IF(AND(J45=TRUE,COUNTIF($B$45:$R$45,TRUE)=1),TRUE,FALSE)","v":false},null,null,null,{"$f":"IF(AND(N45=TRUE,COUNTIF($B$45:$R$45,TRUE)=1),TRUE,FALSE)","v":false},null,null,null,{"$f":"IF(AND(R45=TRUE,COUNTIF($B$45:$R$45,TRUE)=1),TRUE,FALSE)","v":false}]
["Totaal glasoppervlak",{"$f":"IF(B8<>\"Noord\",B44,0)","v":0},"m²",null,null,{"$f":"IF(F8<>\"Noord\",F44,0)","v":{"$error":"#NAME?"}},"m²",null,null,{"$f":"IF(J8<>\"Noord\",J44,0)","v":{"$error":"#NAME?"}},"m²",null,null,{"$f":"IF(N8<>\"Noord\",N44,0)","v":{"$error":"#NAME?"}},"m²",null,null,{"$f":"R44","v":0},"m²"]
["Grootste glasoppervlak ",{"$f":"IF(AND(B45,B47=MAX($B$47:$R$47)),TRUE,FALSE)","v":{"$error":"#NAME?"}},null,null,null,{"$f":"IF(AND(F45,F47=MAX($B$47:$R$47)),TRUE,FALSE)","v":{"$error":"#NAME?"}},null,null,null,{"$f":"IF(AND(J45,J47=MAX($B$47:$R$47)),TRUE,FALSE)","v":{"$error":"#NAME?"}},null,null,null,{"$f":"IF(AND(N45,N47=MAX($B$47:$R$47)),TRUE,FALSE)","v":{"$error":"#NAME?"}},null,null,null,{"$f":"IF(AND(R45,R47=MAX($B$47:$R$47)),TRUE,FALSE)","v":{"$error":"#NAME?"}}]
["Dakvlak maatgevend?",{"$f":"IF(AND(B11<90,B15>3*(B18+D18),'Projectgegevens en Resultaten'!#REF!<65),TRUE,FALSE)","v":{"$error":"#REF!"}},null,null,null,{"$f":"IF(AND(F11<90,F15>3*(F18+H18),'Projectgegevens en Resultaten'!#REF!<65),TRUE,FALSE)","v":{"$error":"#REF!"}},null,null,null,{"$f":"IF(AND(J11<90,J15>3*(J18+L18),'Projectgegevens en Resultaten'!#REF!<65),TRUE,FALSE)","v":{"$error":"#REF!"}},null,null,null,{"$f":"IF(AND(N11<90,N15>3*(N18+P18),'Projectgegevens en Resultaten'!#REF!<65),TRUE,FALSE)","v":{"$error":"#REF!"}},null,null,null,{"$f":"IF(AND(R11<90,R15>3*(R18+T18),'Projectgegevens en Resultaten'!#REF!<65),TRUE,FALSE)","v":{"$error":"#REF!"}}]
["is er een maatgevend dakoppervlak",{"$f":"IF(COUNTIF($B$49:$R$49,TRUE)>0,TRUE,FALSE)","v":false},null,null,null,{"$f":"IF(COUNTIF($B$49:$R$49,TRUE)>0,TRUE,FALSE)","v":false},null,null,null,{"$f":"IF(COUNTIF($B$49:$R$49,TRUE)>0,TRUE,FALSE)","v":false},null,null,null,{"$f":"IF(COUNTIF($B$49:$R$49,TRUE)>0,TRUE,FALSE)","v":false},null,null,null,{"$f":"IF(COUNTIF($B$49:$R$49,TRUE)>0,TRUE,FALSE)","v":false}]
["Maatgevende tijdstip",{"$f":"IF(OR(B46,AND(B45,B50,B49),AND(B45,B48,NOT(B50))),B41)","v":{"$error":"#REF!"}},null,null,null,{"$f":"IF(OR(F46,AND(F45,F50,F49),AND(F45,F48,NOT(F50))),F41)","v":{"$error":"#REF!"}},null,null,null,{"$f":"IF(OR(J46,AND(J45,J50,J49),AND(J45,J48,NOT(J50))),J41)","v":{"$error":"#REF!"}},null,null,null,{"$f":"IF(OR(N46,AND(N45,N50,N49),AND(N45,N48,NOT(N50))),N41)","v":{"$error":"#REF!"}},null,null,null,{"$f":"IF(OR(R46,AND(R45,R50,R49),AND(R45,R48,NOT(R50))),R41)","v":{"$error":"#REF!"}}]
["Maatgevende tijdstip tmax;zi",{"$f":"IFERROR(B88,\"geen glas ingevoerd\")","v":"geen glas ingevoerd"}]
["Buitenluchttemperatuur op tijdstip max koellast Θe",{"$f":"o_maxTemp(VALUE(B52))","v":{"$error":"#NAME?"}},"°C"]
[]
["Koellastbijdrage transmissie ondoorzichtige delen Ptr;ntr;vr;zi",{"$f":"IF(B10=\"Nee\",0,B16*'Projectgegevens en Resultaten'!$B$16)","v":0},null,null,"W",{"$f":"IF(F10=\"Nee\",0,F16*'Projectgegevens en Resultaten'!$B$16)","v":0},null,null,"W",{"$f":"IF(J10=\"Nee\",0,J16*'Projectgegevens en Resultaten'!$B$16)","v":0},null,null,"W",{"$f":"IF(N10=\"Nee\",0,N16*'Projectgegevens en Resultaten'!$B$16)","v":0},null,null,"W",{"$f":"IF(R10=\"Nee\",0,R16*'Projectgegevens en Resultaten'!$B$16)","v":0},null,null,"W"]
["Koellastbijdrage zoninstraling transparante delen Psol;vr;zi",{"$f":"(0.75*B18*FLOOR(B20,0.05)*0.9*B35*B38*B39)+(0.75*D18*FLOOR(D20,0.05)*0.9*D35*D38*D39)","v":{"$error":"#NAME?"}},null,null,"W",{"$f":"(0.75*F18*FLOOR(F20,0.05)*0.9*F35*F38*F39)+(0.75*H18*FLOOR(H20,0.05)*0.9*H35*H38*H39)","v":{"$error":"#NAME?"}},null,null,"W",{"$f":"(0.75*J18*FLOOR(J20,0.05)*0.9*J35*J38*J39)+(0.75*L18*FLOOR(L20,0.05)*0.9*L35*L38*L39)","v":{"$error":"#NAME?"}},null,null,"W",{"$f":"(0.75*N18*FLOOR(N20,0.05)*0.9*N35*N38*N39)+(0.75*P18*FLOOR(P20,0.05)*0.9*P35*P38*P39)","v":{"$error":"#NAME?"}},null,null,"W",{"$f":"(0.75*R18*FLOOR(R20,0.05)*0.9*R35*R38*R39)+(0.75*T18*FLOOR(T20,0.05)*0.9*T35*T38*T39)","v":0},null,null,"W"]
["Koellastbijdrage transmissie transparante delen Ptr;gl;vr;zi",{"$f":"IF(B10=\"Nee\",0,IFERROR(B18*B19*($B$53-24),0)+IFERROR(D18*D19*($B$53-24),0))","v":0},null,null,"W",{"$f":"IF(F10=\"Nee\",0,IFERROR(F18*F19*($B$53-24),0)+IFERROR(H18*H19*($B$53-24),0))","v":0},null,null,"W",{"$f":"IF(J10=\"Nee\",0,IFERROR(J18*J19*($B$53-24),0)+IFERROR(L18*L19*($B$53-24),0))","v":0},null,null,"W",{"$f":"IF(N10=\"Nee\",0,IFERROR(N18*N19*($B$53-24),0)+IFERROR(P18*P19*($B$53-24),0))","v":0},null,null,"W",{"$f":"IF(R10=\"Nee\",0,IFERROR(R18*R19*($B$53-24),0)+IFERROR(T18*T19*($B$53-24),0))","v":0},null,null,"W"]
["Totaal koellastbijdrage per gevel",{"$f":"SUM(B55:D57)","v":{"$error":"#NAME?"}},null,null,"W",{"$f":"SUM(F55:H57)","v":{"$error":"#NAME?"}},null,null,"W",{"$f":"SUM(J55:L57)","v":{"$error":"#NAME?"}},null,null,"W",{"$f":"SUM(N55:P57)","v":{"$error":"#NAME?"}},null,null,"W",{"$f":"SUM(R55:R57)","v":0},null,null,"W"]
[]
["Koellast door interne warmtelast Pint;calc;woon/overig;zi",{"$f":"IF(B5=0,0,IF(B4=\"Woonvertrek\",2*'Projectgegevens en Resultaten'!$B$33*B5,'Projectgegevens en Resultaten'!$B$33*B5))","v":0},null,null,"W"]
["Koellast door buitenluchttoetreding Pv;calc;vr;zi",{"$f":"IFERROR(MAX((SUM('Projectgegevens en Resultaten'!$B$21:$B$23)/3600*1.205*1005*(B53-24))/SUM('Projectgegevens en Resultaten'!$B$40:$T$40)*B5,0),0)","v":0},{"$f":"IFERROR(MAX(SUM(C57:C59)/3600*1.205*1005*(C60-24),0),0)","v":0},{"$f":"IFERROR(MAX(SUM(D57:D59)/3600*1.205*1005*(D60-24),0),0)","v":0},"W"]
[]
["Totaal koellastbijdrage",{"$f":"IFERROR(SUM(B58:T58)+B60+B61,0)","v":0},null,null,"W"]
["Koelbehoefte verblijfsruimte",{"$f":"IFERROR(B63/B5,0)","v":0},null,null,"W/m²"]
[]
[]
[]
[]
[]
[]
["Onderstaande tabellen worden verborgen in de uiteindelijke versie. De tabellen dienen om vast te stellen welk tijdstip tot de hoogste zonbelasting leidt"]
[]
["Isol max voor de orientatie",{"$f":"o_Isol_Max_Orientatie(B8,B11)","v":{"$error":"#NAME?"}},"W/m²",null,null,{"$f":"o_Isol_Max_Orientatie(F8,F11)","v":{"$error":"#NAME?"}},"W/m²",null,null,{"$f":"o_Isol_Max_Orientatie(J8,J11)","v":{"$error":"#NAME?"}},"W/m²",null,null,{"$f":"o_Isol_Max_Orientatie(N8,N11)","v":{"$error":"#NAME?"}},"W/m²",null,null,{"$f":"o_Isol_Max_Orientatie(R8,R11)","v":914.11856204111336},"W/m²"]
["Tijdstip bij Isol max bij orientatie",{"$f":"VALUE(o_Tijdstip_Isol_Max_Orientatie(B8,B11))","v":{"$error":"#NAME?"}},null,null,null,{"$f":"VALUE(o_Tijdstip_Isol_Max_Orientatie(F8,F11))","v":{"$error":"#NAME?"}},null,null,null,{"$f":"VALUE(o_Tijdstip_Isol_Max_Orientatie(J8,J11))","v":{"$error":"#NAME?"}},null,null,null,{"$f":"VALUE(o_Tijdstip_Isol_Max_Orientatie(N8,N11))","v":{"$error":"#NAME?"}},null,null,null,{"$f":"VALUE(o_Tijdstip_Isol_Max_Orientatie(R8,R11))","v":"12:00:00"}]
[]
["Koellastbijdrage zoninstraling transparante delen Psol;vr;zi"]
["09:00:00",{"$f":"(0.75*B$18*FLOOR(B$20,0.05)*0.9*B$35*B$38*o_Isol_Bij_Tijdstip($A77,B$8,B$11))+(0.75*D$18*FLOOR(D$20,0.05)*0.9*D$35*D$38*o_Isol_Bij_Tijdstip($A77,B$8,B$11))","v":{"$error":"#NAME?"}},"W",null,null,{"$f":"(0.75*F$18*FLOOR(F$20,0.05)*0.9*F$35*F$38*o_Isol_Bij_Tijdstip($A77,F$8,F$11))+(0.75*H$18*FLOOR(H$20,0.05)*0.9*H$35*H$38*o_Isol_Bij_Tijdstip($A77,F$8,F$11))","v":{"$error":"#NAME?"}},"W",null,null,{"$f":"(0.75*J$18*FLOOR(J$20,0.05)*0.9*J$35*J$38*o_Isol_Bij_Tijdstip($A77,J$8,J$11))+(0.75*L$18*FLOOR(L$20,0.05)*0.9*L$35*L$38*o_Isol_Bij_Tijdstip($A77,J$8,J$11))","v":{"$error":"#NAME?"}},"W",null,null,{"$f":"(0.75*N$18*FLOOR(N$20,0.05)*0.9*N$35*N$38*o_Isol_Bij_Tijdstip($A77,N$8,N$11))+(0.75*P$18*FLOOR(P$20,0.05)*0.9*P$35*P$38*o_Isol_Bij_Tijdstip($A77,N$8,N$11))","v":{"$error":"#NAME?"}},"W",null,null,{"$f":"(0.75*R$18*FLOOR(R$20,0.05)*0.9*R$35*R$38*o_Isol_Bij_Tijdstip($A77,R$8,R$11))+(0.75*T$18*FLOOR(T$20,0.05)*0.9*T$35*T$38*o_Isol_Bij_Tijdstip($A77,R$8,R$11))","v":0},"W",{"$f":"B77+F77+J77+N77+R77","v":{"$error":"#NAME?"}},"W"]
["10:00:00",{"$f":"(0.75*B$18*FLOOR(B$20,0.05)*0.9*B$35*B$38*o_Isol_Bij_Tijdstip($A78,B$8,B$11))+(0.75*D$18*FLOOR(D$20,0.05)*0.9*D$35*D$38*o_Isol_Bij_Tijdstip($A78,B$8,B$11))","v":{"$error":"#NAME?"}},"W",null,null,{"$f":"(0.75*F$18*FLOOR(F$20,0.05)*0.9*F$35*F$38*o_Isol_Bij_Tijdstip($A78,F$8,F$11))+(0.75*H$18*FLOOR(H$20,0.05)*0.9*H$35*H$38*o_Isol_Bij_Tijdstip($A78,F$8,F$11))","v":{"$error":"#NAME?"}},"W",null,null,{"$f":"(0.75*J$18*FLOOR(J$20,0.05)*0.9*J$35*J$38*o_Isol_Bij_Tijdstip($A78,J$8,J$11))+(0.75*L$18*FLOOR(L$20,0.05)*0.9*L$35*L$38*o_Isol_Bij_Tijdstip($A78,J$8,J$11))","v":{"$error":"#NAME?"}},"W",null,null,{"$f":"(0.75*N$18*FLOOR(N$20,0.05)*0.9*N$35*N$38*o_Isol_Bij_Tijdstip($A78,N$8,N$11))+(0.75*P$18*FLOOR(P$20,0.05)*0.9*P$35*P$38*o_Isol_Bij_Tijdstip($A78,N$8,N$11))","v":{"$error":"#NAME?"}},"W",null,null,{"$f":"(0.75*R$18*FLOOR(R$20,0.05)*0.9*R$35*R$38*o_Isol_Bij_Tijdstip($A78,R$8,R$11))+(0.75*T$18*FLOOR(T$20,0.05)*0.9*T$35*T$38*o_Isol_Bij_Tijdstip($A78,R$8,R$11))","v":0},"W",{"$error":"#NAME?"},"W"]
["11:00:00",{"$f":"(0.75*B$18*FLOOR(B$20,0.05)*0.9*B$35*B$38*o_Isol_Bij_Tijdstip($A79,B$8,B$11))+(0.75*D$18*FLOOR(D$20,0.05)*0.9*D$35*D$38*o_Isol_Bij_Tijdstip($A79,B$8,B$11))","v":{"$error":"#NAME?"}},"W",null,null,{"$f":"(0.75*F$18*FLOOR(F$20,0.05)*0.9*F$35*F$38*o_Isol_Bij_Tijdstip($A79,F$8,F$11))+(0.75*H$18*FLOOR(H$20,0.05)*0.9*H$35*H$38*o_Isol_Bij_Tijdstip($A79,F$8,F$11))","v":{"$error":"#NAME?"}},"W",null,null,{"$f":"(0.75*J$18*FLOOR(J$20,0.05)*0.9*J$35*J$38*o_Isol_Bij_Tijdstip($A79,J$8,J$11))+(0.75*L$18*FLOOR(L$20,0.05)*0.9*L$35*L$38*o_Isol_Bij_Tijdstip($A79,J$8,J$11))","v":{"$error":"#NAME?"}},"W",null,null,{"$f":"(0.75*N$18*FLOOR(N$20,0.05)*0.9*N$35*N$38*o_Isol_Bij_Tijdstip($A79,N$8,N$11))+(0.75*P$18*FLOOR(P$20,0.05)*0.9*P$35*P$38*o_Isol_Bij_Tijdstip($A79,N$8,N$11))","v":{"$error":"#NAME?"}},"W",null,null,{"$f":"(0.75*R$18*FLOOR(R$20,0.05)*0.9*R$35*R$38*o_Isol_Bij_Tijdstip($A79,R$8,R$11))+(0.75*T$18*FLOOR(T$20,0.05)*0.9*T$35*T$38*o_Isol_Bij_Tijdstip($A79,R$8,R$11))","v":0},"W",{"$error":"#NAME?"},"W"]
["12:00:00",{"$f":"(0.75*B$18*FLOOR(B$20,0.05)*0.9*B$35*B$38*o_Isol_Bij_Tijdstip($A80,B$8,B$11))+(0.75*D$18*FLOOR(D$20,0.05)*0.9*D$35*D$38*o_Isol_Bij_Tijdstip($A80,B$8,B$11))","v":{"$error":"#NAME?"}},"W",null,null,{"$f":"(0.75*F$18*FLOOR(F$20,0.05)*0.9*F$35*F$38*o_Isol_Bij_Tijdstip($A80,F$8,F$11))+(0.75*H$18*FLOOR(H$20,0.05)*0.9*H$35*H$38*o_Isol_Bij_Tijdstip($A80,F$8,F$11))","v":{"$error":"#NAME?"}},"W",null,null,{"$f":"(0.75*J$18*FLOOR(J$20,0.05)*0.9*J$35*J$38*o_Isol_Bij_Tijdstip($A80,J$8,J$11))+(0.75*L$18*FLOOR(L$20,0.05)*0.9*L$35*L$38*o_Isol_Bij_Tijdstip($A80,J$8,J$11))","v":{"$error":"#NAME?"}},"W",null,null,{"$f":"(0.75*N$18*FLOOR(N$20,0.05)*0.9*N$35*N$38*o_Isol_Bij_Tijdstip($A80,N$8,N$11))+(0.75*P$18*FLOOR(P$20,0.05)*0.9*P$35*P$38*o_Isol_Bij_Tijdstip($A80,N$8,N$11))","v":{"$error":"#NAME?"}},"W",null,null,{"$f":"(0.75*R$18*FLOOR(R$20,0.05)*0.9*R$35*R$38*o_Isol_Bij_Tijdstip($A80,R$8,R$11))+(0.75*T$18*FLOOR(T$20,0.05)*0.9*T$35*T$38*o_Isol_Bij_Tijdstip($A80,R$8,R$11))","v":0},"W",{"$error":"#NAME?"},"W"]
["13:00:00",{"$f":"(0.75*B$18*FLOOR(B$20,0.05)*0.9*B$35*B$38*o_Isol_Bij_Tijdstip($A81,B$8,B$11))+(0.75*D$18*FLOOR(D$20,0.05)*0.9*D$35*D$38*o_Isol_Bij_Tijdstip($A81,B$8,B$11))","v":{"$error":"#NAME?"}},"W",null,null,{"$f":"(0.75*F$18*FLOOR(F$20,0.05)*0.9*F$35*F$38*o_Isol_Bij_Tijdstip($A81,F$8,F$11))+(0.75*H$18*FLOOR(H$20,0.05)*0.9*H$35*H$38*o_Isol_Bij_Tijdstip($A81,F$8,F$11))","v":{"$error":"#NAME?"}},"W",null,null,{"$f":"(0.75*J$18*FLOOR(J$20,0.05)*0.9*J$35*J$38*o_Isol_Bij_Tijdstip($A81,J$8,J$11))+(0.75*L$18*FLOOR(L$20,0.05)*0.9*L$35*L$38*o_Isol_Bij_Tijdstip($A81,J$8,J$11))","v":{"$error":"#NAME?"}},"W",null,null,{"$f":"(0.75*N$18*FLOOR(N$20,0.05)*0.9*N$35*N$38*o_Isol_Bij_Tijdstip($A81,N$8,N$11))+(0.75*P$18*FLOOR(P$20,0.05)*0.9*P$35*P$38*o_Isol_Bij_Tijdstip($A81,N$8,N$11))","v":{"$error":"#NAME?"}},"W",null,null,{"$f":"(0.75*R$18*FLOOR(R$20,0.05)*0.9*R$35*R$38*o_Isol_Bij_Tijdstip($A81,R$8,R$11))+(0.75*T$18*FLOOR(T$20,0.05)*0.9*T$35*T$38*o_Isol_Bij_Tijdstip($A81,R$8,R$11))","v":0},"W",{"$error":"#NAME?"},"W"]
["14:00:00",{"$f":"(0.75*B$18*FLOOR(B$20,0.05)*0.9*B$35*B$38*o_Isol_Bij_Tijdstip($A82,B$8,B$11))+(0.75*D$18*FLOOR(D$20,0.05)*0.9*D$35*D$38*o_Isol_Bij_Tijdstip($A82,B$8,B$11))","v":{"$error":"#NAME?"}},"W",null,null,{"$f":"(0.75*F$18*FLOOR(F$20,0.05)*0.9*F$35*F$38*o_Isol_Bij_Tijdstip($A82,F$8,F$11))+(0.75*H$18*FLOOR(H$20,0.05)*0.9*H$35*H$38*o_Isol_Bij_Tijdstip($A82,F$8,F$11))","v":{"$error":"#NAME?"}},"W",null,null,{"$f":"(0.75*J$18*FLOOR(J$20,0.05)*0.9*J$35*J$38*o_Isol_Bij_Tijdstip($A82,J$8,J$11))+(0.75*L$18*FLOOR(L$20,0.05)*0.9*L$35*L$38*o_Isol_Bij_Tijdstip($A82,J$8,J$11))","v":{"$error":"#NAME?"}},"W",null,null,{"$f":"(0.75*N$18*FLOOR(N$20,0.05)*0.9*N$35*N$38*o_Isol_Bij_Tijdstip($A82,N$8,N$11))+(0.75*P$18*FLOOR(P$20,0.05)*0.9*P$35*P$38*o_Isol_Bij_Tijdstip($A82,N$8,N$11))","v":{"$error":"#NAME?"}},"W",null,null,{"$f":"(0.75*R$18*FLOOR(R$20,0.05)*0.9*R$35*R$38*o_Isol_Bij_Tijdstip($A82,R$8,R$11))+(0.75*T$18*FLOOR(T$20,0.05)*0.9*T$35*T$38*o_Isol_Bij_Tijdstip($A82,R$8,R$11))","v":0},"W",{"$error":"#NAME?"},"W"]
["15:00:00",{"$f":"(0.75*B$18*FLOOR(B$20,0.05)*0.9*B$35*B$38*o_Isol_Bij_Tijdstip($A83,B$8,B$11))+(0.75*D$18*FLOOR(D$20,0.05)*0.9*D$35*D$38*o_Isol_Bij_Tijdstip($A83,B$8,B$11))","v":{"$error":"#NAME?"}},"W",null,null,{"$f":"(0.75*F$18*FLOOR(F$20,0.05)*0.9*F$35*F$38*o_Isol_Bij_Tijdstip($A83,F$8,F$11))+(0.75*H$18*FLOOR(H$20,0.05)*0.9*H$35*H$38*o_Isol_Bij_Tijdstip($A83,F$8,F$11))","v":{"$error":"#NAME?"}},"W",null,null,{"$f":"(0.75*J$18*FLOOR(J$20,0.05)*0.9*J$35*J$38*o_Isol_Bij_Tijdstip($A83,J$8,J$11))+(0.75*L$18*FLOOR(L$20,0.05)*0.9*L$35*L$38*o_Isol_Bij_Tijdstip($A83,J$8,J$11))","v":{"$error":"#NAME?"}},"W",null,null,{"$f":"(0.75*N$18*FLOOR(N$20,0.05)*0.9*N$35*N$38*o_Isol_Bij_Tijdstip($A83,N$8,N$11))+(0.75*P$18*FLOOR(P$20,0.05)*0.9*P$35*P$38*o_Isol_Bij_Tijdstip($A83,N$8,N$11))","v":{"$error":"#NAME?"}},"W",null,null,{"$f":"(0.75*R$18*FLOOR(R$20,0.05)*0.9*R$35*R$38*o_Isol_Bij_Tijdstip($A83,R$8,R$11))+(0.75*T$18*FLOOR(T$20,0.05)*0.9*T$35*T$38*o_Isol_Bij_Tijdstip($A83,R$8,R$11))","v":0},"W",{"$error":"#NAME?"},"W"]
["16:00:00",{"$f":"(0.75*B$18*FLOOR(B$20,0.05)*0.9*B$35*B$38*o_Isol_Bij_Tijdstip($A84,B$8,B$11))+(0.75*D$18*FLOOR(D$20,0.05)*0.9*D$35*D$38*o_Isol_Bij_Tijdstip($A84,B$8,B$11))","v":{"$error":"#NAME?"}},"W",null,null,{"$f":"(0.75*F$18*FLOOR(F$20,0.05)*0.9*F$35*F$38*o_Isol_Bij_Tijdstip($A84,F$8,F$11))+(0.75*H$18*FLOOR(H$20,0.05)*0.9*H$35*H$38*o_Isol_Bij_Tijdstip($A84,F$8,F$11))","v":{"$error":"#NAME?"}},"W",null,null,{"$f":"(0.75*J$18*FLOOR(J$20,0.05)*0.9*J$35*J$38*o_Isol_Bij_Tijdstip($A84,J$8,J$11))+(0.75*L$18*FLOOR(L$20,0.05)*0.9*L$35*L$38*o_Isol_Bij_Tijdstip($A84,J$8,J$11))","v":{"$error":"#NAME?"}},"W",null,null,{"$f":"(0.75*N$18*FLOOR(N$20,0.05)*0.9*N$35*N$38*o_Isol_Bij_Tijdstip($A84,N$8,N$11))+(0.75*P$18*FLOOR(P$20,0.05)*0.9*P$35*P$38*o_Isol_Bij_Tijdstip($A84,N$8,N$11))","v":{"$error":"#NAME?"}},"W",null,null,{"$f":"(0.75*R$18*FLOOR(R$20,0.05)*0.9*R$35*R$38*o_Isol_Bij_Tijdstip($A84,R$8,R$11))+(0.75*T$18*FLOOR(T$20,0.05)*0.9*T$35*T$38*o_Isol_Bij_Tijdstip($A84,R$8,R$11))","v":0},"W",{"$error":"#NAME?"},"W"]
["17:00:00",{"$f":"(0.75*B$18*FLOOR(B$20,0.05)*0.9*B$35*B$38*o_Isol_Bij_Tijdstip($A85,B$8,B$11))+(0.75*D$18*FLOOR(D$20,0.05)*0.9*D$35*D$38*o_Isol_Bij_Tijdstip($A85,B$8,B$11))","v":{"$error":"#NAME?"}},"W",null,null,{"$f":"(0.75*F$18*FLOOR(F$20,0.05)*0.9*F$35*F$38*o_Isol_Bij_Tijdstip($A85,F$8,F$11))+(0.75*H$18*FLOOR(H$20,0.05)*0.9*H$35*H$38*o_Isol_Bij_Tijdstip($A85,F$8,F$11))","v":{"$error":"#NAME?"}},"W",null,null,{"$f":"(0.75*J$18*FLOOR(J$20,0.05)*0.9*J$35*J$38*o_Isol_Bij_Tijdstip($A85,J$8,J$11))+(0.75*L$18*FLOOR(L$20,0.05)*0.9*L$35*L$38*o_Isol_Bij_Tijdstip($A85,J$8,J$11))","v":{"$error":"#NAME?"}},"W",null,null,{"$f":"(0.75*N$18*FLOOR(N$20,0.05)*0.9*N$35*N$38*o_Isol_Bij_Tijdstip($A85,N$8,N$11))+(0.75*P$18*FLOOR(P$20,0.05)*0.9*P$35*P$38*o_Isol_Bij_Tijdstip($A85,N$8,N$11))","v":{"$error":"#NAME?"}},"W",null,null,{"$f":"(0.75*R$18*FLOOR(R$20,0.05)*0.9*R$35*R$38*o_Isol_Bij_Tijdstip($A85,R$8,R$11))+(0.75*T$18*FLOOR(T$20,0.05)*0.9*T$35*T$38*o_Isol_Bij_Tijdstip($A85,R$8,R$11))","v":0},"W",{"$error":"#NAME?"},"W"]
["18:00:00",{"$f":"(0.75*B$18*FLOOR(B$20,0.05)*0.9*B$35*B$38*o_Isol_Bij_Tijdstip($A86,B$8,B$11))+(0.75*D$18*FLOOR(D$20,0.05)*0.9*D$35*D$38*o_Isol_Bij_Tijdstip($A86,B$8,B$11))","v":{"$error":"#NAME?"}},"W",null,null,{"$f":"(0.75*F$18*FLOOR(F$20,0.05)*0.9*F$35*F$38*o_Isol_Bij_Tijdstip($A86,F$8,F$11))+(0.75*H$18*FLOOR(H$20,0.05)*0.9*H$35*H$38*o_Isol_Bij_Tijdstip($A86,F$8,F$11))","v":{"$error":"#NAME?"}},"W",null,null,{"$f":"(0.75*J$18*FLOOR(J$20,0.05)*0.9*J$35*J$38*o_Isol_Bij_Tijdstip($A86,J$8,J$11))+(0.75*L$18*FLOOR(L$20,0.05)*0.9*L$35*L$38*o_Isol_Bij_Tijdstip($A86,J$8,J$11))","v":{"$error":"#NAME?"}},"W",null,null,{"$f":"(0.75*N$18*FLOOR(N$20,0.05)*0.9*N$35*N$38*o_Isol_Bij_Tijdstip($A86,N$8,N$11))+(0.75*P$18*FLOOR(P$20,0.05)*0.9*P$35*P$38*o_Isol_Bij_Tijdstip($A86,N$8,N$11))","v":{"$error":"#NAME?"}},"W",null,null,{"$f":"(0.75*R$18*FLOOR(R$20,0.05)*0.9*R$35*R$38*o_Isol_Bij_Tijdstip($A86,R$8,R$11))+(0.75*T$18*FLOOR(T$20,0.05)*0.9*T$35*T$38*o_Isol_Bij_Tijdstip($A86,R$8,R$11))","v":0},"W",{"$error":"#NAME?"},"W"]
[]
["Maatgevende tijdstip",{"$f":"IF(MAX(T77:T86)=0,\"Geen glas aanwezig\",_xlfn.XLOOKUP(MAX(T77:T86),T77:T86,A77:A86,\"nvt\"))","v":{"$error":"#NAME?"}}]

{"sheet":"Tabellen","index":13,"n_rows":113,"n_cols":8,"rows_kept":113,"cut":false,"hidden":true,"merged":[[0,0,0,1],[38,3,38,4],[52,0,52,1],[34,3,36,3],[34,4,36,4],[16,0,16,1],[7,0,7,1],[26,2,27,2],[26,0,27,0],[26,1,27,1],[29,3,31,3],[29,4,31,4],[32,3,33,3],[32,4,33,4],[101,0,101,1],[109,0,109,1],[70,0,70,6],[82,0,82,1]]}
["Factor voor thermsiche isolatie van ondoorzichtige delen Tabel AA.4 NTA8800",null,null,"Ja of nee"]
["Bouwjaar","fiso",null,"Ja"]
["≤1974",17,null,"Nee"]
["1975 - 1991",10]
["1992 - 2014",3.2]
[">2015",2.2000000000000002]
[]
["Massa van de vloeren tabel 7.11 NTA8800"]
["Vloeren"]
["Houten vloeren","Licht"]
["Houtskeletbouw (hsb) vloeren","Licht"]
["Staalframebouw (sfb) vloeren","Licht"]
["Vloeren van elk type die aan de binnenzijde zijn geïsoleerd","Licht"]
["Staal-beton vloeren","Zwaar"]
["Niet-massieve betonnen vloeren","Zwaar"]
["Massieve betonnen vloeren","Zeer Zwaar"]
["Massa van de wanden  tabel 7.12 NTA8800"]
["Wanden"]
["Houtskeletbouw (hsb)","Licht"]
["Staalframebouw (sfb)","Licht"]
["Staalskeletbouw","Licht"]
["Wanden van elk type die aan de binnenzijde zijn geïsoleerd","Licht"]
["Dragend metselwerk","Zwaar"]
["Betonnen kolom-ligger skeletbouw","Zwaar"]
["Betonnen wand-vloer skeletbouw","Zeer Zwaar"]
[]
["Type bouwwijze vloeren","Type bouwwijze wanden","Zoek waarde","Specifieke interne warmtecapaciteit","Massa van de constructie","Specifieke werkzame massa"]
[null,null,null,"[kJ/m²K]","[kg/m²]","[kg/m²]"]
["Licht","Licht",{"$f":"A29&B29","v":"LichtLicht"},80,"<250 ",50]
["Licht","Zwaar","LichtZwaar",180,"250 tot 500",65]
["Zwaar","Licht","ZwaarLicht",null,null,65]
["Zeer zwaar","Licht","Zeer zwaarLicht",null,null,65]
["Zwaar","Zwaar","ZwaarZwaar",360,"500 tot 750",85]
["Licht","Zeer zwaar","LichtZeer zwaar",null,null,85]
["Zwaar","Zeer zwaar","ZwaarZeer zwaar",450,">750",100]
["Zeer zwaar","Zwaar","Zeer zwaarZwaar",null,null,100]
["Zeer zwaar","Zeer zwaar","Zeer zwaarZeer zwaar",null,null,100]
[]
[null,null,null,"Tijdstip maximale koellast Tabel AA.2 NTA8800"]
["Orientatie","Graden","Orientatie","SWM = 50","SWM > 50"]
["-",{"$f":"'Projectgegevens en Resultaten'!B26*B4","v":0},"-","nvt","nvt"]
["Noord",0,"Oost","nvt","nvt"]
["Noord-Oost",45,"ZuidOost","09:00:00","11:00:00"]
["Oost",90,"Zuid","09:00:00","11:00:00"]
["Zuid-Oost",135,"ZuidWest","11:00:00","13:00:00"]
["Zuid",180,"West","13:00:00","15:00:00"]
["Zuid-West",225,"NoordWest","15:00:00","16:30:00"]
["West",270,"Noord","17:00:00","18:00:00"]
["Noord-West",315,"NoordOost","17:00:00","18:00:00"]
["Horizontaal",null,"Horizontaal","13:00:00","16:00:00","dakvlak <15° helling"]
[]
[]
["Buitenluchttemperatuur voor aandeel ventilatie bij tijdstip"]
["nvt","nvt"]
["09:00:00",24.7]
["10:00:00",26.9]
["11:00:00",28.2]
["12:00:00",28.9]
["13:00:00",29.7]
["14:00:00",29.9]
["15:00:00",29.8]
["16:00:00",30.4]
["17:00:00",30.6]
["18:00:00",30.1]
["19:00:00",29.5]
["20:00:00",25.9]
["21:00:00",23.4]
[]
[]
[]
["Maandgemiddelde totale opvallende zonnestraling isol;mi over alla uren tabel 17,2 NTA8800"]
[null,"Helling 0° (platdak","Helling 30°","Helling 45°","Helling 60°","Helling 90° (gevel)","Helling 180° (vloer boven buitenlucht)"]
[null,0,30,45,60,90,180]
["Noord",0,0,0,0,0,0,"geen koellast op noord verwacht"]
["NoordOost",191,156.9,132.69999999999999,112.3,81.2,38.200000000000003]
["Oost",191,175,160.4,143.19999999999999,104.9,38.200000000000003]
["ZuidOost",191,190,179.1,161.80000000000001,113.2,38.200000000000003]
["Zuid",191,196.1,185,165.9,109.7,38.200000000000003]
["ZuidWest",191,193.2,182.5,165.4,117.1,38.200000000000003]
["West",191,180.2,166.8,150.6,112.7,38.200000000000003]
["NoordWest",191,162.1,139,119.2,88.5,38.200000000000003]
[]
["type zonwering tabel 7,5"]
["Type zonwering","Fc"]
["Geen zonwering",1]
["Screen (zwart, antraciet, donkerbruin)",0.12]
["Screen (overige kleuren)",0.2]
["Screen (wit)",0.25]
["Screen (onbekende kleur)",0.2]
["Jaloezieën (zwart, antraciet, donkerbruin)",0.05]
["Jaloezieën (overige kleuren)",0.1]
["Jaloezieën (wit)",0.2]
["Jaloezieën (onbekende kleur)",0.1]
["Rolluiken (overige kleuren)",0.11]
["Rolluiken (wit)",0.04]
["Rolluiken (onbekende kleur)",0.11]
["Gemetalisseerde weefsels (binnen toegepast)",0.45]
["Uitvalschermen"]
["Knikarmschermen"]
[]
[]
["Tabel 8.23 ISSO 82.1 Mogelijke beschaduwingssituaties bij ramen in gevels"]
["Minimale belemmering","tabel 17,5"]
["Constante overstek","tabel 17,9"]
["Zijbelemmering","tabel 17,11"]
["Volledige belemmering","tabel 17,14"]
["Constante overstek en één of meer zij)belemmering(en)","tabel 17,9"]
["Overige belemmering"]
[]
["Tabel 8.24 ISSO 82.1 Mogelijke beschaduwingssituaties bij ramen platte en hellende daken"]
["Minimale belemmering"]
["Volledige belemmering"]
["Overige belemmering"]

{"sheet":"Tabel AA","index":14,"n_rows":84,"n_cols":11,"rows_kept":84,"cut":false,"hidden":true,"merged":[[68,1,68,10],[83,0,83,10],[51,1,51,10],[52,1,52,10],[64,2,64,9],[65,1,66,1],[65,10,66,10],[67,1,67,10],[49,1,50,1],[49,10,50,10],[16,2,16,9],[17,1,18,1],[17,10,18,10],[19,1,19,10],[20,1,20,10],[32,2,32,9],[33,1,34,1],[33,10,34,10],[35,1,35,10],[36,1,36,10],[48,2,48,9],[15,2,15,9],[0,2,0,9],[1,1,2,1],[1,10,2,10],[3,1,3,10],[4,1,4,10]]}
["β","0°","30°"]
["γ","–","180°","225°","270°","315°","360°","45°","90°","135°"]
[null,null,"Z","ZW","W","NW","N","NO","O","ZO"]
["Tijdstip","Isol;mi"]
[null,"W/m2"]
["09:00:00",670.67010678020176,729.14423125982046,481.12465478963895,307.22043245684404,309.30229915004077,486.15072559540761,734.17030206558911,908.07452439838403,905.99265770518707]
["10:00:00",832.04329058743622,947.71594596764226,717.01174184771514,505.25170454218846,436.4819919360076,550.98696899337301,781.69117311330012,993.45121041882669,1062.2209230250076]
["11:00:00",877.41416210734178,1026.060785368235,862.30149764270584,655.99033088558713,527.98156851418116,553.26100742306357,717.02029514859237,923.33146190571131,1051.3402242771172]
["12:00:00",914.11856204111336,1078.0736468740965,992.86135217510764,807.6718304804283,630.98659198941527,566.30545313897915,651.51774783796816,836.70726953264739,1013.3925080236604]
["13:00:00",901.03645382306581,1056.998691020332,1061.1181462774291,918.51523971940753,712.72481997413331,564.29612392193587,560.17666866483864,702.77957522286033,908.56999496813467]
["14:00:00",823.47492133914693,1003.6584882715847,1096.5397386215777,981.9379811689347,726.98537115762201,481.02968976984783,388.14843941985475,502.75019687249778,757.70280688381035]
["15:00:00",819.78982507998001,904.6498973610901,1098.2437709189976,1081.3233415886295,863.80036739054003,573.09685648223717,379.5029829243299,396.42341225469795,613.94638645278735]
["16:00:00",601.56360474753376,608.83940444979839,828.85338814987017,882.2814639797482,737.82618972978844,480.10750589929211,260.09352219922044,206.66544636934231,351.12072061930212]
["17:00:00",446.48818054562867,403.0071605213144,643.54774914220684,745.90047698280443,650.10850421996747,412.28546933169162,171.74488071079921,80.405901271397298,165.1841256330386]
["18:00:00",308.21889730458372,202.75145754110244,473.86874274131901,633.30886093532479,587.67395327144061,363.69632974152563,92.579044541309003,60.724566990653521,60.724566990653521]
[]
["β",null,"45°"]
["γ",null,"180°","225°","270°","315°","360°","45°","90°","135°"]
[null,null,"Z","ZW","W","NW","N","NO","O","ZO"]
["Tijdstip","Isol;mi"]
[null,"W/m2"]
["09:00:00",null,694.12348902524195,343.37084024708031,97.433130470095591,100.37733458266737,350.47877774604575,701.23142652420745,947.169136301192,944.2249321886203]
["10:00:00",null,921.00035931143088,594.73534494853891,295.2614282224306,198.00636797426955,359.94085948801586,686.20587385090778,985.67979057701575,1082.9348508251769]
["11:00:00",null,1007.9491467846855,776.35854111868457,484.59049102174981,303.55876317351317,339.30928852763645,570.89989419363746,862.667944290572,1043.6996721388089]
["12:00:00",null,1062.8290813853423,942.3206985410992,680.4231653510974,430.55250480598198,339.0795610139578,459.58794385820084,721.48547704820271,971.35613759331818]
["13:00:00",null,1039.7293357521598,1045.5551252463356,843.8841607581586,552.85255814793959,342.9426831455682,337.11689365139233,538.78785813956961,829.8194607497885]
["14:00:00",null,1004.7618775370948,1136.1158014722259,974.04444181090628,613.48700297048924,265.65314260918319,134.29921867405218,296.37057833537187,656.92801717578914]
["15:00:00",null,866.64192149134908,1140.4250030692838,1116.4959024291018,808.87196219043085,397.75511443443384,123.97203285649937,147.90113349668138,455.52507373535241]
["16:00:00",null,559.34839735896924,870.49515701934365,946.05386646945556,741.76325846883731,377.29400051880577,90.673938668796524,90.673938668796524,194.8791394089377]
["17:00:00",null,346.98536246807373,687.16112519694707,831.90974105500254,696.43943400732439,360.10687262359494,86.355438655065726,86.355438655065726,86.355438655065726]
["18:00:00",null,133.02853641634343,516.44627814026421,741.92865567659646,677.39115034068743,360.63895747658637,65.163807477479338,65.163807477479338,65.163807477479338]
[]
["β",null,"60°"]
["γ",null,"180°","225°","270°","315°","360°","45°","90°","135°"]
[null,null,"Z","ZW","W","NW","N","NO","O","ZO"]
["Tijdstip","Isol;mi"]
[null,"W/m2"]
["09:00:00",null,618.46909834398207,188.88659062591316,103.49909401326977,103.49909401326977,197.59200062394308,627.1745083420119,928.38545707316689,924.77955818596456]
["10:00:00",null,839.04820955000014,439.45680649454522,106.71106830857451,106.71106830857451,151.89346459574253,551.48486765119765,918.26401127705049,1037.3766475328657]
["11:00:00",null,928.43709548324614,644.79768893133962,287.45626593919468,99.499443926587873,109.52385827492635,393.16326482683291,750.5046878189778,972.22236806026365]
["12:00:00",null,982.65645358094446,835.06442973276364,514.30676912820024,208.27895911434152,101.06418656526259,243.83996418214969,564.59762478671303,870.62543480057161]
["13:00:00",null,959.06194403413951,966.19704983893848,719.20157037344802,362.76210766370741,105.67606480010329,101.18191418081921,345.5364384607949,701.97590117053574]
["14:00:00",null,945.05985718807608,1105.9349018647886,907.4388353201258,465.84796125823829,110.87628146584561,110.87628146584561,110.87628146584561,519.05212061422844]
["15:00:00",null,777.23577291807374,1112.5501979544345,1083.2431546683583,706.48231154377333,202.96906071193939,110.66033181779692,110.66033181779692,273.72252208623991]
["16:00:00",null,478.13793460620178,859.2133327503567,951.75347463834839,701.5496002161218,255.16774576192242,99.615901550559727,99.615901550559727,99.615901550559727]
["17:00:00",null,272.69811756380591,689.32663833771562,866.60676325090049,700.69019946841263,288.76861983169306,91.801027784249698,91.801027784249698,91.801027784249698]
["18:00:00",null,69.010667416373238,527.67727839515294,803.8356638719581,724.79368519939624,336.85306148704888,69.010667416373238,69.010667416373238,69.010667416373238]
[]
["β",null,"90°"]
["γ",null,"180°","225°","270°","315°","360°","45°","90°","135°"]
[null,null,"Z","ZW","W","NW","N","NO","O","ZO"]
["Tijdstip","Isol;mi"]
[null,"W/m2"]
["09:00:00",null,368.3000205196924,125.30651485527932,125.30651485527932,125.30651485527932,125.30651485527932,378.35216213122953,726.16060679681959,721.99687341042568]
["10:00:00",null,535.15751355093516,138.428536576666,138.428536576666,138.428536576666,138.428536576666,203.10796784225118,626.62804245330426,764.16746766566621]
["11:00:00",null,610.70128131920501,283.18270586814708,137.90150337403352,137.90150337403352,137.90150337403352,137.90150337403352,405.24263439415779,661.26015913696926]
["12:00:00",null,653.43394204860169,483.0093526506239,141.66574831348413,141.66574831348413,141.66574831348413,141.66574831348413,170.70118736570316,524.07166434772921]
["13:00:00",null,633.46828512876982,641.70719564296405,356.50138252692091,140.76571803037345,140.76571803037345,140.76571803037345,140.76571803037345,336.61089302437495]
["14:00:00",null,663.38048396501642,849.1429846650027,619.93946975971653,140.75168546327944,140.75168546327944,140.75168546327944,140.75168546327944,171.46912118946813]
["15:00:00",null,471.68796349975548,858.87571061557014,825.03485195483404,389.98890355865501,140.13492262090233,140.13492262090233,140.13492262090233,140.13492262090233]
["16:00:00",null,244.4805485108962,684.50851591103958,791.36466757079575,502.45411907087623,115.74864996038983,115.74864996038983,115.74864996038983,115.74864996038983]
["17:00:00",null,99.755563310417017,571.55843174182473,776.26388742301992,584.679941897346,109.03387212079417,99.755563310417017,99.755563310417017,99.755563310417017]
["18:00:00",null,73.936852391729431,455.22655059173945,774.10678697975118,682.83697165198259,234.88172459215258,73.936852391729431,73.936852391729431,73.936852391729431]
[]
["β",null,"135°",null,null,null,null,null,null,null,"180°"]
["γ",null,"180°","225°","270°","315°","360°","45°","90°","135°","–"]
[null,null,"Z","ZW","W","NW","N","NO","O","ZO"]
["Tijdstip","Isol;mi"]
[null,"W/m2"]
["09:00:00",null,142.91282903093452,142.91282903093452,142.91282903093452,142.91282903093452,142.91282903093452,142.91282903093452,142.91282903093452,142.91282903093452,134.13402135604036]
["10:00:00",null,169.79584698760712,169.79584698760712,169.79584698760712,169.79584698760712,169.79584698760712,169.79584698760712,169.79584698760712,169.79584698760712,166.40865811748722]
["11:00:00",null,177.28881450798971,177.28881450798971,177.28881450798971,177.28881450798971,177.28881450798971,177.28881450798971,177.28881450798971,177.28881450798971,175.48283242146837]
["12:00:00",null,183.85077397743646,183.85077397743646,183.85077397743646,183.85077397743646,183.85077397743646,183.85077397743646,183.85077397743646,183.85077397743646,182.82371240822269]
["13:00:00",null,181.63282017320859,181.63282017320859,181.63282017320859,181.63282017320859,181.63282017320859,181.63282017320859,181.63282017320859,181.63282017320859,180.20729076461316]
["14:00:00",null,169.37974926036324,169.37974926036324,169.37974926036324,169.37974926036324,169.37974926036324,169.37974926036324,169.37974926036324,169.37974926036324,164.6949842678294]
["15:00:00",null,168.4553623934616,168.4553623934616,168.4553623934616,168.4553623934616,168.4553623934616,168.4553623934616,168.4553623934616,168.4553623934616,163.957965015996]
["16:00:00",null,128.02543555328339,152.55213336364858,228.11084281376046,128.02543555328339,128.02543555328339,128.02543555328339,128.02543555328339,128.02543555328339,120.31272094950678]
["17:00:00",null,100.97426139906827,167.39859015941255,312.14720601746814,176.67689896978979,100.97426139906827,100.97426139906827,100.97426139906827,100.97426139906827,89.297636109125733]
["18:00:00",null,72.478809047335943,160.42140077214964,385.90377830848195,321.36627297257292,72.478809047335943,72.478809047335943,72.478809047335943,72.478809047335943,61.643779460916733]
[]
[]
[]
[]
["Tabel AA.xxx geeft de totale opvallende zonnestraling voor verschillende oriëntaties (γ) en hellingshoeken (β). Voor tussenliggende oriëntaties moet de waarde behorend bij de dichtstbijzijnde oriëntatie worden genomen. Indien de oriëntatie precies tussen twee aangegeven oriëntaties in ligt, moet de hoogste, naastliggende waarde worden genomen. Voor tussenliggende hellingshoeken moet lineair geïnterpoleerd worden tussen de tabelwaarden."]